<svg width="170" height="154" viewBox="0 0 170 154" fill="none" xmlns="http://www.w3.org/2000/svg">
<path d="M23.1509 141.667C23.1509 135.284 17.9582 130.092 11.5758 130.092C5.19277 130.092 0 135.284 0 141.667C0 148.05 5.19277 153.242 11.5755 153.242C17.9582 153.243 23.1509 148.05 23.1509 141.667Z" fill="#1D2D50"/>
<path d="M44.6895 153.243C51.0725 153.243 56.265 148.05 56.265 141.667C56.265 135.284 51.0722 130.092 44.6895 130.092C38.3068 130.092 33.114 135.284 33.114 141.667C33.114 148.05 38.3068 153.243 44.6895 153.243Z" fill="#1D2D50"/>
<path d="M124.708 78.6312C122.422 78.4186 120.306 77.8149 118.26 77.231C117.018 76.8767 115.845 76.5419 114.779 76.3423C111.128 75.6599 108.15 75.3895 105.411 75.4931C96.7525 75.8203 89.8132 80.9137 86.3736 89.4681C80.0188 105.27 83.7028 124.21 95.9883 138.899C99.7298 143.372 103.818 147.089 108.139 149.948C110.053 151.214 113.254 153.332 115.332 153.332C115.335 153.332 115.338 153.332 115.341 153.332C119.911 153.318 123.436 151.137 123.707 150.965L126.562 148.951L129.29 150.968C129.598 151.163 133.108 153.318 137.651 153.331C137.654 153.331 137.657 153.331 137.66 153.331C139.738 153.332 142.939 151.214 144.853 149.948C149.174 147.089 153.262 143.371 157.004 138.898C169.289 124.21 172.973 105.27 166.618 89.4677C163.179 80.9134 156.24 75.8199 147.581 75.4928C144.84 75.3879 141.864 75.6595 138.213 76.342C137.147 76.5416 135.974 76.876 134.732 77.2307C132.686 77.8145 130.57 78.4183 128.283 78.6308L128.054 78.6521H124.938L124.708 78.6312Z" fill="#1D2D50"/>
<path d="M78.8862 39.0202C72.7775 42.5368 68.5541 48.701 66.3323 57.341C64.0159 66.3503 59.4296 73.7831 54.994 80.9712C50.5448 88.1821 46.3417 94.9936 44.5868 103.007C43.3328 108.733 43.3272 114.554 44.4819 120.134C44.5513 120.133 44.6197 120.129 44.6895 120.129C56.5662 120.129 66.228 129.791 66.228 141.667C66.228 143.93 65.8754 146.111 65.2254 148.161C71.2096 151.46 77.9775 153.272 85.0158 153.329C85.4173 153.332 85.8328 153.332 86.2406 153.329C89.2412 153.305 92.1919 152.959 95.0553 152.318C92.7216 150.188 90.4792 147.842 88.3451 145.291C73.699 127.781 69.4013 104.966 77.129 85.7508C82.0279 73.5686 92.4599 66.0122 105.034 65.5373C105.927 65.5038 106.832 65.5005 107.756 65.5264C106.633 62.9293 105.66 60.2164 104.921 57.341C102.7 48.7007 98.476 42.5368 92.3676 39.0199C90.2886 37.8233 87.9573 37.2248 85.6265 37.2248C83.2958 37.2248 80.9655 37.8233 78.8862 39.0202Z" fill="#1D2D50"/>
<path d="M125.424 68.6893H127.567C128.639 68.5665 129.843 68.2569 131.115 67.9003C131.384 63.2398 133.231 56.1006 141.135 50.9746L135.714 42.6155C126.155 48.8146 122.816 57.1846 121.699 63.1146C121.389 64.7602 121.23 66.3042 121.165 67.699C122.701 68.137 124.154 68.5442 125.424 68.6893Z" fill="#1D2D50"/>
<path d="M36.6364 41.588C39.2647 41.1945 41.9534 40.9882 44.6899 40.9882C45.3601 40.9882 46.027 41.0028 46.6915 41.0274C44.1669 26.187 32.5253 18.9272 31.972 18.5905L26.7656 27.0847C27.1306 27.3132 34.5159 32.06 36.6364 41.588Z" fill="#1D2D50"/>
<path d="M80.4316 27.8462C83.739 27.1 87.1762 27.0777 90.4923 27.7755C88.311 9.51244 74.0645 0.398192 73.4099 0L68.2297 8.51016C68.342 8.57923 78.3612 15.0519 80.4316 27.8462Z" fill="#1D2D50"/>
<path d="M0.515137 95.1261C0.515137 104.501 3.45392 113.2 8.45407 120.358C9.47396 120.209 10.5154 120.129 11.5758 120.129C18.2249 120.129 24.1785 123.158 28.1325 127.909C29.9691 125.702 32.239 123.871 34.8082 122.539C33.2921 115.492 33.2679 108.125 34.8553 100.876C36.9728 91.2056 41.8242 83.3434 46.5155 75.7399C50.7468 68.8826 54.7433 62.4053 56.6835 54.8602C56.8668 54.1469 57.0638 53.4561 57.2673 52.7786C53.2794 51.591 49.0584 50.9513 44.6899 50.9513C20.3318 50.9513 0.515137 70.768 0.515137 95.1261Z" fill="#1D2D50"/>
</svg>
