<svg width="41" height="42" viewBox="0 0 41 42" fill="none" xmlns="http://www.w3.org/2000/svg">
<g clip-path="url(#clip0)">
<path d="M15.1101 20.1256C10.4815 20.1256 6.71582 16.2007 6.71582 11.3761C6.71582 6.55142 10.4815 2.62622 15.1101 2.62622C19.7387 2.62622 23.5044 6.55142 23.5044 11.3761C23.5044 16.2007 19.7387 20.1256 15.1101 20.1256V20.1256ZM15.1101 5.25114C11.8701 5.25114 9.23408 7.99846 9.23408 11.3761C9.23408 14.7533 11.8701 17.5007 15.1101 17.5007C18.3502 17.5007 20.9862 14.7533 20.9862 11.3761C20.9862 7.99846 18.3502 5.25114 15.1101 5.25114V5.25114Z" fill="#FCDAB7"/>
<path d="M28.96 39.375H1.25913C0.564088 39.375 0 38.787 0 38.0625V31.9376C0 27.3546 3.57758 23.6255 7.9744 23.6255H22.2448C26.6416 23.6255 30.2191 27.3546 30.2191 31.9376V38.0625C30.2191 38.787 29.6551 39.375 28.96 39.375V39.375ZM2.51826 36.7501H27.7009V31.9376C27.7009 28.8019 25.253 26.2504 22.2448 26.2504H7.9744C4.96613 26.2504 2.51826 28.8019 2.51826 31.9376V36.7501Z" fill="#FCDAB7"/>
<path d="M39.0331 20.5634H24.763C24.068 20.5634 23.5039 19.9754 23.5039 19.2509C23.5039 18.5265 24.068 17.9385 24.763 17.9385H39.0331C39.7281 17.9385 40.2922 18.5265 40.2922 19.2509C40.2922 19.9754 39.7281 20.5634 39.0331 20.5634Z" fill="#FCDAB7"/>
<path d="M32.3184 27.563C31.9959 27.563 31.6738 27.4352 31.4285 27.1782C30.9366 26.6652 30.9366 25.834 31.4285 25.3213L37.2541 19.249L31.4285 13.1766C30.9366 12.6639 30.9366 11.8327 31.4285 11.3201C31.9203 10.8074 32.7177 10.8074 33.2099 11.3201L39.9251 18.3197C40.417 18.8324 40.417 19.6639 39.9251 20.1766L33.2099 27.1763C32.963 27.4352 32.6406 27.563 32.3184 27.563V27.563Z" fill="#FCDAB7"/>
</g>
<defs>
<clipPath id="clip0">
<rect width="40.2935" height="42" fill="white"/>
</clipPath>
</defs>
</svg>
