<svg width="1440" height="143" viewBox="0 0 1440 143" fill="none" xmlns="http://www.w3.org/2000/svg">
<path d="M0 143V24.7867C377.5 0 422.577 112.5 744 112.5C1039.2 112.5 1015 0 1440 0V70.0104V143L744 143L0 143Z" fill="url(#paint0_linear)"/>
<defs>
<linearGradient id="paint0_linear" x1="720" y1="143" x2="720" y2="0" gradientUnits="userSpaceOnUse">
<stop stop-color="#FCDAB7" stop-opacity="0.82"/>
<stop offset="0.703653" stop-color="#FCDAB7"/>
</linearGradient>
</defs>
</svg>
