{
    "id": "faq",
    "name": "FAQ",
    "description": "A FAQ plugin to make a FAQ to answer the most frequently asked questions.",
    "version": "0.1.2",
    "url": "https://azuriom.com/market/resources/4",
    "authors": [
        "Azuriom"
    ],
    "providers": [
        "\\Azuriom\\Plugin\\FAQ\\Providers\\FAQServiceProvider",
        "\\Azuriom\\Plugin\\FAQ\\Providers\\RouteServiceProvider"
    ],
    "apiId": 4
}
