{
    "id": "carbon",
    "name": "Carbon",
    "version": "0.1.1",
    "description": "A dark and white theme",
    "url" : "https://azuriom.com/market/resources/5",
    "authors": [
        "Azuriom"
    ],
	"apiId": 5
}
