{
    "welcome_message": null,
    "footer_title": "Endrium",
    "footer_description": "Serveur survie/semiRP modd\u00e9 sous launcher depuis 2020.",
    "footer_links": [
        {
            "name": "Discord",
            "value": "https://discord.gg/rvDJbqm"
        }
    ],
    "footer_social_twitter": null,
    "footer_social_discord": null,
    "footer_social_youtube": null,
    "footer_social_teamspeak": null,
    "footer_social_instagram": null
}