<svg xmlns="http://www.w3.org/2000/svg" viewBox="0 0 24.87 13.97">
  <defs>
    <style>.cls-1{fill:none;stroke:#FFF;stroke-width:2px;transition:0.25s ease;}</style>
  </defs>
  <polyline class="cls-1" points="0.71 13.26 12.56 1.41 24.16 13.02"/>
</svg>
