module ParkMe

go 1.17

require github.com/beego/beego/v2 v2.0.1

require (
	github.com/beego/beego v1.12.12
	github.com/go-sql-driver/mysql v1.8.0
	github.com/smartystreets/goconvey v1.8.1
)

require (
	filippo.io/edwards25519 v1.1.0 // indirect
	github.com/beorn7/perks v1.0.1 // indirect
	github.com/cespare/xxhash/v2 v2.1.1 // indirect
	github.com/golang/protobuf v1.4.2 // indirect
	github.com/gopherjs/gopherjs v1.17.2 // indirect
	github.com/hashicorp/golang-lru v0.5.4 // indirect
	github.com/jtolds/gls v4.20.0+incompatible // indirect
	github.com/matttproud/golang_protobuf_extensions v1.0.1 // indirect
	github.com/mitchellh/mapstructure v1.3.3 // indirect
	github.com/pkg/errors v0.9.1 // indirect
	github.com/prometheus/client_golang v1.7.0 // indirect
	github.com/prometheus/client_model v0.2.0 // indirect
	github.com/prometheus/common v0.10.0 // indirect
	github.com/prometheus/procfs v0.1.3 // indirect
	github.com/shiena/ansicolor v0.0.0-20151119151921-a422bbe96644 // indirect
	github.com/smarty/assertions v1.15.1 // indirect
	github.com/smartystreets/assertions v0.0.0-20180927180507-b2de0cb4f26d // indirect
	golang.org/x/crypto v0.0.0-20210711020723-a769d52b0f97 // indirect
	golang.org/x/mod v0.9.0 // indirect
	golang.org/x/net v0.8.0 // indirect
	golang.org/x/sys v0.6.0 // indirect
	golang.org/x/text v0.8.0 // indirect
	golang.org/x/tools v0.7.0 // indirect
	golang.org/x/xerrors v0.0.0-20200804184101-5ec99f83aff1 // indirect
	google.golang.org/protobuf v1.23.0 // indirect
	gopkg.in/yaml.v2 v2.2.8 // indirect
)
