{
	"ociVersion": "1.0.1",
	"process": {
		"terminal": false,
		"user": {
			"uid": 1000,
			"gid": 1000
		},
		"args": [
			"xpra", "start", ":10", "--start-child=xclock",
                        "--daemon=off", "--bind=/mnt/xpra.sock"
		],
		"env": [
			"PATH=/usr/local/sbin:/usr/local/bin:/usr/sbin:/usr/bin:/sbin:/bin",
			"TERM=xterm",
                        "HOME=/user",
                        "MOZ_DISABLE_CONTENT_SANDBOX=1"
		],
		"cwd": "/user",
		"capabilities": {
			"bounding": [
				"CAP_AUDIT_WRITE",
				"CAP_KILL",
				"CAP_NET_BIND_SERVICE"
			],
			"effective": [
				"CAP_AUDIT_WRITE",
				"CAP_KILL",
				"CAP_NET_BIND_SERVICE"
			],
			"inheritable": [
				"CAP_AUDIT_WRITE",
				"CAP_KILL",
				"CAP_NET_BIND_SERVICE"
			],
			"permitted": [
				"CAP_AUDIT_WRITE",
				"CAP_KILL",
				"CAP_NET_BIND_SERVICE"
			],
			"ambient": [
				"CAP_AUDIT_WRITE",
				"CAP_KILL",
				"CAP_NET_BIND_SERVICE"
			]
		},
		"rlimits": [
			{
				"type": "RLIMIT_NOFILE",
				"hard": 1024,
				"soft": 1024
			}
		],
		"noNewPrivileges": true
	},
	"root": {
		"path": "rootfs",
		"readonly": false
	},
	"hostname": "runc",
	"mounts": [
		{
			"destination": "/proc",
			"type": "proc",
			"source": "proc"
		},
		{
			"destination": "/dev",
			"type": "tmpfs",
			"source": "tmpfs",
			"options": [
				"nosuid",
				"strictatime",
				"mode=755",
				"size=65536k"
			]
		},
		{
			"destination": "/dev/pts",
			"type": "devpts",
			"source": "devpts",
			"options": [
				"nosuid",
				"noexec",
				"newinstance",
				"ptmxmode=0666",
				"mode=0620",
				"gid=5"
			]
		},
		{
			"destination": "/dev/shm",
			"type": "tmpfs",
			"source": "shm",
			"options": [
				"nosuid",
				"noexec",
				"nodev",
				"mode=1777",
				"size=65536k"
			]
		},
		{
			"destination": "/dev/mqueue",
			"type": "mqueue",
			"source": "mqueue",
			"options": [
				"nosuid",
				"noexec",
				"nodev"
			]
		},
		{
			"destination": "/sys",
			"type": "sysfs",
			"source": "sysfs",
			"options": [
				"nosuid",
				"noexec",
				"nodev",
				"ro"
			]
		},
		{
			"destination": "/sys/fs/cgroup",
			"type": "cgroup",
			"source": "cgroup",
			"options": [
				"nosuid",
				"noexec",
				"nodev",
				"relatime",
				"ro"
			]
		},
{
  "type": "bind",
  "source": "./bind",
  "destination": "/mnt",
  "options": ["bind", "rw"]
}
	],
	"linux": {
		"resources": {
			"devices": [
				{
					"allow": false,
					"access": "rwm"
				}
			]
		},
		"namespaces": [
			{
				"type": "pid"
			},
			{
				"type": "network"
			},
			{
				"type": "ipc"
			},
			{
				"type": "uts"
			},
			{
				"type": "mount"
			}
		],
		"maskedPaths": [
			"/proc/kcore",
			"/proc/latency_stats",
			"/proc/timer_list",
			"/proc/timer_stats",
			"/proc/sched_debug",
			"/sys/firmware"
		],
		"readonlyPaths": [
			"/proc/asound",
			"/proc/bus",
			"/proc/fs",
			"/proc/irq",
			"/proc/sys",
			"/proc/sysrq-trigger"
		]
	}
}
