{
    "$schema": "https://docs.renovatebot.com/renovate-schema.json",
    "extends": [
      "config:base"
    ],
    "assignees": ["michael.franz"],
    "packageRules": [
        {
            "matchPackageNames": [
                "docker.io/postgres"
            ],
            "allowedVersions": "<=14"
        },
        {
            "matchPackageNames": [
                "com.jlefebure:spring-boot-starter-minio"
            ],
            "allowedVersions": "<=1.4"
        },
        {
            "matchPackageNames": [
                "org.keycloak.keycloak-admin-client"
            ],
            "allowedVersions": "<=21.0.1"
        }
    ]
}
