{
    "$schema": "https://gitlab.com/empaia/integration/definitions/-/raw/main/ead/ead-schema.v3.json",
    "name": "Tutorial App 06 v3",
    "name_short": "TA06v3",
    "namespace": "org.empaia.vendor_name.tutorial_app_06.v3.0",
    "description": "Human readable description",
    "io": {
        "my_wsi": {
            "type": "wsi"
        },
        "my_rectangles": {
            "type": "collection",
            "items": {
                "type": "rectangle",
                "reference": "io.my_wsi"
            }
        },
        "my_cells": {
            "type": "collection",
            "items": {
                "type": "collection",
                "reference": "io.my_rectangles.items",
                "items": {
                    "type": "point",
                    "reference": "io.my_wsi"
                }
            }
        }
    },
    "modes": {
        "standalone": {
            "inputs": [
                "my_wsi",
                "my_rectangles"
            ],
            "outputs": [
                "my_cells"
            ]
        }
    }
}