{
    "item_type": "class",
    "items": [
        {
            "value": "org.empaia.global.v1.classes.roi",
            "reference_id": "32658887-cb57-4fd5-9a52-9f324a20b077",
            "reference_type": "annotation"
        }
    ]
}