{
  "name": "portal-v2",
  "$schema": "../../node_modules/nx/schemas/project-schema.json",
  "projectType": "application",
  "sourceRoot": "apps/portal-v2/src",
  "prefix": "app",
  "tags": [],
  "namedInputs": {
    "projectSpecificFiles": ["{workspaceRoot}/tools/docker/portal-v2/*"]
  },
  "targets": {
    "build": {
      "executor": "@angular-devkit/build-angular:browser",
      "outputs": ["{options.outputPath}"],
      "options": {
        "outputPath": "dist/apps/portal-v2",
        "index": "apps/portal-v2/src/index.html",
        "main": "apps/portal-v2/src/main.ts",
        "polyfills": "apps/portal-v2/src/polyfills.ts",
        "tsConfig": "apps/portal-v2/tsconfig.app.json",
        "inlineStyleLanguage": "scss",
        "assets": [
          "apps/portal-v2/src/favicon.ico",
          "apps/portal-v2/src/assets"
        ],
        "styles": ["apps/portal-v2/src/styles/styles.scss"],
        "stylePreprocessorOptions": {
          "includePaths": ["apps/portal-v2/src/styles"]
        },
        "scripts": [],
        "allowedCommonJsDependencies": [
          "lodash",
          "@messageformat/core",
          "flat",
          "event-source-polyfill",
          "exceljs",
          "file-saver"
        ],
        "aot": true
      },
      "configurations": {
        "production": {
          "budgets": [
            {
              "type": "initial",
              "maximumWarning": "2mb",
              "maximumError": "5mb"
            },
            {
              "type": "anyComponentStyle",
              "maximumWarning": "6kb",
              "maximumError": "10kb"
            }
          ],
          "fileReplacements": [
            {
              "replace": "apps/portal-v2/src/environments/environment.ts",
              "with": "apps/portal-v2/src/environments/environment.prod.ts"
            }
          ],
          "outputHashing": "all"
        },
        "development": {
          "buildOptimizer": false,
          "optimization": false,
          "vendorChunk": true,
          "extractLicenses": false,
          "sourceMap": true,
          "namedChunks": true
        }
      },
      "defaultConfiguration": "production"
    },
    "serve": {
      "executor": "@angular-devkit/build-angular:dev-server",
      "configurations": {
        "production-default": {
          "buildTarget": "portal-v2:build:production"
        },
        "production": {
          "host": "portal-v2.localdev",
          "buildTarget": "portal-v2:build:production"
        },
        "development-default": {
          "buildTarget": "portal-v2:build:development"
        },
        "development": {
          "host": "portal-v2.localdev",
          "buildTarget": "portal-v2:build:development"
        }
      },
      "defaultConfiguration": "development"
    },
    "extract-i18n": {
      "executor": "@angular-devkit/build-angular:extract-i18n",
      "options": {
        "buildTarget": "portal-v2:build"
      }
    },
    "lint": {
      "executor": "@nx/eslint:lint"
    },
    "test": {
      "executor": "@nx/jest:jest",
      "outputs": ["{workspaceRoot}/coverage/apps/portal-v2"],
      "options": {
        "jestConfig": "apps/portal-v2/jest.config.ts"
      }
    }
  }
}
