{
  "$schema": "../../node_modules/ng-openapi-gen/ng-openapi-gen-schema.json",
  "input": "http://localhost:39001/v3/api-docs/v2",
  "output": "apps/portal-v2/src/generated/api/aaa/",
  "ignoreUnusedModels": true,
  "enumStyle": "upper",
  "excludeTags": [
    "admin-controller",
    "client-controller-v-2",
    "client-group-controller-v-2",
    "audience-management-controller-v-2"
  ],
  "excludeParameters": [
    "user-id",
    "organization-id"
  ]
}
