{
  "$schema": "../../node_modules/ng-openapi-gen/ng-openapi-gen-schema.json",
  "input": "http://localhost:39005/v1/vendor/openapi.json",
  "output": "apps/portal-v2/src/generated/api/vendor/",
  "ignoreUnusedModels": true
}
