{
  "$schema": "https://docs.renovatebot.com/renovate-schema.json",
  "extends": [
    "config:base"
  ],
  "assignees": [
    "isil.dogano"
  ],
  "git-submodules": {
    "enabled": true
  },
  "packageRules": [
    {
      "matchPackageNames": [
        "mongo"
      ],
      "allowedVersions": "<=5.0"
    },
    {
      "matchPackageNames": [
        "tuspy"
      ],
      "allowedVersions": "==0.2.5"
    }
  ]
}