{
  "cli": {
    "analytics": false
  },
  "defaultProject": "workbench-client",
  "generators": {
    "@nx/angular:application": {
      "style": "scss",
      "linter": "eslint",
      "unitTestRunner": "jest",
      "e2eTestRunner": "none",
      "strict": true
    },
    "@nx/angular:library": {
      "linter": "eslint",
      "unitTestRunner": "jest"
    },
    "@nx/angular:component": {
      "style": "scss"
    },
    "@schematics/angular:component": {
      "style": "scss"
    },
    "@schematics/angular:module": {},
    "@ngneat/spectator:spectator-component": {
      "style": "scss"
    },
    "@nx/angular": {
      "application": {
        "linter": "eslint"
      },
      "library": {
        "linter": "eslint"
      },
      "storybook-configuration": {
        "linter": "eslint"
      }
    }
  },
  "$schema": "./node_modules/nx/schemas/nx-schema.json",
  "targetDefaults": {
    "build": {
      "dependsOn": ["^build"],
      "inputs": ["production", "^production"],
      "cache": true
    },
    "e2e": {
      "cache": true
    },
    "@nx/jest:jest": {
      "inputs": ["default", "^production", "{workspaceRoot}/jest.preset.js"],
      "cache": true,
      "options": {
        "passWithNoTests": true
      },
      "configurations": {
        "ci": {
          "ci": true,
          "codeCoverage": true
        }
      }
    },
    "@nx/eslint:lint": {
      "inputs": ["default", "{workspaceRoot}/.eslintrc.json"],
      "cache": true
    }
  },
  "namedInputs": {
    "default": ["{projectRoot}/**/*", "sharedGlobals", "projectSpecificFiles"],
    "sharedGlobals": [
      "{workspaceRoot}/angular.json",
      "{workspaceRoot}/tsconfig.base.json",
      "{workspaceRoot}/tslint.json",
      "{workspaceRoot}/nx.json",
      "{workspaceRoot}/babel.config.json"
    ],
    "production": [
      "default",
      "!{projectRoot}/.eslintrc.json",
      "!{projectRoot}/**/?(*.)+(spec|test).[jt]s?(x)?(.snap)",
      "!{projectRoot}/tsconfig.spec.json",
      "!{projectRoot}/jest.config.[jt]s",
      "!{projectRoot}/src/test-setup.[jt]s"
    ],
    "projectSpecificFiles": []
  },
  "parallel": 1,
  "useInferencePlugins": false,
  "defaultBase": "master"
}
