{
  "name": "vendor-app-integration",
  "$schema": "../../node_modules/nx/schemas/project-schema.json",
  "projectType": "library",
  "sourceRoot": "libs/vendor-app-integration/src",
  "prefix": "ngx",
  "tags": ["app-integration"],
  "targets": {
    "build": {
      "executor": "@nx/angular:package",
      "options": {
        "project": "libs/vendor-app-integration/ng-package.json"
      },
      "configurations": {
        "production": {
          "tsConfig": "libs/vendor-app-integration/tsconfig.lib.prod.json"
        },
        "development": {
          "tsConfig": "libs/vendor-app-integration/tsconfig.lib.json"
        }
      },
      "defaultConfiguration": "production",
      "generatePackageJson": true
    },
    "lint": {
      "executor": "@nx/eslint:lint",
      "outputs": ["{options.outputFile}"]
    },
    "test": {
      "executor": "@nx/jest:jest",
      "outputs": ["{workspaceRoot}/coverage/libs/vendor-app-integration"],
      "options": {
        "jestConfig": "libs/vendor-app-integration/jest.config.ts"
      }
    }
  }
}
