{
  "name": "organization-landing-page",
  "$schema": "../../node_modules/nx/schemas/project-schema.json",
  "projectType": "application",
  "sourceRoot": "apps/organization-landing-page/src",
  "prefix": "empaia",
  "tags": [],
  "namedInputs": {
    "projectSpecificFiles": [
      "{workspaceRoot}/tools/docker/organization-landing-page/*"
    ]
  },
  "targets": {
    "build": {
      "executor": "@angular-devkit/build-angular:browser",
      "options": {
        "outputPath": "dist/apps/organization-landing-page",
        "index": "apps/organization-landing-page/src/index.html",
        "main": "apps/organization-landing-page/src/main.ts",
        "polyfills": "apps/organization-landing-page/src/polyfills.ts",
        "tsConfig": "apps/organization-landing-page/tsconfig.app.json",
        "aot": true,
        "assets": [
          "apps/organization-landing-page/src/favicon.ico",
          "apps/organization-landing-page/src/assets"
        ],
        "styles": ["apps/organization-landing-page/src/styles/styles.scss"],
        "scripts": []
      },
      "configurations": {
        "production": {
          "fileReplacements": [
            {
              "replace": "apps/organization-landing-page/src/environments/environment.ts",
              "with": "apps/organization-landing-page/src/environments/environment.prod.ts"
            }
          ],
          "optimization": true,
          "outputHashing": "all",
          "sourceMap": false,
          "namedChunks": false,
          "extractLicenses": true,
          "vendorChunk": false,
          "buildOptimizer": true,
          "budgets": [
            {
              "type": "initial",
              "maximumWarning": "2mb",
              "maximumError": "5mb"
            },
            {
              "type": "anyComponentStyle",
              "maximumWarning": "6kb",
              "maximumError": "10kb"
            }
          ]
        },
        "development": {
          "buildOptimizer": false,
          "optimization": false,
          "vendorChunk": true,
          "extractLicenses": false,
          "sourceMap": true,
          "namedChunks": true
        },
        "e2e": {
          "fileReplacements": [
            {
              "replace": "apps/organization-landing-page/src/environments/environment.ts",
              "with": "apps/organization-landing-page/src/environments/environment.e2e.ts"
            }
          ],
          "optimization": true,
          "outputHashing": "all",
          "sourceMap": false,
          "namedChunks": false,
          "extractLicenses": true,
          "vendorChunk": false,
          "buildOptimizer": true,
          "budgets": [
            {
              "type": "initial",
              "maximumWarning": "2mb",
              "maximumError": "5mb"
            },
            {
              "type": "anyComponentStyle",
              "maximumWarning": "6kb",
              "maximumError": "10kb"
            }
          ]
        }
      },
      "defaultConfiguration": "production"
    },
    "serve": {
      "executor": "@angular-devkit/build-angular:dev-server",
      "options": {
        "buildTarget": "organization-landing-page:build"
      },
      "configurations": {
        "production": {
          "buildTarget": "organization-landing-page:build:production"
        },
        "e2e": {
          "buildTarget": "organization-landing-page:build:e2e"
        },
        "development": {
          "buildTarget": "organization-landing-page:build:development"
        }
      },
      "defaultConfiguration": "development"
    },
    "extract-i18n": {
      "executor": "@angular-devkit/build-angular:extract-i18n",
      "options": {
        "buildTarget": "organization-landing-page:build"
      }
    },
    "lint": {
      "executor": "@nx/eslint:lint",
      "outputs": ["{options.outputFile}"]
    },
    "test": {
      "executor": "@nx/jest:jest",
      "outputs": ["{workspaceRoot}/coverage/apps/organization-landing-page"],
      "options": {
        "jestConfig": "apps/organization-landing-page/jest.config.ts"
      }
    }
  }
}
