{
  "name": "empaia-ui-commons",
  "$schema": "../../node_modules/nx/schemas/project-schema.json",
  "projectType": "library",
  "sourceRoot": "libs/empaia-ui-commons/src",
  "prefix": "app",
  "tags": [],
  "targets": {
    "build": {
      "executor": "@nx/angular:package",
      "options": {
        "project": "libs/empaia-ui-commons/ng-package.json"
      },
      "configurations": {
        "production": {
          "tsConfig": "libs/empaia-ui-commons/tsconfig.lib.prod.json"
        },
        "development": {
          "tsConfig": "libs/empaia-ui-commons/tsconfig.lib.json"
        }
      },
      "defaultConfiguration": "production",
      "generatePackageJson": true
    },
    "test": {
      "executor": "@nx/jest:jest",
      "outputs": ["{workspaceRoot}/coverage/{projectRoot}"],
      "options": {
        "jestConfig": "libs/empaia-ui-commons/jest.config.ts"
      }
    },
    "lint": {
      "executor": "@nx/eslint:lint",
      "outputs": ["{options.outputFile}"]
    }
  }
}
