{
  "$schema": "../../node_modules/ng-packagr/ng-package.schema.json",
  "dest": "../../dist/libs/empaia-ui-commons",
  "assets": ["CHANGELOG.md"],
  "lib": {
    "entryFile": "src/index.ts"
  },
  "allowedNonPeerDependencies": ["@types/ol", "ol", "tslib"]
}
