{
  "name": "pre-post-processing-sample-app-v3",
  "$schema": "../../node_modules/nx/schemas/project-schema.json",
  "projectType": "application",
  "sourceRoot": "apps/pre-post-processing-sample-app-v3/src",
  "prefix": "app",
  "tags": [],
  "namedInputs": {
    "projectSpecificFiles": [
      "{workspaceRoot}/tools/docker/pre-post-processing-sample-app-v3/*"
    ]
  },
  "targets": {
    "build": {
      "executor": "@angular-devkit/build-angular:browser",
      "outputs": ["{options.outputPath}"],
      "options": {
        "outputPath": "dist/apps/pre-post-processing-sample-app-v3",
        "index": "apps/pre-post-processing-sample-app-v3/src/index.html",
        "main": "apps/pre-post-processing-sample-app-v3/src/main.ts",
        "polyfills": "apps/pre-post-processing-sample-app-v3/src/polyfills.ts",
        "tsConfig": "apps/pre-post-processing-sample-app-v3/tsconfig.app.json",
        "inlineStyleLanguage": "scss",
        "assets": [
          "apps/pre-post-processing-sample-app-v3/src/favicon.ico",
          "apps/pre-post-processing-sample-app-v3/src/assets"
        ],
        "styles": [
          "apps/pre-post-processing-sample-app-v3/src/styles/styles.scss"
        ],
        "scripts": [],
        "stylePreprocessorOptions": {
          "includePaths": [
            "apps/pre-post-processing-sample-app-v3/src/styles",
            "libs/slide-viewer/src/lib/styles"
          ]
        },
        "allowedCommonJsDependencies": [
          "fast-sha256",
          "lru-cache",
          "lerc",
          "debug",
          "xml-utils",
          "web-worker",
          "rbush",
          "color-name"
        ]
      },
      "configurations": {
        "production": {
          "budgets": [
            {
              "type": "initial",
              "maximumWarning": "2mb",
              "maximumError": "5mb"
            },
            {
              "type": "anyComponentStyle",
              "maximumWarning": "6kb",
              "maximumError": "10kb"
            }
          ],
          "fileReplacements": [
            {
              "replace": "apps/pre-post-processing-sample-app-v3/src/environments/environment.ts",
              "with": "apps/pre-post-processing-sample-app-v3/src/environments/environment.prod.ts"
            }
          ],
          "optimization": {
            "scripts": true,
            "styles": {
              "minify": true,
              "inlineCritical": false
            },
            "fonts": true
          },
          "outputHashing": "all",
          "sourceMap": false,
          "namedChunks": false,
          "extractLicenses": true,
          "vendorChunk": false,
          "buildOptimizer": true
        },
        "development": {
          "buildOptimizer": false,
          "optimization": false,
          "vendorChunk": true,
          "extractLicenses": false,
          "sourceMap": true,
          "namedChunks": true
        }
      },
      "defaultConfiguration": "production"
    },
    "serve": {
      "executor": "@angular-devkit/build-angular:dev-server",
      "options": {
        "port": 4300,
        "liveReload": false,
        "buildTarget": "pre-post-processing-sample-app-v3:build"
      },
      "configurations": {
        "production": {
          "buildTarget": "pre-post-processing-sample-app-v3:build:production"
        },
        "development": {
          "host": "0.0.0.0",
          "allowedHosts": ["host.docker.internal"],
          "buildTarget": "pre-post-processing-sample-app-v3:build:development"
        }
      },
      "defaultConfiguration": "development"
    },
    "extract-i18n": {
      "executor": "@angular-devkit/build-angular:extract-i18n",
      "options": {
        "buildTarget": "pre-post-processing-sample-app-v3:build"
      }
    },
    "lint": {
      "executor": "@nx/eslint:lint"
    },
    "test": {
      "executor": "@nx/jest:jest",
      "outputs": [
        "{workspaceRoot}/coverage/apps/pre-post-processing-sample-app-v3"
      ],
      "options": {
        "jestConfig": "apps/pre-post-processing-sample-app-v3/jest.config.ts"
      }
    }
  }
}
