{
  "projectType": "library",
  "root": "libs/vendor-app-communication-interface",
  "sourceRoot": "libs/vendor-app-communication-interface/src",
  "prefix": "ci-examples-frontend",
  "targets": {
    "test": {
      "executor": "@nrwl/jest:jest",
      "outputs": ["coverage/libs/vendor-app-communication-interface"],
      "options": {
        "jestConfig": "libs/vendor-app-communication-interface/jest.config.js",
        "passWithNoTests": true
      }
    },
    "lint": {
      "executor": "@nrwl/linter:eslint",
      "options": {
        "lintFilePatterns": [
          "libs/vendor-app-communication-interface/src/**/*.ts",
          "libs/vendor-app-communication-interface/src/**/*.html"
        ]
      }
    }
  },
  "tags": []
}
