{
    "item_type": "class",
    "items": [
        {
            "value": "org.empaia.global.v1.classes.roi",
            "reference_id": "07f87bcc-f445-4b2f-9f2a-dba685d66791",
            "reference_type": "annotation"
        }
    ]
}
