{
    "$schema": "https://gitlab.com/empaia/integration/definitions/-/raw/main/ead/ead-schema.v3.json",
    "name": "Example Proxy App Breast",
    "name_short": "Breast",
    "namespace": "org.empaia.vendor.proxy.v3.0",
    "description": "Example proxy application for accessing an external API/plattform",
    "configuration": {
        "customer": {
            "token_url": {
                "type": "string",
                "optional": false
            },
            "token_email": {
                "type": "string",
                "optional": false
            },
            "token_password": {
                "type": "string",
                "optional": false
            },
            "api_url": {
                "type": "string",
                "optional": false
            }
        }
    },
    "permissions": {
        "wsi_raw_file_access": true,
        "data_transmission_to_external_service_provider": true
    },
    "io": {
        "slide": {
            "type": "wsi"
        },
        "view_url": {
            "type": "string",
            "reference": "io.slide"
        }
    },
    "modes": {
        "preprocessing": {
            "inputs": ["slide"],
            "outputs": ["view_url"]
        }
    }
}
