{
  "$schema": "../../node_modules/ng-packagr/ng-package.schema.json",
  "dest": "../../dist/libs/slide-viewer",
  "assets": ["./src/lib/styles/**/*.scss", "CHANGELOG.md"],
  "allowedNonPeerDependencies": ["ol"],
  "lib": {
    "entryFile": "src/index.ts",
    "styleIncludePaths": ["./src/lib/styles"]
  }
}
