2-methylbutane,2-methylbutane,2-methylbutane,2-methylbutane,2-methylpropane,2-methylpropane,2-methylpropane,benzene,benzene,benzene,benzene,ethane,ethane,ethane,ethane,n-butane,n-butane,n-butane,n-butane,n-pentane,n-pentane,n-pentane,propane,propane,propane,propane,-,toluene,toluene,toluene,toluene,-,-,-,-
area,flag,w,rt,w,flag,rt,area,flag,w,rt,area,flag,w,rt,area,flag,w,rt,w,flag,rt,area,flag,w,rt,calib_id,area,flag,w,rt,datetime,start_datetime,end_datetime,type
109682.0,32,1.81,1384.6,,37,,553356.0,32,1.94,1481.9,238177.0,32,1.91,1079.7,257210.0,32,1.47,1304.5,,37,,159138.0,32,1.61,1193.6,1,2393470.0,32,4.14,1623.2,2024-05-02 08:33:01,2024-05-02 08:33:01,2024-05-02 08:53:01,std
