{
	"particles-timing": "2",
	
	"groups": {
		"common": {
			"duration": "60.0",
			"regen": "300.0",
			"speed": "0.2",
			"particle": "CRIT",
			"particle-amount": "5"
		},
		"rare": {
			"duration": "120.0",
			"regen": "600.0",
			"speed": "0.4"
		}
	}
}