// Jest Snapshot v1, https://goo.gl/fbAQLP

exports[`EditableTable renders correctly 1`] = `
<EditableTable
  currencyFrom="STR"
  data={
    Array [
      Object {
        "name": "string",
        "rate": 0,
      },
    ]
  }
  setData={[Function]}
/>
`;
