<svg viewBox="0 0 290 492"  xmlns="http://www.w3.org/2000/svg">
<path d="M192.392 245.896L8.33597 429.96C3.26797 435.016 0.479985 441.776 0.479984 448.984C0.479984 456.196 3.26797 462.952 8.33597 468.016L24.464 484.136C29.524 489.208 36.288 492 43.496 492C50.704 492 57.46 489.208 62.524 484.136L281.672 264.992C286.756 259.912 289.54 253.124 289.52 245.908C289.54 238.66 286.76 231.88 281.672 226.796L62.728 7.86401C57.664 2.79201 50.908 -5.60134e-06 43.696 -6.23184e-06C36.488 -6.86198e-06 29.732 2.79201 24.664 7.86401L8.54002 23.984C-1.95198 34.476 -1.95198 51.556 8.54002 62.044L192.392 245.896Z" />
</svg>

