$MeshFormat
2.2 0 8
$EndMeshFormat
$Nodes
15
1 0 0 0
2 1 0 0
3 -1 0 0
4 0.8854560256584112 0.4647231720338584 0
5 0.5680647467396709 0.8229838658877788 0
6 0.120536680265098 0.9927088740968671 0
7 -0.3546048870337934 0.9350162426887303 0
8 -0.7485107481652777 0.6631226582473685 0
9 -0.9709418174240966 0.2393156642954915 0
10 -0.9709418174275672 -0.2393156642814105 0
11 -0.7485107481732207 -0.6631226582384027 0
12 -0.3546048870425501 -0.9350162426854094 0
13 0.1205366802582099 -0.9927088740977035 0
14 0.5680647467361575 -0.822983865890204 0
15 0.8854560256573582 -0.4647231720358646 0
$EndNodes
$Elements
16
1 15 2 0 1 1
2 15 2 0 2 2
3 15 2 0 3 3
4 1 2 0 1 2 4
5 1 2 0 1 4 5
6 1 2 0 1 5 6
7 1 2 0 1 6 7
8 1 2 0 1 7 8
9 1 2 0 1 8 9
10 1 2 0 1 9 10
11 1 2 0 1 10 11
12 1 2 0 1 11 12
13 1 2 0 1 12 13
14 1 2 0 1 13 14
15 1 2 0 1 14 15
16 1 2 0 1 15 2
$EndElements
