$MeshFormat
2.2 0 8
$EndMeshFormat
$PhysicalNames
2
1 1 "SURFACE"
2 2 "ALL_ELEMENTS"
$EndPhysicalNames
$Nodes
379
1 53.5 17.5 0
2 53.47592363336669 17.99008570158989 0
3 53.40392640202715 18.47545161002535 0
4 53.28470167867721 18.95142338621903 0
5 53.11939766257805 19.41341716177328 0
6 52.9096063217681 19.85698368408075 0
7 52.6573480615439 20.27785116505136 0
8 52.36505226684842 20.67196642077591 0
9 52.03553390597047 21.03553390589501 0
10 51.6719664208581 21.36505226678097 0
11 51.27785116514069 21.65734806148421 0
12 50.85698368417697 21.90960632171666 0
13 50.41341716187731 22.11939766253495 0
14 49.95142338632525 22.28470167864499 0
15 49.47545161013303 22.40392640200573 0
16 48.9900857016999 22.47592363335586 0
17 48.50000000005276 22.5 0
18 48.00991429840511 22.4759236333662 0
19 47.52454838996912 22.40392640202605 0
20 47.04857661377442 22.28470167867522 0
21 46.58658283821769 22.1193976625743 0
22 46.14301631590961 21.90960632176294 0
23 45.72214883493767 21.65734806153657 0
24 45.32803357921648 21.36505226684217 0
25 44.96446609409809 21.03553390596357 0
26 44.63494773321341 20.67196642085124 0
27 44.34265193851024 20.27785116513239 0
28 44.09039367827784 19.85698368416669 0
29 43.88060233745925 19.41341716186331 0
30 43.71529832135051 18.9514233863104 0
31 43.59607359799161 18.47545161011966 0
32 43.52407636664287 17.99008570168695 0
33 43.5 17.50000000003906 0
34 43.52407636663529 17.00991429839009 0
35 43.59607359797704 16.52454838995358 0
36 43.71529832133012 16.0485766137568 0
37 43.88060233743303 15.5865828382 0
38 44.0903936782473 15.14301631589045 0
39 44.34265193847575 14.72214883491923 0
40 44.63494773317493 14.32803357919565 0
41 44.96446609405687 13.96446609407766 0
42 45.32803357917248 13.63494773319394 0
43 45.72214883489404 13.34265193849259 0
44 46.14301631586344 13.09039367826174 0
45 46.5865828381691 12.88060233744583 0
46 47.04857661372541 12.71529832133965 0
47 47.52454838992029 12.59607359798366 0
48 48.00991429835677 12.52407636663856 0
49 48.50000000000696 12.5 0
50 48.99008570165709 12.52407636663993 0
51 49.47545161009207 12.59607359798612 0
52 49.95142338628803 12.71529832134372 0
53 50.41341716184518 12.88060233745174 0
54 50.85698368415499 13.09039367827159 0
55 51.27785116512452 13.34265193850499 0
56 51.67196642084556 13.63494773320875 0
57 52.03553390595992 13.96446609409445 0
58 52.3650522668388 14.32803357921237 0
59 52.65734806153611 14.72214883493698 0
60 52.90960632176312 15.14301631590995 0
61 53.11939766257498 15.58658283821933 0
62 53.28470167867583 16.04857661377642 0
63 53.40392640202675 16.52454838997263 0
64 53.47592363336662 17.00991429840942 0
65 50.57971560744196 13.5457648269298 0
66 46.43602294099227 21.47774285453354 0
67 52.46600422796414 19.64752530392331 0
68 44.57183360780997 15.34566129895122 0
69 52.98210872955085 16.15278172886587 0
70 49.42675617008798 22.09051913670247 0
71 47.23526816296563 13.18973563906464 0
72 44.03606409587714 18.8558697400469 0
73 51.37456596789593 20.92205651134123 0
74 45.19546739658161 14.19221587517706 0
75 52.88351853957947 18.40517912042586 0
76 52.23694664166754 15.06288092555722 0
77 44.11087759414624 16.65085925416949 0
78 48.47554159005014 12.98996643355349 0
79 45.31118459316092 20.65093614713069 0
80 50.14348745475579 21.67349873607437 0
81 44.02254031083409 17.56609398120148 0
82 51.3640050241427 14.02795638941806 0
83 47.47357547452701 21.92851135559645 0
84 45.94155926607066 13.81750358451895 0
85 49.70862115256198 13.20204841166934 0
86 52.94936795768217 16.9770155223923 0
87 44.74270004578641 19.95176013042906 0
88 52.94564611916864 17.93982446107962 0
89 46.79239205733121 13.35744613036074 0
90 51.68572925006944 14.31817495004886 0
91 47.10894500011933 21.96090867183071 0
92 49.25565151123507 13.09666187487512 0
93 44.08137759014409 18.40380452111089 0
94 50.99246749201236 21.20299611384788 0
95 45.05488781706633 14.50858211834263 0
96 46.03437239871101 21.22837901102754 0
97 47.5968913108803 13.08124713175558 0
98 52.50619384082756 15.48044823958475 0
99 44.32393756253107 19.20341681089872 0
100 52.77232334964565 18.86071437856368 0
101 51.97130669253344 20.37940877331522 0
102 47.96888874101778 21.90516225361051 0
103 44.37255692037441 15.76648672727262 0
104 49.10081862595786 22.00272084802194 0
105 47.90213873776548 21.38035928432981 0
106 49.922655584654 13.80881547343122 0
107 52.31680654895366 18.7747101798001 0
108 45.00676965195893 15.53987158784748 0
109 44.90686668413065 19.25704970386315 0
110 47.4190518162049 13.63157749967888 0
111 51.09875420781483 20.50580096602694 0
112 51.13223111974301 14.43274098869997 0
113 46.73385917298412 21.06744342062768 0
114 48.89484420249399 21.46026613789969 0
115 45.27352327084704 15.13447308198851 0
116 48.57705512967823 21.82055260163847 0
117 46.75220330740491 21.65767330958665 0
118 48.80367249174502 13.02774944216796 0
119 44.81857351500636 14.92253077088443 0
120 44.04612467112413 18.03047157752071 0
121 51.96307247904655 14.66962599094279 0
122 44.50584473082934 19.54949132764815 0
123 52.7700946294141 15.88401117775296 0
124 46.36122747519019 13.56799389914591 0
125 52.61779054723195 19.30225320746892 0
126 50.58144275923625 21.45028836633491 0
127 52.96455472383273 17.46312173688789 0
128 52.40493535540418 18.34905938777879 0
129 44.55048981928744 18.06748522940276 0
130 45.58163639897685 14.05789250500024 0
131 52.37385948650869 20.10147138070814 0
132 49.71907175771332 21.90042119053957 0
133 50.99042391498369 13.77883183223316 0
134 44.04318389194022 17.10578442314014 0
135 45.00784213811146 20.31973345589682 0
136 48.02210137177773 12.85885397824639 0
137 44.22233164968427 16.20163452992819 0
138 45.65508625462385 20.95180115969415 0
139 52.91137175057356 16.54884898257492 0
140 50.1544218808008 13.35685749855068 0
141 51.7257453033687 20.61477432441285 0
142 45.68834748809285 15.39994193076095 0
143 51.99512176134554 18.70106429880021 0
144 52.1117835700728 15.7913064509793 0
145 44.5153790529294 17.20215769126115 0
146 45.33671026283356 20.01153606347104 0
147 49.05038583979206 13.57890026028736 0
148 49.89158861899617 21.23320278763427 0
149 52.43647481699667 16.94127688839001 0
150 46.15782492148846 14.27115765427212 0
151 47.26931763928952 21.37525646334042 0
152 45.61990973205658 14.60037014179618 0
153 49.35120838462043 21.50279018600288 0
154 51.90646276151981 19.76997692985897 0
155 51.50625282909381 14.99235153641594 0
156 44.49702753256193 17.61577891890741 0
157 52.15443060059769 19.19705092808784 0
158 48.36294373474787 21.28895238386474 0
159 50.7316910757687 20.77454820909364 0
160 52.44280567531057 17.90665868622309 0
161 46.56796843512062 14.00299849115723 0
162 44.70808383239734 16.33168654408982 0
163 46.32161081275844 20.81897858516712 0
164 46.9759751937651 13.78696629354183 0
165 44.82387301013026 15.92063918483087 0
166 44.60706967510343 18.69440217756684 0
167 48.5897565848591 13.52063649637548 0
168 45.6136430313544 20.29249611635901 0
169 49.49546402653867 13.67687599200986 0
170 51.432693439044 14.56972105464662 0
171 48.00594525736417 13.44473999806516 0
172 47.91194128361178 20.90220195759989 0
173 50.52647946523179 14.64360035726357 0
174 45.35093214695645 19.0440511003236 0
175 47.57590238426664 14.086303308908 0
176 50.83956639471207 20.14122747536796 0
177 44.94013474946062 17.33682711271682 0
178 49.73396868764865 14.26664435023099 0
179 46.96479437093382 20.64620985752242 0
180 48.77821472250145 21.11122087152242 0
181 46.44894676311731 14.66522118989602 0
182 45.57382016782128 19.79935937311178 0
183 45.15079851719125 16.01433086422911 0
184 51.8524160540161 15.38126775262251 0
185 51.45129912700645 20.19019473042363 0
186 52.41714853149918 16.32233324480628 0
187 48.41572015578816 14.0211639810558 0
188 45.11788359223138 19.67556344675912 0
189 46.05113529952612 15.01177408627597 0
190 45.09822371911597 17.97403382797147 0
191 51.95290307612279 18.36760029808876 0
192 50.33311015902989 21.00929445259291 0
193 45.94987092409426 20.55787618510234 0
194 47.10058389703222 14.09388717512099 0
195 51.76522271195738 18.98915975568572 0
196 52.45181895465022 17.43971175089477 0
197 51.32974072773997 15.38577009978022 0
198 48.87756405878726 14.06254176338221 0
199 44.60633763932759 16.77197633959365 0
200 47.27172661217799 14.61105586288593 0
201 51.92297247193514 16.93675004922118 0
202 46.42358090137819 15.34362174031456 0
203 48.29440283784727 14.51834417935963 0
204 49.69920310450053 20.76559853079718 0
205 51.94561450091768 17.92371831410869 0
206 51.14967507831693 19.82997496974429 0
207 45.28000251857992 16.40386768788414 0
208 47.427432555609 20.80396905475682 0
209 49.22945409440871 20.9374776889091 0
210 51.50292185818802 15.64439577864233 0
211 50.34299148815427 13.996422731963 0
212 50.12447388703932 20.57102059261733 0
213 45.85867948960167 19.9285642495927 0
214 46.5783554948917 20.43180721622996 0
215 45.18406380501066 18.54776357773414 0
216 46.770511928086 14.42182670582917 0
217 50.50056174288876 20.37291973477722 0
218 50.74678401364757 14.21766598762376 0
219 51.38932465780177 18.57556037090223 0
220 50.9378068083741 14.95247638640924 0
221 49.31629785782091 14.1468469522525 0
222 51.70698581443595 16.00902846503744 0
223 47.93681080297083 14.03677741989604 0
224 44.83243675491572 17.62873887049065 0
225 48.25888561000745 20.95016708846155 0
226 51.458533686393 19.4183454221461 0
227 48.00820704085565 20.4338226255244 0
228 45.54126493295969 18.08574119380059 0
229 51.10755566635933 15.86792042220232 0
230 50.36176881319112 19.98402919421722 0
231 46.05064444414513 19.42410927770772 0
232 45.71834311644604 16.05669990021361 0
233 47.09425934573949 20.21979013632264 0
234 49.56575242426209 20.28279822156338 0
235 50.14192106287676 14.44062476066296 0
236 50.3462345410512 15.05301696353115 0
237 49.58297024032573 14.72276683724481 0
238 46.79551906346445 14.99196108507985 0
239 46.06827199745727 15.70596271133714 0
240 51.02809473717491 19.15334434522978 0
241 47.83719475492762 14.53588636397961 0
242 48.53950243961261 20.59714101891474 0
243 51.8516357434012 16.44162660425872 0
244 48.74283050923916 14.54443879105622 0
245 45.82596484466066 18.88749730585709 0
246 51.94547311927869 17.43542709964197 0
247 50.66517874334555 19.90451805777636 0
248 51.43344067389896 17.9477834403272 0
249 46.22846581024614 20.17028721543144 0
250 51.02790042924283 15.47340743078439 0
251 45.53816355988339 17.11139089522585 0
252 50.3827548869313 19.55189306527776 0
253 48.57507395898972 20.00206137160966 0
254 46.51473658877764 19.10814454992285 0
255 50.7925879641882 18.41919079247959 0
256 50.6233951537936 15.56141329217225 0
257 51.36906734527189 16.4478644953807 0
258 47.39069298813546 14.98675582514488 0
259 46.7987892229949 15.65600312216552 0
260 48.19536974040666 15.00400579929223 0
261 45.75859760560162 16.72435639032009 0
262 46.61707145352168 19.77154615120871 0
263 46.77037558837517 20.15778373273362 0
264 50.6186072844215 15.19331221004326 0
265 49.10280972031377 20.4367537339515 0
266 45.65606569040171 18.43071626814739 0
267 49.174738440186 14.61500322068351 0
268 50.79712027021368 19.61011987760951 0
269 47.53969431640188 20.32362716222369 0
270 45.35984763674696 17.52766772665225 0
271 49.97604684005186 14.87840003493412 0
272 51.4440466956319 17.43882852805692 0
273 45.37992621443096 15.76610873660909 0
274 51.38356233507054 16.1157004942147 0
275 49.99429397825619 20.12162905364184 0
276 45.0870270727961 16.91969949993599 0
277 45.50834392354633 19.49494711375333 0
278 46.07865978142569 16.38545335120397 0
279 45.97960270000753 17.25947736095084 0
280 49.83435229923748 15.29735525910372 0
281 47.63592280052082 19.83751066657639 0
282 49.45802292107477 19.79483803456613 0
283 50.72130839504047 16.27664194944307 0
284 48.10624605123031 19.93999459075872 0
285 50.46202629466595 18.96216828067812 0
286 50.97040536638216 17.43486767568945 0
287 46.28103107285646 18.73245464192204 0
288 48.64454254111192 15.02081891955744 0
289 46.43975754466737 16.03333155365576 0
290 47.14504274110954 15.27591116957993 0
291 51.40332427846967 16.9307664334207 0
292 50.92788319991562 17.91733229744435 0
293 46.75813235219049 19.35867235914933 0
294 49.47026908147393 15.1600225845448 0
295 45.87403924742346 17.79107543750555 0
296 49.01979383018254 19.94569848407132 0
297 47.7398553603852 15.00119336763971 0
298 46.44752833936607 16.81677383112362 0
299 48.96160830699739 19.59324475201899 0
300 49.7203874539386 15.60001161209286 0
301 50.34897668511982 18.28031886915836 0
302 47.6067552690447 15.54820779951757 0
303 47.72764311475964 19.32968768962163 0
304 46.81187385434556 18.94232115573216 0
305 48.14420348431224 15.47212286142489 0
306 50.91804222939847 16.9566648055721 0
307 49.955636925417 15.98801964224134 0
308 46.4117756103398 17.31967934353082 0
309 49.92081913384064 19.63861026310882 0
310 49.87214151020337 19.12533683090015 0
311 46.04456015123463 16.93433011364809 0
312 48.19447225665753 19.44976654908237 0
313 47.17551035425479 15.985410375967 0
314 46.10592454656439 18.3015599939251 0
315 49.07252807539185 15.07690178087968 0
316 47.16788769886707 19.7657464272896 0
317 50.54463141743429 17.39355702831989 0
318 50.21187617838443 15.47948276623406 0
319 49.41122230055549 16.02715873814768 0
320 47.8733039021979 16.0154155887313 0
321 46.73500078156428 17.3595872012267 0
322 48.28456314120772 18.99113183790185 0
323 50.3067301687712 16.83196778509368 0
324 49.26716479618251 19.24146607863237 0
325 47.26345290887061 19.18239890245878 0
326 49.41910066349377 15.5807602045629 0
327 46.4388603656855 17.74355528654165 0
328 50.21803906855857 18.60769691825781 0
329 48.63646349227193 19.53135876264776 0
330 50.46762655369857 17.83622144539194 0
331 46.82079466060807 16.37857751497608 0
332 46.73163841311049 18.62769438831671 0
333 48.57660854532408 15.48940845388431 0
334 50.59455177065286 17.04232610453757 0
335 49.92865707132086 18.17845458699105 0
336 50.14397687683562 17.2848960684655 0
337 48.97409369960698 15.99138384885886 0
338 46.85439931664965 17.66262665066973 0
339 47.29354014509339 18.57922825908482 0
340 47.84233181403937 18.84919638102508 0
341 49.86148512068427 18.63248967737663 0
342 48.73021513357043 19.06779065439194 0
343 47.53438301786429 16.34400310380939 0
344 46.57273604925535 18.18754068657249 0
345 49.00686882468471 15.53760201648881 0
346 48.14700269190165 15.81460223866927 0
347 46.92588273627555 17.10332011122813 0
348 49.85259297689986 16.63087066391054 0
349 49.71568706872661 17.13688543176615 0
350 47.32109900402811 17.95338860943232 0
351 48.16560388225365 16.34805984718088 0
352 48.33299638024931 18.65312260126085 0
353 49.37017249501301 16.51041995688048 0
354 48.49479772255557 16.00475471887047 0
355 49.35382140975572 18.59887433358606 0
356 47.21442260309159 16.73077077159184 0
357 47.01570824126196 18.06986931820097 0
358 47.62031601707042 17.07554059799755 0
359 48.02657051331091 18.45019446188015 0
360 49.46245444899946 18.08048739766679 0
361 48.64501132868469 16.36604979518095 0
362 48.72917187412816 18.47594732292577 0
363 47.61751045901401 18.17496805649873 0
364 47.89504081261644 16.6910200865673 0
365 47.31609239902917 17.52697636286558 0
366 47.8317840139209 17.79540737624946 0
367 49.13487620083855 17.44563168248835 0
368 48.26478971478349 18.08162753739192 0
369 48.04949559424099 17.38898416090283 0
370 48.96640562373462 17.91227335916104 0
371 48.48743712330061 16.62360462911531 0
372 50.03148522492442 17.72964627167335 0
373 48.49385182277165 17.66835467343444 0
374 48.2785416977017 16.98847183697517 0
375 48.85019039579156 16.82714122959975 0
376 49.58590542313402 17.60008361417117 0
377 48.69073283361741 17.23546696402739 0
378 49.2682813455329 16.98124645408436 0
379 48.94437912397183 16.41996298110459 0
$EndNodes
$Elements
410
1 1 2 1 1 1 2
2 1 2 1 1 2 3
3 1 2 1 1 3 4
4 1 2 1 1 4 5
5 1 2 1 1 5 6
6 1 2 1 1 6 7
7 1 2 1 1 7 8
8 1 2 1 1 8 9
9 1 2 1 1 9 10
10 1 2 1 1 10 11
11 1 2 1 1 11 12
12 1 2 1 1 12 13
13 1 2 1 1 13 14
14 1 2 1 1 14 15
15 1 2 1 1 15 16
16 1 2 1 1 16 17
17 1 2 1 1 17 18
18 1 2 1 1 18 19
19 1 2 1 1 19 20
20 1 2 1 1 20 21
21 1 2 1 1 21 22
22 1 2 1 1 22 23
23 1 2 1 1 23 24
24 1 2 1 1 24 25
25 1 2 1 1 25 26
26 1 2 1 1 26 27
27 1 2 1 1 27 28
28 1 2 1 1 28 29
29 1 2 1 1 29 30
30 1 2 1 1 30 31
31 1 2 1 1 31 32
32 1 2 1 1 32 33
33 1 2 1 1 33 34
34 1 2 1 1 34 35
35 1 2 1 1 35 36
36 1 2 1 1 36 37
37 1 2 1 1 37 38
38 1 2 1 1 38 39
39 1 2 1 1 39 40
40 1 2 1 1 40 41
41 1 2 1 1 41 42
42 1 2 1 1 42 43
43 1 2 1 1 43 44
44 1 2 1 1 44 45
45 1 2 1 1 45 46
46 1 2 1 1 46 47
47 1 2 1 1 47 48
48 1 2 1 1 48 49
49 1 2 1 1 49 50
50 1 2 1 1 50 51
51 1 2 1 1 51 52
52 1 2 1 1 52 53
53 1 2 1 1 53 54
54 1 2 1 1 54 55
55 1 2 1 1 55 56
56 1 2 1 1 56 57
57 1 2 1 1 57 58
58 1 2 1 1 58 59
59 1 2 1 1 59 60
60 1 2 1 1 60 61
61 1 2 1 1 61 62
62 1 2 1 1 62 63
63 1 2 1 1 63 64
64 1 2 1 1 64 1
65 3 2 2 1 298 308 279 311
66 3 2 2 1 251 276 207 261
67 3 2 2 1 374 371 375 377
68 3 2 2 1 148 153 209 204
69 3 2 2 1 298 347 321 308
70 3 2 2 1 283 307 318 256
71 3 2 2 1 376 367 378 349
72 3 2 2 1 351 364 343 320
73 3 2 2 1 260 203 244 288
74 3 2 2 1 373 368 366 369
75 3 2 2 1 305 260 288 333
76 3 2 2 1 279 251 261 311
77 3 2 2 1 310 309 282 324
78 3 2 2 1 242 227 284 253
79 3 2 2 1 149 201 243 186
80 3 2 2 1 369 358 364 374
81 3 2 2 1 200 175 223 241
82 3 2 2 1 354 351 320 346
83 3 2 2 1 281 316 325 303
84 3 2 2 1 111 176 206 185
85 3 2 2 1 232 273 142 239
86 3 2 2 1 376 372 335 360
87 3 2 2 1 281 303 312 284
88 3 2 2 1 241 297 258 200
89 3 2 2 1 232 239 289 278
90 3 2 2 1 288 244 267 315
91 3 2 2 1 341 355 360 335
92 3 2 2 1 287 245 266 314
93 3 2 2 1 308 321 338 327
94 3 2 2 1 235 178 106 211
95 3 2 2 1 324 299 329 342
96 3 2 2 1 357 338 365 350
97 3 2 2 1 323 334 317 336
98 3 2 2 1 238 200 258 290
99 3 2 2 1 308 327 295 279
100 3 2 2 1 285 328 301 255
101 3 2 2 1 326 345 315 294
102 3 2 2 1 257 243 201 291
103 3 2 2 1 309 310 285 252
104 3 2 2 1 273 232 207 183
105 3 2 2 1 155 197 250 220
106 3 2 2 1 336 349 348 323
107 3 2 2 1 270 177 276 251
108 3 2 2 1 254 231 245 287
109 3 2 2 1 218 112 220 173
110 3 2 2 1 234 282 309 275
111 3 2 2 1 271 237 178 235
112 3 2 2 1 300 326 294 280
113 3 2 2 1 174 109 166 215
114 3 2 2 1 189 181 238 202
115 3 2 2 1 179 113 163 214
116 3 2 2 1 192 159 94 126
117 3 2 2 1 98 60 61 123
118 3 2 2 1 99 122 28 29
119 3 2 2 1 90 57 58 121
120 3 2 2 1 96 23 24 138
121 3 2 2 1 88 127 1 2
122 3 2 2 1 89 124 44 45
123 3 2 2 1 91 20 21 117
124 3 2 2 1 48 136 97 47
125 3 2 2 1 100 4 5 125
126 3 2 2 1 92 118 50 51
127 3 2 2 1 36 37 103 137
128 3 2 2 1 95 119 39 40
129 3 2 2 1 93 31 32 120
130 3 2 2 1 101 131 7 8
131 3 2 2 1 17 116 104 16
132 3 2 2 1 234 204 209 265
133 3 2 2 1 94 11 12 126
134 3 2 2 1 351 371 374 364
135 3 2 2 1 294 315 267 237
136 3 2 2 1 108 115 142 273
137 3 2 2 1 280 294 237 271
138 3 2 2 1 259 313 331 289
139 3 2 2 1 307 319 326 300
140 3 2 2 1 129 190 215 166
141 3 2 2 1 144 186 243 222
142 3 2 2 1 240 268 252 285
143 3 2 2 1 128 191 205 160
144 3 2 2 1 143 191 128 107
145 3 2 2 1 322 312 303 340
146 3 2 2 1 105 151 208 172
147 3 2 2 1 278 261 207 232
148 3 2 2 1 368 359 363 366
149 3 2 2 1 304 254 287 332
150 3 2 2 1 240 226 206 268
151 3 2 2 1 202 259 289 239
152 3 2 2 1 253 296 265 242
153 3 2 2 1 288 315 345 333
154 3 2 2 1 324 282 296 299
155 3 2 2 1 286 292 330 317
156 3 2 2 1 322 340 359 352
157 3 2 2 1 287 314 344 332
158 3 2 2 1 301 330 292 255
159 3 2 2 1 176 247 268 206
160 3 2 2 1 242 225 172 227
161 3 2 2 1 327 344 314 295
162 3 2 2 1 198 221 267 244
163 3 2 2 1 366 365 358 369
164 3 2 2 1 174 215 266 245
165 3 2 2 1 284 312 329 253
166 3 2 2 1 179 214 263 233
167 3 2 2 1 189 202 239 142
168 3 2 2 1 219 255 292 248
169 3 2 2 1 114 180 209 153
170 3 2 2 1 180 242 265 209
171 3 2 2 1 262 293 325 316
172 3 2 2 1 343 356 331 313
173 3 2 2 1 247 176 217 230
174 3 2 2 1 203 187 198 244
175 3 2 2 1 273 183 165 108
176 3 2 2 1 227 172 208 269
177 3 2 2 1 274 222 243 257
178 3 2 2 1 178 221 169 106
179 3 2 2 1 175 194 164 110
180 3 2 2 1 228 266 215 190
181 3 2 2 1 142 115 152 189
182 3 2 2 1 262 263 214 249
183 3 2 2 1 218 133 82 112
184 3 2 2 1 186 139 86 149
185 3 2 2 1 169 85 140 106
186 3 2 2 1 166 109 122 99
187 3 2 2 1 362 370 360 355
188 3 2 2 1 153 104 116 114
189 3 2 2 1 246 196 160 205
190 3 2 2 1 154 101 141 185
191 3 2 2 1 69 62 63 139
192 3 2 2 1 213 249 193 168
193 3 2 2 1 70 132 14 15
194 3 2 2 1 73 141 9 10
195 3 2 2 1 74 41 42 130
196 3 2 2 1 79 25 26 135
197 3 2 2 1 152 115 119 95
198 3 2 2 1 65 54 55 133
199 3 2 2 1 77 134 34 35
200 3 2 2 1 65 140 53 54
201 3 2 2 1 166 93 120 129
202 3 2 2 1 75 88 2 3
203 3 2 2 1 71 89 45 46
204 3 2 2 1 66 22 23 96
205 3 2 2 1 140 85 52 53
206 3 2 2 1 132 80 13 14
207 3 2 2 1 186 144 98 123
208 3 2 2 1 67 6 7 131
209 3 2 2 1 79 138 24 25
210 3 2 2 1 86 64 1 127
211 3 2 2 1 83 102 18 19
212 3 2 2 1 67 125 5 6
213 3 2 2 1 83 19 20 91
214 3 2 2 1 84 43 44 124
215 3 2 2 1 95 40 41 74
216 3 2 2 1 78 49 50 118
217 3 2 2 1 97 71 46 47
218 3 2 2 1 73 10 11 94
219 3 2 2 1 133 55 56 82
220 3 2 2 1 139 63 64 86
221 3 2 2 1 70 15 16 104
222 3 2 2 1 134 81 33 34
223 3 2 2 1 68 38 39 119
224 3 2 2 1 78 136 48 49
225 3 2 2 1 80 126 12 13
226 3 2 2 1 130 42 43 84
227 3 2 2 1 69 123 61 62
228 3 2 2 1 87 27 28 122
229 3 2 2 1 72 30 31 93
230 3 2 2 1 76 121 58 59
231 3 2 2 1 75 3 4 100
232 3 2 2 1 103 37 38 68
233 3 2 2 1 85 92 51 52
234 3 2 2 1 163 96 138 193
235 3 2 2 1 66 117 21 22
236 3 2 2 1 99 29 30 72
237 3 2 2 1 98 76 59 60
238 3 2 2 1 135 26 27 87
239 3 2 2 1 161 124 89 164
240 3 2 2 1 141 101 8 9
241 3 2 2 1 102 116 17 18
242 3 2 2 1 162 137 103 165
243 3 2 2 1 196 127 88 160
244 3 2 2 1 82 56 57 90
245 3 2 2 1 81 120 32 33
246 3 2 2 1 77 35 36 137
247 3 2 2 1 302 313 259 290
248 3 2 2 1 212 217 159 192
249 3 2 2 1 156 81 134 145
250 3 2 2 1 347 365 338 321
251 3 2 2 1 248 272 246 205
252 3 2 2 1 177 270 190 224
253 3 2 2 1 224 190 129 156
254 3 2 2 1 155 121 76 184
255 3 2 2 1 117 151 83 91
256 3 2 2 1 112 82 90 170
257 3 2 2 1 194 216 161 164
258 3 2 2 1 110 164 89 71
259 3 2 2 1 128 160 88 75
260 3 2 2 1 290 259 202 238
261 3 2 2 1 176 111 159 217
262 3 2 2 1 261 278 298 311
263 3 2 2 1 158 225 242 180
264 3 2 2 1 183 207 162 165
265 3 2 2 1 220 250 256 264
266 3 2 2 1 100 125 157 107
267 3 2 2 1 295 314 266 228
268 3 2 2 1 229 210 222 274
269 3 2 2 1 342 329 312 322
270 3 2 2 1 135 87 188 146
271 3 2 2 1 157 154 226 195
272 3 2 2 1 233 263 262 316
273 3 2 2 1 168 193 138 79
274 3 2 2 1 365 347 356 358
275 3 2 2 1 108 165 103 68
276 3 2 2 1 116 158 180 114
277 3 2 2 1 362 352 359 368
278 3 2 2 1 179 233 269 208
279 3 2 2 1 107 157 195 143
280 3 2 2 1 205 191 219 248
281 3 2 2 1 344 357 339 332
282 3 2 2 1 216 194 175 200
283 3 2 2 1 198 147 169 221
284 3 2 2 1 285 310 341 328
285 3 2 2 1 112 170 155 220
286 3 2 2 1 324 342 362 355
287 3 2 2 1 350 363 339 357
288 3 2 2 1 347 298 331 356
289 3 2 2 1 283 323 348 307
290 3 2 2 1 379 361 354 337
291 3 2 2 1 85 169 147 92
292 3 2 2 1 337 354 333 345
293 3 2 2 1 158 105 172 225
294 3 2 2 1 316 281 269 233
295 3 2 2 1 250 197 210 229
296 3 2 2 1 155 184 210 197
297 3 2 2 1 123 69 139 186
298 3 2 2 1 299 296 253 329
299 3 2 2 1 199 77 137 162
300 3 2 2 1 113 66 96 163
301 3 2 2 1 97 136 78 171
302 3 2 2 1 101 154 67 131
303 3 2 2 1 93 166 99 72
304 3 2 2 1 121 155 170 90
305 3 2 2 1 111 73 94 159
306 3 2 2 1 182 213 168 146
307 3 2 2 1 150 84 124 161
308 3 2 2 1 307 348 353 319
309 3 2 2 1 148 192 126 80
310 3 2 2 1 199 162 207 276
311 3 2 2 1 241 223 187 203
312 3 2 2 1 204 212 192 148
313 3 2 2 1 275 212 204 234
314 3 2 2 1 104 153 132 70
315 3 2 2 1 154 185 206 226
316 3 2 2 1 181 150 161 216
317 3 2 2 1 95 74 130 152
318 3 2 2 1 306 291 272 286
319 3 2 2 1 236 173 220 264
320 3 2 2 1 358 356 343 364
321 3 2 2 1 249 214 163 193
322 3 2 2 1 145 199 276 177
323 3 2 2 1 237 267 221 178
324 3 2 2 1 195 219 191 143
325 3 2 2 1 252 230 275 309
326 3 2 2 1 200 238 181 216
327 3 2 2 1 337 319 353 379
328 3 2 2 1 281 284 227 269
329 3 2 2 1 376 360 370 367
330 3 2 2 1 296 282 234 265
331 3 2 2 1 272 248 292 286
332 3 2 2 1 251 279 295 270
333 3 2 2 1 92 147 167 118
334 3 2 2 1 325 304 332 339
335 3 2 2 1 354 361 371 351
336 3 2 2 1 109 174 277 188
337 3 2 2 1 310 324 355 341
338 3 2 2 1 298 278 289 331
339 3 2 2 1 149 86 127 196
340 3 2 2 1 201 149 196 246
341 3 2 2 1 379 375 371 361
342 3 2 2 1 286 317 334 306
343 3 2 2 1 146 188 277 182
344 3 2 2 1 185 141 73 111
345 3 2 2 1 145 177 224 156
346 3 2 2 1 107 128 75 100
347 3 2 2 1 151 105 102 83
348 3 2 2 1 302 320 343 313
349 3 2 2 1 377 367 370 373
350 3 2 2 1 129 120 81 156
351 3 2 2 1 354 346 305 333
352 3 2 2 1 145 134 77 199
353 3 2 2 1 330 372 336 317
354 3 2 2 1 378 375 379 353
355 3 2 2 1 109 188 87 122
356 3 2 2 1 105 158 116 102
357 3 2 2 1 154 157 125 67
358 3 2 2 1 271 236 318 280
359 3 2 2 1 231 277 174 245
360 3 2 2 1 291 201 246 272
361 3 2 2 1 213 182 277 231
362 3 2 2 1 230 217 212 275
363 3 2 2 1 190 270 295 228
364 3 2 2 1 203 260 297 241
365 3 2 2 1 146 168 79 135
366 3 2 2 1 229 274 257 283
367 3 2 2 1 367 377 375 378
368 3 2 2 1 322 352 362 342
369 3 2 2 1 115 108 68 119
370 3 2 2 1 171 78 118 167
371 3 2 2 1 268 247 230 252
372 3 2 2 1 256 318 236 264
373 3 2 2 1 365 366 363 350
374 3 2 2 1 325 293 254 304
375 3 2 2 1 187 167 147 198
376 3 2 2 1 319 337 345 326
377 3 2 2 1 341 335 301 328
378 3 2 2 1 327 338 357 344
379 3 2 2 1 283 256 250 229
380 3 2 2 1 223 171 167 187
381 3 2 2 1 106 140 65 211
382 3 2 2 1 211 65 133 218
383 3 2 2 1 307 300 280 318
384 3 2 2 1 349 336 372 376
385 3 2 2 1 297 302 290 258
386 3 2 2 1 335 372 330 301
387 3 2 2 1 71 97 171 110
388 3 2 2 1 76 98 144 184
389 3 2 2 1 175 110 171 223
390 3 2 2 1 66 113 151 117
391 3 2 2 1 208 151 113 179
392 3 2 2 1 84 150 152 130
393 3 2 2 1 80 132 153 148
394 3 2 2 1 222 210 184 144
395 3 2 2 1 189 152 150 181
396 3 2 2 1 211 218 173 235
397 3 2 2 1 236 271 235 173
398 3 2 2 1 226 240 219 195
399 3 2 2 1 249 213 231 262
400 3 2 2 1 285 255 219 240
401 3 2 2 1 293 262 231 254
402 3 2 2 1 291 306 283 257
403 3 2 2 1 323 283 306 334
404 3 2 2 1 260 305 302 297
405 3 2 2 1 320 302 305 346
406 3 2 2 1 303 325 339 340
407 3 2 2 1 359 340 339 363
408 3 2 2 1 348 349 378 353
409 3 2 2 1 368 373 370 362
410 3 2 2 1 373 369 374 377
$EndElements
