lc1 = $lc1; 
Point(1) = { 1 ,  1 , 0., lc1 } ;
Point(2) = { 1 ,  498 , 0., lc1 } ;
Point(3) = { 498 ,  498 , 0., lc1 } ;
Point(4) = { 498 ,  1 , 0., lc1 } ;
Line(1) = { 1 ,  2 } ;
Line(2) = { 2 ,  3 } ;
Line(3) = { 3 ,  4 } ;
Line(4) = { 4 ,  1 } ;
Line Loop(1) = { 1, 2, 3, 4 } ;
Plane Surface( 1 ) = {1};
Point(5) = { 268 ,  465 , 0., lc1 } ;
Point(6) = { 272 ,  466 , 0., lc1 } ;
Point(7) = { 275 ,  470 , 0., lc1 } ;
Point(8) = { 275 ,  476 , 0., lc1 } ;
Point(9) = { 271 ,  475 , 0., lc1 } ;
Point(10) = { 268 ,  471 , 0., lc1 } ;
Line(5) = { 5 ,  6 } ;
Line(6) = { 6 ,  7 } ;
Line(7) = { 7 ,  8 } ;
Line(8) = { 8 ,  9 } ;
Line(9) = { 9 ,  10 } ;
Line(10) = { 10 ,  5 } ;
Line Loop(2) = { 5, 6, 7, 8, 9, 10 } ;
Plane Surface( 2 ) = {2};
Point(11) = { 76 ,  463 , 0., lc1 } ;
Point(12) = { 80 ,  464 , 0., lc1 } ;
Point(13) = { 83 ,  468 , 0., lc1 } ;
Point(14) = { 83 ,  474 , 0., lc1 } ;
Point(15) = { 79 ,  473 , 0., lc1 } ;
Point(16) = { 76 ,  469 , 0., lc1 } ;
Line(11) = { 11 ,  12 } ;
Line(12) = { 12 ,  13 } ;
Line(13) = { 13 ,  14 } ;
Line(14) = { 14 ,  15 } ;
Line(15) = { 15 ,  16 } ;
Line(16) = { 16 ,  11 } ;
Line Loop(3) = { 11, 12, 13, 14, 15, 16 } ;
Plane Surface( 3 ) = {3};
Point(17) = { 380 ,  462 , 0., lc1 } ;
Point(18) = { 384 ,  463 , 0., lc1 } ;
Point(19) = { 387 ,  467 , 0., lc1 } ;
Point(20) = { 387 ,  473 , 0., lc1 } ;
Point(21) = { 383 ,  472 , 0., lc1 } ;
Point(22) = { 380 ,  468 , 0., lc1 } ;
Line(17) = { 17 ,  18 } ;
Line(18) = { 18 ,  19 } ;
Line(19) = { 19 ,  20 } ;
Line(20) = { 20 ,  21 } ;
Line(21) = { 21 ,  22 } ;
Line(22) = { 22 ,  17 } ;
Line Loop(4) = { 17, 18, 19, 20, 21, 22 } ;
Plane Surface( 4 ) = {4};
Point(23) = { 193 ,  462 , 0., lc1 } ;
Point(24) = { 193 ,  466 , 0., lc1 } ;
Point(25) = { 190 ,  471 , 0., lc1 } ;
Point(26) = { 180 ,  480 , 0., lc1 } ;
Point(27) = { 174 ,  483 , 0., lc1 } ;
Point(28) = { 168 ,  483 , 0., lc1 } ;
Point(29) = { 166 ,  481 , 0., lc1 } ;
Point(30) = { 166 ,  477 , 0., lc1 } ;
Point(31) = { 169 ,  472 , 0., lc1 } ;
Point(32) = { 179 ,  463 , 0., lc1 } ;
Point(33) = { 185 ,  460 , 0., lc1 } ;
Point(34) = { 191 ,  460 , 0., lc1 } ;
Line(23) = { 23 ,  24 } ;
Line(24) = { 24 ,  25 } ;
Line(25) = { 25 ,  26 } ;
Line(26) = { 26 ,  27 } ;
Line(27) = { 27 ,  28 } ;
Line(28) = { 28 ,  29 } ;
Line(29) = { 29 ,  30 } ;
Line(30) = { 30 ,  31 } ;
Line(31) = { 31 ,  32 } ;
Line(32) = { 32 ,  33 } ;
Line(33) = { 33 ,  34 } ;
Line(34) = { 34 ,  23 } ;
Line Loop(5) = { 23, 24, 25, 26, 27, 28, 29, 30, 31, 32, 33, 34 } ;
Plane Surface( 5 ) = {5};
Point(35) = { 447 ,  459 , 0., lc1 } ;
Point(36) = { 446 ,  465 , 0., lc1 } ;
Point(37) = { 437 ,  475 , 0., lc1 } ;
Point(38) = { 428 ,  480 , 0., lc1 } ;
Point(39) = { 422 ,  480 , 0., lc1 } ;
Point(40) = { 420 ,  478 , 0., lc1 } ;
Point(41) = { 420 ,  474 , 0., lc1 } ;
Point(42) = { 423 ,  469 , 0., lc1 } ;
Point(43) = { 433 ,  460 , 0., lc1 } ;
Point(44) = { 439 ,  457 , 0., lc1 } ;
Point(45) = { 445 ,  457 , 0., lc1 } ;
Line(35) = { 35 ,  36 } ;
Line(36) = { 36 ,  37 } ;
Line(37) = { 37 ,  38 } ;
Line(38) = { 38 ,  39 } ;
Line(39) = { 39 ,  40 } ;
Line(40) = { 40 ,  41 } ;
Line(41) = { 41 ,  42 } ;
Line(42) = { 42 ,  43 } ;
Line(43) = { 43 ,  44 } ;
Line(44) = { 44 ,  45 } ;
Line(45) = { 45 ,  35 } ;
Line Loop(6) = { 35, 36, 37, 38, 39, 40, 41, 42, 43, 44, 45 } ;
Plane Surface( 6 ) = {6};
Point(46) = { 106 ,  451 , 0., lc1 } ;
Point(47) = { 110 ,  452 , 0., lc1 } ;
Point(48) = { 113 ,  456 , 0., lc1 } ;
Point(49) = { 113 ,  462 , 0., lc1 } ;
Point(50) = { 109 ,  461 , 0., lc1 } ;
Point(51) = { 106 ,  457 , 0., lc1 } ;
Line(46) = { 46 ,  47 } ;
Line(47) = { 47 ,  48 } ;
Line(48) = { 48 ,  49 } ;
Line(49) = { 49 ,  50 } ;
Line(50) = { 50 ,  51 } ;
Line(51) = { 51 ,  46 } ;
Line Loop(7) = { 46, 47, 48, 49, 50, 51 } ;
Plane Surface( 7 ) = {7};
Point(52) = { 61 ,  451 , 0., lc1 } ;
Point(53) = { 60 ,  458 , 0., lc1 } ;
Point(54) = { 48 ,  470 , 0., lc1 } ;
Point(55) = { 37 ,  475 , 0., lc1 } ;
Point(56) = { 31 ,  473 , 0., lc1 } ;
Point(57) = { 30 ,  470 , 0., lc1 } ;
Point(58) = { 33 ,  463 , 0., lc1 } ;
Point(59) = { 45 ,  452 , 0., lc1 } ;
Point(60) = { 55 ,  448 , 0., lc1 } ;
Point(61) = { 58 ,  448 , 0., lc1 } ;
Line(52) = { 52 ,  53 } ;
Line(53) = { 53 ,  54 } ;
Line(54) = { 54 ,  55 } ;
Line(55) = { 55 ,  56 } ;
Line(56) = { 56 ,  57 } ;
Line(57) = { 57 ,  58 } ;
Line(58) = { 58 ,  59 } ;
Line(59) = { 59 ,  60 } ;
Line(60) = { 60 ,  61 } ;
Line(61) = { 61 ,  52 } ;
Line Loop(8) = { 52, 53, 54, 55, 56, 57, 58, 59, 60, 61 } ;
Plane Surface( 8 ) = {8};
Point(62) = { 332 ,  447 , 0., lc1 } ;
Point(63) = { 331 ,  453 , 0., lc1 } ;
Point(64) = { 322 ,  463 , 0., lc1 } ;
Point(65) = { 313 ,  468 , 0., lc1 } ;
Point(66) = { 307 ,  468 , 0., lc1 } ;
Point(67) = { 305 ,  466 , 0., lc1 } ;
Point(68) = { 306 ,  460 , 0., lc1 } ;
Point(69) = { 315 ,  450 , 0., lc1 } ;
Point(70) = { 324 ,  445 , 0., lc1 } ;
Point(71) = { 330 ,  445 , 0., lc1 } ;
Line(62) = { 62 ,  63 } ;
Line(63) = { 63 ,  64 } ;
Line(64) = { 64 ,  65 } ;
Line(65) = { 65 ,  66 } ;
Line(66) = { 66 ,  67 } ;
Line(67) = { 67 ,  68 } ;
Line(68) = { 68 ,  69 } ;
Line(69) = { 69 ,  70 } ;
Line(70) = { 70 ,  71 } ;
Line(71) = { 71 ,  62 } ;
Line Loop(9) = { 62, 63, 64, 65, 66, 67, 68, 69, 70, 71 } ;
Plane Surface( 9 ) = {9};
Point(72) = { 459 ,  436 , 0., lc1 } ;
Point(73) = { 463 ,  437 , 0., lc1 } ;
Point(74) = { 466 ,  441 , 0., lc1 } ;
Point(75) = { 466 ,  447 , 0., lc1 } ;
Point(76) = { 462 ,  446 , 0., lc1 } ;
Point(77) = { 459 ,  442 , 0., lc1 } ;
Line(72) = { 72 ,  73 } ;
Line(73) = { 73 ,  74 } ;
Line(74) = { 74 ,  75 } ;
Line(75) = { 75 ,  76 } ;
Line(76) = { 76 ,  77 } ;
Line(77) = { 77 ,  72 } ;
Line Loop(10) = { 72, 73, 74, 75, 76, 77 } ;
Plane Surface( 10 ) = {10};
Point(78) = { 161 ,  437 , 0., lc1 } ;
Point(79) = { 160 ,  443 , 0., lc1 } ;
Point(80) = { 151 ,  453 , 0., lc1 } ;
Point(81) = { 142 ,  458 , 0., lc1 } ;
Point(82) = { 136 ,  458 , 0., lc1 } ;
Point(83) = { 134 ,  456 , 0., lc1 } ;
Point(84) = { 135 ,  450 , 0., lc1 } ;
Point(85) = { 144 ,  440 , 0., lc1 } ;
Point(86) = { 153 ,  435 , 0., lc1 } ;
Point(87) = { 159 ,  435 , 0., lc1 } ;
Line(78) = { 78 ,  79 } ;
Line(79) = { 79 ,  80 } ;
Line(80) = { 80 ,  81 } ;
Line(81) = { 81 ,  82 } ;
Line(82) = { 82 ,  83 } ;
Line(83) = { 83 ,  84 } ;
Line(84) = { 84 ,  85 } ;
Line(85) = { 85 ,  86 } ;
Line(86) = { 86 ,  87 } ;
Line(87) = { 87 ,  78 } ;
Line Loop(11) = { 78, 79, 80, 81, 82, 83, 84, 85, 86, 87 } ;
Plane Surface( 11 ) = {11};
Point(88) = { 235 ,  432 , 0., lc1 } ;
Point(89) = { 234 ,  438 , 0., lc1 } ;
Point(90) = { 225 ,  448 , 0., lc1 } ;
Point(91) = { 216 ,  453 , 0., lc1 } ;
Point(92) = { 210 ,  453 , 0., lc1 } ;
Point(93) = { 208 ,  451 , 0., lc1 } ;
Point(94) = { 209 ,  445 , 0., lc1 } ;
Point(95) = { 218 ,  435 , 0., lc1 } ;
Point(96) = { 227 ,  430 , 0., lc1 } ;
Point(97) = { 233 ,  430 , 0., lc1 } ;
Line(88) = { 88 ,  89 } ;
Line(89) = { 89 ,  90 } ;
Line(90) = { 90 ,  91 } ;
Line(91) = { 91 ,  92 } ;
Line(92) = { 92 ,  93 } ;
Line(93) = { 93 ,  94 } ;
Line(94) = { 94 ,  95 } ;
Line(95) = { 95 ,  96 } ;
Line(96) = { 96 ,  97 } ;
Line(97) = { 97 ,  88 } ;
Line Loop(12) = { 88, 89, 90, 91, 92, 93, 94, 95, 96, 97 } ;
Plane Surface( 12 ) = {12};
Point(98) = { 29 ,  427 , 0., lc1 } ;
Point(99) = { 33 ,  428 , 0., lc1 } ;
Point(100) = { 36 ,  432 , 0., lc1 } ;
Point(101) = { 36 ,  438 , 0., lc1 } ;
Point(102) = { 32 ,  437 , 0., lc1 } ;
Point(103) = { 29 ,  433 , 0., lc1 } ;
Line(98) = { 98 ,  99 } ;
Line(99) = { 99 ,  100 } ;
Line(100) = { 100 ,  101 } ;
Line(101) = { 101 ,  102 } ;
Line(102) = { 102 ,  103 } ;
Line(103) = { 103 ,  98 } ;
Line Loop(13) = { 98, 99, 100, 101, 102, 103 } ;
Plane Surface( 13 ) = {13};
Point(104) = { 404 ,  428 , 0., lc1 } ;
Point(105) = { 403 ,  434 , 0., lc1 } ;
Point(106) = { 394 ,  444 , 0., lc1 } ;
Point(107) = { 385 ,  449 , 0., lc1 } ;
Point(108) = { 379 ,  449 , 0., lc1 } ;
Point(109) = { 377 ,  447 , 0., lc1 } ;
Point(110) = { 378 ,  441 , 0., lc1 } ;
Point(111) = { 387 ,  431 , 0., lc1 } ;
Point(112) = { 396 ,  426 , 0., lc1 } ;
Point(113) = { 402 ,  426 , 0., lc1 } ;
Line(104) = { 104 ,  105 } ;
Line(105) = { 105 ,  106 } ;
Line(106) = { 106 ,  107 } ;
Line(107) = { 107 ,  108 } ;
Line(108) = { 108 ,  109 } ;
Line(109) = { 109 ,  110 } ;
Line(110) = { 110 ,  111 } ;
Line(111) = { 111 ,  112 } ;
Line(112) = { 112 ,  113 } ;
Line(113) = { 113 ,  104 } ;
Line Loop(14) = { 104, 105, 106, 107, 108, 109, 110, 111, 112, 113 } ;
Plane Surface( 14 ) = {14};
Point(114) = { 298 ,  426 , 0., lc1 } ;
Point(115) = { 302 ,  427 , 0., lc1 } ;
Point(116) = { 305 ,  431 , 0., lc1 } ;
Point(117) = { 305 ,  437 , 0., lc1 } ;
Point(118) = { 301 ,  436 , 0., lc1 } ;
Point(119) = { 298 ,  432 , 0., lc1 } ;
Line(114) = { 114 ,  115 } ;
Line(115) = { 115 ,  116 } ;
Line(116) = { 116 ,  117 } ;
Line(117) = { 117 ,  118 } ;
Line(118) = { 118 ,  119 } ;
Line(119) = { 119 ,  114 } ;
Line Loop(15) = { 114, 115, 116, 117, 118, 119 } ;
Plane Surface( 15 ) = {15};
Point(120) = { 450 ,  422 , 0., lc1 } ;
Point(121) = { 448 ,  427 , 0., lc1 } ;
Point(122) = { 438 ,  438 , 0., lc1 } ;
Point(123) = { 426 ,  444 , 0., lc1 } ;
Point(124) = { 420 ,  442 , 0., lc1 } ;
Point(125) = { 419 ,  439 , 0., lc1 } ;
Point(126) = { 422 ,  432 , 0., lc1 } ;
Point(127) = { 432 ,  422 , 0., lc1 } ;
Point(128) = { 441 ,  417 , 0., lc1 } ;
Point(129) = { 447 ,  417 , 0., lc1 } ;
Line(120) = { 120 ,  121 } ;
Line(121) = { 121 ,  122 } ;
Line(122) = { 122 ,  123 } ;
Line(123) = { 123 ,  124 } ;
Line(124) = { 124 ,  125 } ;
Line(125) = { 125 ,  126 } ;
Line(126) = { 126 ,  127 } ;
Line(127) = { 127 ,  128 } ;
Line(128) = { 128 ,  129 } ;
Line(129) = { 129 ,  120 } ;
Line Loop(16) = { 120, 121, 122, 123, 124, 125, 126, 127, 128, 129 } ;
Plane Surface( 16 ) = {16};
Point(130) = { 335 ,  417 , 0., lc1 } ;
Point(131) = { 339 ,  418 , 0., lc1 } ;
Point(132) = { 342 ,  422 , 0., lc1 } ;
Point(133) = { 342 ,  428 , 0., lc1 } ;
Point(134) = { 338 ,  427 , 0., lc1 } ;
Point(135) = { 335 ,  423 , 0., lc1 } ;
Line(130) = { 130 ,  131 } ;
Line(131) = { 131 ,  132 } ;
Line(132) = { 132 ,  133 } ;
Line(133) = { 133 ,  134 } ;
Line(134) = { 134 ,  135 } ;
Line(135) = { 135 ,  130 } ;
Line Loop(17) = { 130, 131, 132, 133, 134, 135 } ;
Plane Surface( 17 ) = {17};
Point(136) = { 288 ,  409 , 0., lc1 } ;
Point(137) = { 287 ,  415 , 0., lc1 } ;
Point(138) = { 278 ,  425 , 0., lc1 } ;
Point(139) = { 269 ,  430 , 0., lc1 } ;
Point(140) = { 263 ,  430 , 0., lc1 } ;
Point(141) = { 261 ,  428 , 0., lc1 } ;
Point(142) = { 262 ,  422 , 0., lc1 } ;
Point(143) = { 271 ,  412 , 0., lc1 } ;
Point(144) = { 280 ,  407 , 0., lc1 } ;
Point(145) = { 286 ,  407 , 0., lc1 } ;
Line(136) = { 136 ,  137 } ;
Line(137) = { 137 ,  138 } ;
Line(138) = { 138 ,  139 } ;
Line(139) = { 139 ,  140 } ;
Line(140) = { 140 ,  141 } ;
Line(141) = { 141 ,  142 } ;
Line(142) = { 142 ,  143 } ;
Line(143) = { 143 ,  144 } ;
Line(144) = { 144 ,  145 } ;
Line(145) = { 145 ,  136 } ;
Line Loop(18) = { 136, 137, 138, 139, 140, 141, 142, 143, 144, 145 } ;
Plane Surface( 18 ) = {18};
Point(146) = { 202 ,  406 , 0., lc1 } ;
Point(147) = { 206 ,  407 , 0., lc1 } ;
Point(148) = { 209 ,  411 , 0., lc1 } ;
Point(149) = { 209 ,  417 , 0., lc1 } ;
Point(150) = { 205 ,  416 , 0., lc1 } ;
Point(151) = { 202 ,  412 , 0., lc1 } ;
Line(146) = { 146 ,  147 } ;
Line(147) = { 147 ,  148 } ;
Line(148) = { 148 ,  149 } ;
Line(149) = { 149 ,  150 } ;
Line(150) = { 150 ,  151 } ;
Line(151) = { 151 ,  146 } ;
Line Loop(19) = { 146, 147, 148, 149, 150, 151 } ;
Plane Surface( 19 ) = {19};
Point(152) = { 144 ,  408 , 0., lc1 } ;
Point(153) = { 143 ,  414 , 0., lc1 } ;
Point(154) = { 134 ,  424 , 0., lc1 } ;
Point(155) = { 125 ,  429 , 0., lc1 } ;
Point(156) = { 119 ,  429 , 0., lc1 } ;
Point(157) = { 117 ,  427 , 0., lc1 } ;
Point(158) = { 118 ,  421 , 0., lc1 } ;
Point(159) = { 127 ,  411 , 0., lc1 } ;
Point(160) = { 136 ,  406 , 0., lc1 } ;
Point(161) = { 142 ,  406 , 0., lc1 } ;
Line(152) = { 152 ,  153 } ;
Line(153) = { 153 ,  154 } ;
Line(154) = { 154 ,  155 } ;
Line(155) = { 155 ,  156 } ;
Line(156) = { 156 ,  157 } ;
Line(157) = { 157 ,  158 } ;
Line(158) = { 158 ,  159 } ;
Line(159) = { 159 ,  160 } ;
Line(160) = { 160 ,  161 } ;
Line(161) = { 161 ,  152 } ;
Line Loop(20) = { 152, 153, 154, 155, 156, 157, 158, 159, 160, 161 } ;
Plane Surface( 20 ) = {20};
Point(162) = { 74 ,  394 , 0., lc1 } ;
Point(163) = { 73 ,  400 , 0., lc1 } ;
Point(164) = { 64 ,  410 , 0., lc1 } ;
Point(165) = { 55 ,  415 , 0., lc1 } ;
Point(166) = { 49 ,  415 , 0., lc1 } ;
Point(167) = { 47 ,  413 , 0., lc1 } ;
Point(168) = { 48 ,  407 , 0., lc1 } ;
Point(169) = { 57 ,  397 , 0., lc1 } ;
Point(170) = { 66 ,  392 , 0., lc1 } ;
Point(171) = { 72 ,  392 , 0., lc1 } ;
Line(162) = { 162 ,  163 } ;
Line(163) = { 163 ,  164 } ;
Line(164) = { 164 ,  165 } ;
Line(165) = { 165 ,  166 } ;
Line(166) = { 166 ,  167 } ;
Line(167) = { 167 ,  168 } ;
Line(168) = { 168 ,  169 } ;
Line(169) = { 169 ,  170 } ;
Line(170) = { 170 ,  171 } ;
Line(171) = { 171 ,  162 } ;
Line Loop(21) = { 162, 163, 164, 165, 166, 167, 168, 169, 170, 171 } ;
Plane Surface( 21 ) = {21};
Point(172) = { 436 ,  389 , 0., lc1 } ;
Point(173) = { 440 ,  390 , 0., lc1 } ;
Point(174) = { 443 ,  394 , 0., lc1 } ;
Point(175) = { 443 ,  400 , 0., lc1 } ;
Point(176) = { 439 ,  399 , 0., lc1 } ;
Point(177) = { 436 ,  395 , 0., lc1 } ;
Line(172) = { 172 ,  173 } ;
Line(173) = { 173 ,  174 } ;
Line(174) = { 174 ,  175 } ;
Line(175) = { 175 ,  176 } ;
Line(176) = { 176 ,  177 } ;
Line(177) = { 177 ,  172 } ;
Line Loop(22) = { 172, 173, 174, 175, 176, 177 } ;
Plane Surface( 22 ) = {22};
Point(178) = { 372 ,  389 , 0., lc1 } ;
Point(179) = { 371 ,  395 , 0., lc1 } ;
Point(180) = { 362 ,  405 , 0., lc1 } ;
Point(181) = { 353 ,  410 , 0., lc1 } ;
Point(182) = { 347 ,  410 , 0., lc1 } ;
Point(183) = { 345 ,  408 , 0., lc1 } ;
Point(184) = { 346 ,  402 , 0., lc1 } ;
Point(185) = { 355 ,  392 , 0., lc1 } ;
Point(186) = { 364 ,  387 , 0., lc1 } ;
Point(187) = { 370 ,  387 , 0., lc1 } ;
Line(178) = { 178 ,  179 } ;
Line(179) = { 179 ,  180 } ;
Line(180) = { 180 ,  181 } ;
Line(181) = { 181 ,  182 } ;
Line(182) = { 182 ,  183 } ;
Line(183) = { 183 ,  184 } ;
Line(184) = { 184 ,  185 } ;
Line(185) = { 185 ,  186 } ;
Line(186) = { 186 ,  187 } ;
Line(187) = { 187 ,  178 } ;
Line Loop(23) = { 178, 179, 180, 181, 182, 183, 184, 185, 186, 187 } ;
Plane Surface( 23 ) = {23};
Point(188) = { 126 ,  385 , 0., lc1 } ;
Point(189) = { 130 ,  386 , 0., lc1 } ;
Point(190) = { 133 ,  390 , 0., lc1 } ;
Point(191) = { 133 ,  396 , 0., lc1 } ;
Point(192) = { 129 ,  395 , 0., lc1 } ;
Point(193) = { 126 ,  391 , 0., lc1 } ;
Line(188) = { 188 ,  189 } ;
Line(189) = { 189 ,  190 } ;
Line(190) = { 190 ,  191 } ;
Line(191) = { 191 ,  192 } ;
Line(192) = { 192 ,  193 } ;
Line(193) = { 193 ,  188 } ;
Line Loop(24) = { 188, 189, 190, 191, 192, 193 } ;
Plane Surface( 24 ) = {24};
Point(194) = { 274 ,  386 , 0., lc1 } ;
Point(195) = { 273 ,  392 , 0., lc1 } ;
Point(196) = { 264 ,  402 , 0., lc1 } ;
Point(197) = { 255 ,  407 , 0., lc1 } ;
Point(198) = { 249 ,  407 , 0., lc1 } ;
Point(199) = { 247 ,  405 , 0., lc1 } ;
Point(200) = { 248 ,  399 , 0., lc1 } ;
Point(201) = { 257 ,  389 , 0., lc1 } ;
Point(202) = { 266 ,  384 , 0., lc1 } ;
Point(203) = { 272 ,  384 , 0., lc1 } ;
Line(194) = { 194 ,  195 } ;
Line(195) = { 195 ,  196 } ;
Line(196) = { 196 ,  197 } ;
Line(197) = { 197 ,  198 } ;
Line(198) = { 198 ,  199 } ;
Line(199) = { 199 ,  200 } ;
Line(200) = { 200 ,  201 } ;
Line(201) = { 201 ,  202 } ;
Line(202) = { 202 ,  203 } ;
Line(203) = { 203 ,  194 } ;
Line Loop(25) = { 194, 195, 196, 197, 198, 199, 200, 201, 202, 203 } ;
Plane Surface( 25 ) = {25};
Point(204) = { 37 ,  381 , 0., lc1 } ;
Point(205) = { 41 ,  382 , 0., lc1 } ;
Point(206) = { 44 ,  386 , 0., lc1 } ;
Point(207) = { 44 ,  392 , 0., lc1 } ;
Point(208) = { 40 ,  391 , 0., lc1 } ;
Point(209) = { 37 ,  387 , 0., lc1 } ;
Line(204) = { 204 ,  205 } ;
Line(205) = { 205 ,  206 } ;
Line(206) = { 206 ,  207 } ;
Line(207) = { 207 ,  208 } ;
Line(208) = { 208 ,  209 } ;
Line(209) = { 209 ,  204 } ;
Line Loop(26) = { 204, 205, 206, 207, 208, 209 } ;
Plane Surface( 26 ) = {26};
Point(210) = { 109 ,  381 , 0., lc1 } ;
Point(211) = { 108 ,  387 , 0., lc1 } ;
Point(212) = { 99 ,  397 , 0., lc1 } ;
Point(213) = { 90 ,  402 , 0., lc1 } ;
Point(214) = { 84 ,  402 , 0., lc1 } ;
Point(215) = { 82 ,  400 , 0., lc1 } ;
Point(216) = { 83 ,  394 , 0., lc1 } ;
Point(217) = { 92 ,  384 , 0., lc1 } ;
Point(218) = { 101 ,  379 , 0., lc1 } ;
Point(219) = { 107 ,  379 , 0., lc1 } ;
Line(210) = { 210 ,  211 } ;
Line(211) = { 211 ,  212 } ;
Line(212) = { 212 ,  213 } ;
Line(213) = { 213 ,  214 } ;
Line(214) = { 214 ,  215 } ;
Line(215) = { 215 ,  216 } ;
Line(216) = { 216 ,  217 } ;
Line(217) = { 217 ,  218 } ;
Line(218) = { 218 ,  219 } ;
Line(219) = { 219 ,  210 } ;
Line Loop(27) = { 210, 211, 212, 213, 214, 215, 216, 217, 218, 219 } ;
Plane Surface( 27 ) = {27};
Point(220) = { 195 ,  374 , 0., lc1 } ;
Point(221) = { 194 ,  380 , 0., lc1 } ;
Point(222) = { 185 ,  390 , 0., lc1 } ;
Point(223) = { 176 ,  395 , 0., lc1 } ;
Point(224) = { 170 ,  395 , 0., lc1 } ;
Point(225) = { 168 ,  393 , 0., lc1 } ;
Point(226) = { 169 ,  387 , 0., lc1 } ;
Point(227) = { 178 ,  377 , 0., lc1 } ;
Point(228) = { 187 ,  372 , 0., lc1 } ;
Point(229) = { 193 ,  372 , 0., lc1 } ;
Line(220) = { 220 ,  221 } ;
Line(221) = { 221 ,  222 } ;
Line(222) = { 222 ,  223 } ;
Line(223) = { 223 ,  224 } ;
Line(224) = { 224 ,  225 } ;
Line(225) = { 225 ,  226 } ;
Line(226) = { 226 ,  227 } ;
Line(227) = { 227 ,  228 } ;
Line(228) = { 228 ,  229 } ;
Line(229) = { 229 ,  220 } ;
Line Loop(28) = { 220, 221, 222, 223, 224, 225, 226, 227, 228, 229 } ;
Plane Surface( 28 ) = {28};
Point(230) = { 335 ,  372 , 0., lc1 } ;
Point(231) = { 334 ,  378 , 0., lc1 } ;
Point(232) = { 325 ,  388 , 0., lc1 } ;
Point(233) = { 316 ,  393 , 0., lc1 } ;
Point(234) = { 310 ,  393 , 0., lc1 } ;
Point(235) = { 308 ,  391 , 0., lc1 } ;
Point(236) = { 309 ,  385 , 0., lc1 } ;
Point(237) = { 318 ,  375 , 0., lc1 } ;
Point(238) = { 327 ,  370 , 0., lc1 } ;
Point(239) = { 333 ,  370 , 0., lc1 } ;
Line(230) = { 230 ,  231 } ;
Line(231) = { 231 ,  232 } ;
Line(232) = { 232 ,  233 } ;
Line(233) = { 233 ,  234 } ;
Line(234) = { 234 ,  235 } ;
Line(235) = { 235 ,  236 } ;
Line(236) = { 236 ,  237 } ;
Line(237) = { 237 ,  238 } ;
Line(238) = { 238 ,  239 } ;
Line(239) = { 239 ,  230 } ;
Line Loop(29) = { 230, 231, 232, 233, 234, 235, 236, 237, 238, 239 } ;
Plane Surface( 29 ) = {29};
Point(240) = { 236 ,  370 , 0., lc1 } ;
Point(241) = { 240 ,  371 , 0., lc1 } ;
Point(242) = { 243 ,  375 , 0., lc1 } ;
Point(243) = { 243 ,  381 , 0., lc1 } ;
Point(244) = { 239 ,  380 , 0., lc1 } ;
Point(245) = { 236 ,  376 , 0., lc1 } ;
Line(240) = { 240 ,  241 } ;
Line(241) = { 241 ,  242 } ;
Line(242) = { 242 ,  243 } ;
Line(243) = { 243 ,  244 } ;
Line(244) = { 244 ,  245 } ;
Line(245) = { 245 ,  240 } ;
Line Loop(30) = { 240, 241, 242, 243, 244, 245 } ;
Plane Surface( 30 ) = {30};
Point(246) = { 307 ,  352 , 0., lc1 } ;
Point(247) = { 306 ,  358 , 0., lc1 } ;
Point(248) = { 297 ,  368 , 0., lc1 } ;
Point(249) = { 288 ,  373 , 0., lc1 } ;
Point(250) = { 282 ,  373 , 0., lc1 } ;
Point(251) = { 280 ,  371 , 0., lc1 } ;
Point(252) = { 281 ,  365 , 0., lc1 } ;
Point(253) = { 290 ,  355 , 0., lc1 } ;
Point(254) = { 299 ,  350 , 0., lc1 } ;
Point(255) = { 305 ,  350 , 0., lc1 } ;
Line(246) = { 246 ,  247 } ;
Line(247) = { 247 ,  248 } ;
Line(248) = { 248 ,  249 } ;
Line(249) = { 249 ,  250 } ;
Line(250) = { 250 ,  251 } ;
Line(251) = { 251 ,  252 } ;
Line(252) = { 252 ,  253 } ;
Line(253) = { 253 ,  254 } ;
Line(254) = { 254 ,  255 } ;
Line(255) = { 255 ,  246 } ;
Line Loop(31) = { 246, 247, 248, 249, 250, 251, 252, 253, 254, 255 } ;
Plane Surface( 31 ) = {31};
Point(256) = { 494 ,  351 , 0., lc1 } ;
Point(257) = { 493 ,  357 , 0., lc1 } ;
Point(258) = { 484 ,  367 , 0., lc1 } ;
Point(259) = { 475 ,  372 , 0., lc1 } ;
Point(260) = { 469 ,  372 , 0., lc1 } ;
Point(261) = { 467 ,  370 , 0., lc1 } ;
Point(262) = { 468 ,  364 , 0., lc1 } ;
Point(263) = { 477 ,  354 , 0., lc1 } ;
Point(264) = { 486 ,  349 , 0., lc1 } ;
Point(265) = { 492 ,  349 , 0., lc1 } ;
Line(256) = { 256 ,  257 } ;
Line(257) = { 257 ,  258 } ;
Line(258) = { 258 ,  259 } ;
Line(259) = { 259 ,  260 } ;
Line(260) = { 260 ,  261 } ;
Line(261) = { 261 ,  262 } ;
Line(262) = { 262 ,  263 } ;
Line(263) = { 263 ,  264 } ;
Line(264) = { 264 ,  265 } ;
Line(265) = { 265 ,  256 } ;
Line Loop(32) = { 256, 257, 258, 259, 260, 261, 262, 263, 264, 265 } ;
Plane Surface( 32 ) = {32};
Point(266) = { 208 ,  347 , 0., lc1 } ;
Point(267) = { 207 ,  353 , 0., lc1 } ;
Point(268) = { 198 ,  363 , 0., lc1 } ;
Point(269) = { 189 ,  368 , 0., lc1 } ;
Point(270) = { 183 ,  368 , 0., lc1 } ;
Point(271) = { 181 ,  366 , 0., lc1 } ;
Point(272) = { 182 ,  360 , 0., lc1 } ;
Point(273) = { 191 ,  350 , 0., lc1 } ;
Point(274) = { 200 ,  345 , 0., lc1 } ;
Point(275) = { 206 ,  345 , 0., lc1 } ;
Line(266) = { 266 ,  267 } ;
Line(267) = { 267 ,  268 } ;
Line(268) = { 268 ,  269 } ;
Line(269) = { 269 ,  270 } ;
Line(270) = { 270 ,  271 } ;
Line(271) = { 271 ,  272 } ;
Line(272) = { 272 ,  273 } ;
Line(273) = { 273 ,  274 } ;
Line(274) = { 274 ,  275 } ;
Line(275) = { 275 ,  266 } ;
Line Loop(33) = { 266, 267, 268, 269, 270, 271, 272, 273, 274, 275 } ;
Plane Surface( 33 ) = {33};
Point(276) = { 59 ,  345 , 0., lc1 } ;
Point(277) = { 63 ,  346 , 0., lc1 } ;
Point(278) = { 66 ,  350 , 0., lc1 } ;
Point(279) = { 66 ,  356 , 0., lc1 } ;
Point(280) = { 62 ,  355 , 0., lc1 } ;
Point(281) = { 59 ,  351 , 0., lc1 } ;
Line(276) = { 276 ,  277 } ;
Line(277) = { 277 ,  278 } ;
Line(278) = { 278 ,  279 } ;
Line(279) = { 279 ,  280 } ;
Line(280) = { 280 ,  281 } ;
Line(281) = { 281 ,  276 } ;
Line Loop(34) = { 276, 277, 278, 279, 280, 281 } ;
Plane Surface( 34 ) = {34};
Point(282) = { 253 ,  344 , 0., lc1 } ;
Point(283) = { 257 ,  345 , 0., lc1 } ;
Point(284) = { 260 ,  349 , 0., lc1 } ;
Point(285) = { 260 ,  355 , 0., lc1 } ;
Point(286) = { 256 ,  354 , 0., lc1 } ;
Point(287) = { 253 ,  350 , 0., lc1 } ;
Line(282) = { 282 ,  283 } ;
Line(283) = { 283 ,  284 } ;
Line(284) = { 284 ,  285 } ;
Line(285) = { 285 ,  286 } ;
Line(286) = { 286 ,  287 } ;
Line(287) = { 287 ,  282 } ;
Line Loop(35) = { 282, 283, 284, 285, 286, 287 } ;
Plane Surface( 35 ) = {35};
Point(288) = { 101 ,  341 , 0., lc1 } ;
Point(289) = { 105 ,  342 , 0., lc1 } ;
Point(290) = { 108 ,  346 , 0., lc1 } ;
Point(291) = { 108 ,  352 , 0., lc1 } ;
Point(292) = { 104 ,  351 , 0., lc1 } ;
Point(293) = { 101 ,  347 , 0., lc1 } ;
Line(288) = { 288 ,  289 } ;
Line(289) = { 289 ,  290 } ;
Line(290) = { 290 ,  291 } ;
Line(291) = { 291 ,  292 } ;
Line(292) = { 292 ,  293 } ;
Line(293) = { 293 ,  288 } ;
Line Loop(36) = { 288, 289, 290, 291, 292, 293 } ;
Plane Surface( 36 ) = {36};
Point(294) = { 156 ,  332 , 0., lc1 } ;
Point(295) = { 155 ,  338 , 0., lc1 } ;
Point(296) = { 146 ,  348 , 0., lc1 } ;
Point(297) = { 137 ,  353 , 0., lc1 } ;
Point(298) = { 131 ,  353 , 0., lc1 } ;
Point(299) = { 129 ,  351 , 0., lc1 } ;
Point(300) = { 130 ,  345 , 0., lc1 } ;
Point(301) = { 139 ,  335 , 0., lc1 } ;
Point(302) = { 148 ,  330 , 0., lc1 } ;
Point(303) = { 154 ,  330 , 0., lc1 } ;
Line(294) = { 294 ,  295 } ;
Line(295) = { 295 ,  296 } ;
Line(296) = { 296 ,  297 } ;
Line(297) = { 297 ,  298 } ;
Line(298) = { 298 ,  299 } ;
Line(299) = { 299 ,  300 } ;
Line(300) = { 300 ,  301 } ;
Line(301) = { 301 ,  302 } ;
Line(302) = { 302 ,  303 } ;
Line(303) = { 303 ,  294 } ;
Line Loop(37) = { 294, 295, 296, 297, 298, 299, 300, 301, 302, 303 } ;
Plane Surface( 37 ) = {37};
Point(304) = { 416 ,  323 , 0., lc1 } ;
Point(305) = { 418 ,  325 , 0., lc1 } ;
Point(306) = { 418 ,  333 , 0., lc1 } ;
Point(307) = { 411 ,  360 , 0., lc1 } ;
Point(308) = { 400 ,  372 , 0., lc1 } ;
Point(309) = { 394 ,  376 , 0., lc1 } ;
Point(310) = { 385 ,  378 , 0., lc1 } ;
Point(311) = { 382 ,  375 , 0., lc1 } ;
Point(312) = { 381 ,  371 , 0., lc1 } ;
Point(313) = { 389 ,  339 , 0., lc1 } ;
Point(314) = { 399 ,  328 , 0., lc1 } ;
Point(315) = { 405 ,  324 , 0., lc1 } ;
Point(316) = { 411 ,  322 , 0., lc1 } ;
Line(304) = { 304 ,  305 } ;
Line(305) = { 305 ,  306 } ;
Line(306) = { 306 ,  307 } ;
Line(307) = { 307 ,  308 } ;
Line(308) = { 308 ,  309 } ;
Line(309) = { 309 ,  310 } ;
Line(310) = { 310 ,  311 } ;
Line(311) = { 311 ,  312 } ;
Line(312) = { 312 ,  313 } ;
Line(313) = { 313 ,  314 } ;
Line(314) = { 314 ,  315 } ;
Line(315) = { 315 ,  316 } ;
Line(316) = { 316 ,  304 } ;
Line Loop(38) = { 304, 305, 306, 307, 308, 309, 310, 311, 312, 313, 314, 315, 316 } ;
Plane Surface( 38 ) = {38};
Point(317) = { 49 ,  320 , 0., lc1 } ;
Point(318) = { 48 ,  326 , 0., lc1 } ;
Point(319) = { 39 ,  336 , 0., lc1 } ;
Point(320) = { 30 ,  341 , 0., lc1 } ;
Point(321) = { 24 ,  341 , 0., lc1 } ;
Point(322) = { 22 ,  339 , 0., lc1 } ;
Point(323) = { 23 ,  333 , 0., lc1 } ;
Point(324) = { 32 ,  323 , 0., lc1 } ;
Point(325) = { 41 ,  318 , 0., lc1 } ;
Point(326) = { 47 ,  318 , 0., lc1 } ;
Line(317) = { 317 ,  318 } ;
Line(318) = { 318 ,  319 } ;
Line(319) = { 319 ,  320 } ;
Line(320) = { 320 ,  321 } ;
Line(321) = { 321 ,  322 } ;
Line(322) = { 322 ,  323 } ;
Line(323) = { 323 ,  324 } ;
Line(324) = { 324 ,  325 } ;
Line(325) = { 325 ,  326 } ;
Line(326) = { 326 ,  317 } ;
Line Loop(39) = { 317, 318, 319, 320, 321, 322, 323, 324, 325, 326 } ;
Plane Surface( 39 ) = {39};
Point(327) = { 306 ,  316 , 0., lc1 } ;
Point(328) = { 305 ,  322 , 0., lc1 } ;
Point(329) = { 296 ,  332 , 0., lc1 } ;
Point(330) = { 287 ,  337 , 0., lc1 } ;
Point(331) = { 281 ,  337 , 0., lc1 } ;
Point(332) = { 279 ,  335 , 0., lc1 } ;
Point(333) = { 280 ,  329 , 0., lc1 } ;
Point(334) = { 289 ,  319 , 0., lc1 } ;
Point(335) = { 298 ,  314 , 0., lc1 } ;
Point(336) = { 304 ,  314 , 0., lc1 } ;
Line(327) = { 327 ,  328 } ;
Line(328) = { 328 ,  329 } ;
Line(329) = { 329 ,  330 } ;
Line(330) = { 330 ,  331 } ;
Line(331) = { 331 ,  332 } ;
Line(332) = { 332 ,  333 } ;
Line(333) = { 333 ,  334 } ;
Line(334) = { 334 ,  335 } ;
Line(335) = { 335 ,  336 } ;
Line(336) = { 336 ,  327 } ;
Line Loop(40) = { 327, 328, 329, 330, 331, 332, 333, 334, 335, 336 } ;
Plane Surface( 40 ) = {40};
Point(337) = { 244 ,  315 , 0., lc1 } ;
Point(338) = { 243 ,  321 , 0., lc1 } ;
Point(339) = { 234 ,  331 , 0., lc1 } ;
Point(340) = { 225 ,  336 , 0., lc1 } ;
Point(341) = { 219 ,  336 , 0., lc1 } ;
Point(342) = { 217 ,  334 , 0., lc1 } ;
Point(343) = { 218 ,  328 , 0., lc1 } ;
Point(344) = { 227 ,  318 , 0., lc1 } ;
Point(345) = { 236 ,  313 , 0., lc1 } ;
Point(346) = { 242 ,  313 , 0., lc1 } ;
Line(337) = { 337 ,  338 } ;
Line(338) = { 338 ,  339 } ;
Line(339) = { 339 ,  340 } ;
Line(340) = { 340 ,  341 } ;
Line(341) = { 341 ,  342 } ;
Line(342) = { 342 ,  343 } ;
Line(343) = { 343 ,  344 } ;
Line(344) = { 344 ,  345 } ;
Line(345) = { 345 ,  346 } ;
Line(346) = { 346 ,  337 } ;
Line Loop(41) = { 337, 338, 339, 340, 341, 342, 343, 344, 345, 346 } ;
Plane Surface( 41 ) = {41};
Point(347) = { 435 ,  312 , 0., lc1 } ;
Point(348) = { 439 ,  313 , 0., lc1 } ;
Point(349) = { 442 ,  317 , 0., lc1 } ;
Point(350) = { 442 ,  323 , 0., lc1 } ;
Point(351) = { 438 ,  322 , 0., lc1 } ;
Point(352) = { 435 ,  318 , 0., lc1 } ;
Line(347) = { 347 ,  348 } ;
Line(348) = { 348 ,  349 } ;
Line(349) = { 349 ,  350 } ;
Line(350) = { 350 ,  351 } ;
Line(351) = { 351 ,  352 } ;
Line(352) = { 352 ,  347 } ;
Line Loop(42) = { 347, 348, 349, 350, 351, 352 } ;
Plane Surface( 42 ) = {42};
Point(353) = { 140 ,  312 , 0., lc1 } ;
Point(354) = { 144 ,  313 , 0., lc1 } ;
Point(355) = { 147 ,  317 , 0., lc1 } ;
Point(356) = { 147 ,  323 , 0., lc1 } ;
Point(357) = { 143 ,  322 , 0., lc1 } ;
Point(358) = { 140 ,  318 , 0., lc1 } ;
Line(353) = { 353 ,  354 } ;
Line(354) = { 354 ,  355 } ;
Line(355) = { 355 ,  356 } ;
Line(356) = { 356 ,  357 } ;
Line(357) = { 357 ,  358 } ;
Line(358) = { 358 ,  353 } ;
Line Loop(43) = { 353, 354, 355, 356, 357, 358 } ;
Plane Surface( 43 ) = {43};
Point(359) = { 75 ,  311 , 0., lc1 } ;
Point(360) = { 79 ,  312 , 0., lc1 } ;
Point(361) = { 82 ,  316 , 0., lc1 } ;
Point(362) = { 82 ,  322 , 0., lc1 } ;
Point(363) = { 78 ,  321 , 0., lc1 } ;
Point(364) = { 75 ,  317 , 0., lc1 } ;
Line(359) = { 359 ,  360 } ;
Line(360) = { 360 ,  361 } ;
Line(361) = { 361 ,  362 } ;
Line(362) = { 362 ,  363 } ;
Line(363) = { 363 ,  364 } ;
Line(364) = { 364 ,  359 } ;
Line Loop(44) = { 359, 360, 361, 362, 363, 364 } ;
Plane Surface( 44 ) = {44};
Point(365) = { 210 ,  302 , 0., lc1 } ;
Point(366) = { 214 ,  303 , 0., lc1 } ;
Point(367) = { 217 ,  307 , 0., lc1 } ;
Point(368) = { 217 ,  313 , 0., lc1 } ;
Point(369) = { 213 ,  312 , 0., lc1 } ;
Point(370) = { 210 ,  308 , 0., lc1 } ;
Line(365) = { 365 ,  366 } ;
Line(366) = { 366 ,  367 } ;
Line(367) = { 367 ,  368 } ;
Line(368) = { 368 ,  369 } ;
Line(369) = { 369 ,  370 } ;
Line(370) = { 370 ,  365 } ;
Line Loop(45) = { 365, 366, 367, 368, 369, 370 } ;
Plane Surface( 45 ) = {45};
Point(371) = { 169 ,  298 , 0., lc1 } ;
Point(372) = { 173 ,  299 , 0., lc1 } ;
Point(373) = { 176 ,  303 , 0., lc1 } ;
Point(374) = { 176 ,  309 , 0., lc1 } ;
Point(375) = { 172 ,  308 , 0., lc1 } ;
Point(376) = { 169 ,  304 , 0., lc1 } ;
Line(371) = { 371 ,  372 } ;
Line(372) = { 372 ,  373 } ;
Line(373) = { 373 ,  374 } ;
Line(374) = { 374 ,  375 } ;
Line(375) = { 375 ,  376 } ;
Line(376) = { 376 ,  371 } ;
Line Loop(46) = { 371, 372, 373, 374, 375, 376 } ;
Plane Surface( 46 ) = {46};
Point(377) = { 374 ,  293 , 0., lc1 } ;
Point(378) = { 373 ,  299 , 0., lc1 } ;
Point(379) = { 364 ,  309 , 0., lc1 } ;
Point(380) = { 355 ,  314 , 0., lc1 } ;
Point(381) = { 349 ,  314 , 0., lc1 } ;
Point(382) = { 347 ,  312 , 0., lc1 } ;
Point(383) = { 348 ,  306 , 0., lc1 } ;
Point(384) = { 357 ,  296 , 0., lc1 } ;
Point(385) = { 366 ,  291 , 0., lc1 } ;
Point(386) = { 372 ,  291 , 0., lc1 } ;
Line(377) = { 377 ,  378 } ;
Line(378) = { 378 ,  379 } ;
Line(379) = { 379 ,  380 } ;
Line(380) = { 380 ,  381 } ;
Line(381) = { 381 ,  382 } ;
Line(382) = { 382 ,  383 } ;
Line(383) = { 383 ,  384 } ;
Line(384) = { 384 ,  385 } ;
Line(385) = { 385 ,  386 } ;
Line(386) = { 386 ,  377 } ;
Line Loop(47) = { 377, 378, 379, 380, 381, 382, 383, 384, 385, 386 } ;
Plane Surface( 47 ) = {47};
Point(387) = { 275 ,  291 , 0., lc1 } ;
Point(388) = { 279 ,  292 , 0., lc1 } ;
Point(389) = { 282 ,  296 , 0., lc1 } ;
Point(390) = { 282 ,  302 , 0., lc1 } ;
Point(391) = { 278 ,  301 , 0., lc1 } ;
Point(392) = { 275 ,  297 , 0., lc1 } ;
Line(387) = { 387 ,  388 } ;
Line(388) = { 388 ,  389 } ;
Line(389) = { 389 ,  390 } ;
Line(390) = { 390 ,  391 } ;
Line(391) = { 391 ,  392 } ;
Line(392) = { 392 ,  387 } ;
Line Loop(48) = { 387, 388, 389, 390, 391, 392 } ;
Plane Surface( 48 ) = {48};
Point(393) = { 33 ,  289 , 0., lc1 } ;
Point(394) = { 37 ,  290 , 0., lc1 } ;
Point(395) = { 40 ,  294 , 0., lc1 } ;
Point(396) = { 40 ,  300 , 0., lc1 } ;
Point(397) = { 36 ,  299 , 0., lc1 } ;
Point(398) = { 32 ,  294 , 0., lc1 } ;
Line(393) = { 393 ,  394 } ;
Line(394) = { 394 ,  395 } ;
Line(395) = { 395 ,  396 } ;
Line(396) = { 396 ,  397 } ;
Line(397) = { 397 ,  398 } ;
Line(398) = { 398 ,  393 } ;
Line Loop(49) = { 393, 394, 395, 396, 397, 398 } ;
Plane Surface( 49 ) = {49};
Point(399) = { 124 ,  282 , 0., lc1 } ;
Point(400) = { 123 ,  288 , 0., lc1 } ;
Point(401) = { 114 ,  298 , 0., lc1 } ;
Point(402) = { 105 ,  303 , 0., lc1 } ;
Point(403) = { 99 ,  303 , 0., lc1 } ;
Point(404) = { 97 ,  301 , 0., lc1 } ;
Point(405) = { 98 ,  295 , 0., lc1 } ;
Point(406) = { 107 ,  285 , 0., lc1 } ;
Point(407) = { 116 ,  280 , 0., lc1 } ;
Point(408) = { 122 ,  280 , 0., lc1 } ;
Line(399) = { 399 ,  400 } ;
Line(400) = { 400 ,  401 } ;
Line(401) = { 401 ,  402 } ;
Line(402) = { 402 ,  403 } ;
Line(403) = { 403 ,  404 } ;
Line(404) = { 404 ,  405 } ;
Line(405) = { 405 ,  406 } ;
Line(406) = { 406 ,  407 } ;
Line(407) = { 407 ,  408 } ;
Line(408) = { 408 ,  399 } ;
Line Loop(50) = { 399, 400, 401, 402, 403, 404, 405, 406, 407, 408 } ;
Plane Surface( 50 ) = {50};
Point(409) = { 470 ,  271 , 0., lc1 } ;
Point(410) = { 469 ,  277 , 0., lc1 } ;
Point(411) = { 460 ,  287 , 0., lc1 } ;
Point(412) = { 451 ,  292 , 0., lc1 } ;
Point(413) = { 445 ,  292 , 0., lc1 } ;
Point(414) = { 443 ,  290 , 0., lc1 } ;
Point(415) = { 444 ,  284 , 0., lc1 } ;
Point(416) = { 453 ,  274 , 0., lc1 } ;
Point(417) = { 462 ,  269 , 0., lc1 } ;
Point(418) = { 468 ,  269 , 0., lc1 } ;
Line(409) = { 409 ,  410 } ;
Line(410) = { 410 ,  411 } ;
Line(411) = { 411 ,  412 } ;
Line(412) = { 412 ,  413 } ;
Line(413) = { 413 ,  414 } ;
Line(414) = { 414 ,  415 } ;
Line(415) = { 415 ,  416 } ;
Line(416) = { 416 ,  417 } ;
Line(417) = { 417 ,  418 } ;
Line(418) = { 418 ,  409 } ;
Line Loop(51) = { 409, 410, 411, 412, 413, 414, 415, 416, 417, 418 } ;
Plane Surface( 51 ) = {51};
Point(419) = { 51 ,  265 , 0., lc1 } ;
Point(420) = { 55 ,  266 , 0., lc1 } ;
Point(421) = { 58 ,  270 , 0., lc1 } ;
Point(422) = { 58 ,  276 , 0., lc1 } ;
Point(423) = { 54 ,  275 , 0., lc1 } ;
Point(424) = { 51 ,  271 , 0., lc1 } ;
Line(419) = { 419 ,  420 } ;
Line(420) = { 420 ,  421 } ;
Line(421) = { 421 ,  422 } ;
Line(422) = { 422 ,  423 } ;
Line(423) = { 423 ,  424 } ;
Line(424) = { 424 ,  419 } ;
Line Loop(52) = { 419, 420, 421, 422, 423, 424 } ;
Plane Surface( 52 ) = {52};
Point(425) = { 91 ,  253 , 0., lc1 } ;
Point(426) = { 90 ,  259 , 0., lc1 } ;
Point(427) = { 81 ,  269 , 0., lc1 } ;
Point(428) = { 72 ,  274 , 0., lc1 } ;
Point(429) = { 66 ,  274 , 0., lc1 } ;
Point(430) = { 64 ,  272 , 0., lc1 } ;
Point(431) = { 65 ,  266 , 0., lc1 } ;
Point(432) = { 74 ,  256 , 0., lc1 } ;
Point(433) = { 83 ,  251 , 0., lc1 } ;
Point(434) = { 89 ,  251 , 0., lc1 } ;
Line(425) = { 425 ,  426 } ;
Line(426) = { 426 ,  427 } ;
Line(427) = { 427 ,  428 } ;
Line(428) = { 428 ,  429 } ;
Line(429) = { 429 ,  430 } ;
Line(430) = { 430 ,  431 } ;
Line(431) = { 431 ,  432 } ;
Line(432) = { 432 ,  433 } ;
Line(433) = { 433 ,  434 } ;
Line(434) = { 434 ,  425 } ;
Line Loop(53) = { 425, 426, 427, 428, 429, 430, 431, 432, 433, 434 } ;
Plane Surface( 53 ) = {53};
Point(435) = { 272 ,  250 , 0., lc1 } ;
Point(436) = { 276 ,  251 , 0., lc1 } ;
Point(437) = { 279 ,  255 , 0., lc1 } ;
Point(438) = { 279 ,  261 , 0., lc1 } ;
Point(439) = { 275 ,  260 , 0., lc1 } ;
Point(440) = { 272 ,  256 , 0., lc1 } ;
Line(435) = { 435 ,  436 } ;
Line(436) = { 436 ,  437 } ;
Line(437) = { 437 ,  438 } ;
Line(438) = { 438 ,  439 } ;
Line(439) = { 439 ,  440 } ;
Line(440) = { 440 ,  435 } ;
Line Loop(54) = { 435, 436, 437, 438, 439, 440 } ;
Plane Surface( 54 ) = {54};
Point(441) = { 335 ,  250 , 0., lc1 } ;
Point(442) = { 335 ,  254 , 0., lc1 } ;
Point(443) = { 332 ,  259 , 0., lc1 } ;
Point(444) = { 324 ,  266 , 0., lc1 } ;
Point(445) = { 324 ,  273 , 0., lc1 } ;
Point(446) = { 318 ,  270 , 0., lc1 } ;
Point(447) = { 310 ,  271 , 0., lc1 } ;
Point(448) = { 308 ,  269 , 0., lc1 } ;
Point(449) = { 309 ,  263 , 0., lc1 } ;
Point(450) = { 318 ,  253 , 0., lc1 } ;
Point(451) = { 327 ,  248 , 0., lc1 } ;
Point(452) = { 333 ,  248 , 0., lc1 } ;
Line(441) = { 441 ,  442 } ;
Line(442) = { 442 ,  443 } ;
Line(443) = { 443 ,  444 } ;
Line(444) = { 444 ,  445 } ;
Line(445) = { 445 ,  446 } ;
Line(446) = { 446 ,  447 } ;
Line(447) = { 447 ,  448 } ;
Line(448) = { 448 ,  449 } ;
Line(449) = { 449 ,  450 } ;
Line(450) = { 450 ,  451 } ;
Line(451) = { 451 ,  452 } ;
Line(452) = { 452 ,  441 } ;
Line Loop(55) = { 441, 442, 443, 444, 445, 446, 447, 448, 449, 450, 451, 452 } ;
Plane Surface( 55 ) = {55};
Point(453) = { 421 ,  245 , 0., lc1 } ;
Point(454) = { 423 ,  248 , 0., lc1 } ;
Point(455) = { 423 ,  254 , 0., lc1 } ;
Point(456) = { 418 ,  265 , 0., lc1 } ;
Point(457) = { 404 ,  277 , 0., lc1 } ;
Point(458) = { 398 ,  279 , 0., lc1 } ;
Point(459) = { 393 ,  278 , 0., lc1 } ;
Point(460) = { 391 ,  276 , 0., lc1 } ;
Point(461) = { 391 ,  267 , 0., lc1 } ;
Point(462) = { 396 ,  258 , 0., lc1 } ;
Point(463) = { 407 ,  248 , 0., lc1 } ;
Point(464) = { 416 ,  244 , 0., lc1 } ;
Line(453) = { 453 ,  454 } ;
Line(454) = { 454 ,  455 } ;
Line(455) = { 455 ,  456 } ;
Line(456) = { 456 ,  457 } ;
Line(457) = { 457 ,  458 } ;
Line(458) = { 458 ,  459 } ;
Line(459) = { 459 ,  460 } ;
Line(460) = { 460 ,  461 } ;
Line(461) = { 461 ,  462 } ;
Line(462) = { 462 ,  463 } ;
Line(463) = { 463 ,  464 } ;
Line(464) = { 464 ,  453 } ;
Line Loop(56) = { 453, 454, 455, 456, 457, 458, 459, 460, 461, 462, 463, 464 } ;
Plane Surface( 56 ) = {56};
Point(465) = { 178 ,  245 , 0., lc1 } ;
Point(466) = { 177 ,  251 , 0., lc1 } ;
Point(467) = { 168 ,  261 , 0., lc1 } ;
Point(468) = { 159 ,  266 , 0., lc1 } ;
Point(469) = { 153 ,  266 , 0., lc1 } ;
Point(470) = { 151 ,  264 , 0., lc1 } ;
Point(471) = { 152 ,  258 , 0., lc1 } ;
Point(472) = { 161 ,  248 , 0., lc1 } ;
Point(473) = { 170 ,  243 , 0., lc1 } ;
Point(474) = { 176 ,  243 , 0., lc1 } ;
Line(465) = { 465 ,  466 } ;
Line(466) = { 466 ,  467 } ;
Line(467) = { 467 ,  468 } ;
Line(468) = { 468 ,  469 } ;
Line(469) = { 469 ,  470 } ;
Line(470) = { 470 ,  471 } ;
Line(471) = { 471 ,  472 } ;
Line(472) = { 472 ,  473 } ;
Line(473) = { 473 ,  474 } ;
Line(474) = { 474 ,  465 } ;
Line Loop(57) = { 465, 466, 467, 468, 469, 470, 471, 472, 473, 474 } ;
Plane Surface( 57 ) = {57};
Point(475) = { 370 ,  240 , 0., lc1 } ;
Point(476) = { 374 ,  241 , 0., lc1 } ;
Point(477) = { 377 ,  245 , 0., lc1 } ;
Point(478) = { 377 ,  251 , 0., lc1 } ;
Point(479) = { 373 ,  250 , 0., lc1 } ;
Point(480) = { 370 ,  246 , 0., lc1 } ;
Line(475) = { 475 ,  476 } ;
Line(476) = { 476 ,  477 } ;
Line(477) = { 477 ,  478 } ;
Line(478) = { 478 ,  479 } ;
Line(479) = { 479 ,  480 } ;
Line(480) = { 480 ,  475 } ;
Line Loop(58) = { 475, 476, 477, 478, 479, 480 } ;
Plane Surface( 58 ) = {58};
Point(481) = { 216 ,  232 , 0., lc1 } ;
Point(482) = { 215 ,  238 , 0., lc1 } ;
Point(483) = { 206 ,  248 , 0., lc1 } ;
Point(484) = { 197 ,  253 , 0., lc1 } ;
Point(485) = { 191 ,  253 , 0., lc1 } ;
Point(486) = { 189 ,  251 , 0., lc1 } ;
Point(487) = { 190 ,  245 , 0., lc1 } ;
Point(488) = { 199 ,  235 , 0., lc1 } ;
Point(489) = { 208 ,  230 , 0., lc1 } ;
Point(490) = { 214 ,  230 , 0., lc1 } ;
Line(481) = { 481 ,  482 } ;
Line(482) = { 482 ,  483 } ;
Line(483) = { 483 ,  484 } ;
Line(484) = { 484 ,  485 } ;
Line(485) = { 485 ,  486 } ;
Line(486) = { 486 ,  487 } ;
Line(487) = { 487 ,  488 } ;
Line(488) = { 488 ,  489 } ;
Line(489) = { 489 ,  490 } ;
Line(490) = { 490 ,  481 } ;
Line Loop(59) = { 481, 482, 483, 484, 485, 486, 487, 488, 489, 490 } ;
Plane Surface( 59 ) = {59};
Point(491) = { 245 ,  219 , 0., lc1 } ;
Point(492) = { 244 ,  225 , 0., lc1 } ;
Point(493) = { 235 ,  235 , 0., lc1 } ;
Point(494) = { 226 ,  240 , 0., lc1 } ;
Point(495) = { 220 ,  240 , 0., lc1 } ;
Point(496) = { 218 ,  238 , 0., lc1 } ;
Point(497) = { 219 ,  232 , 0., lc1 } ;
Point(498) = { 228 ,  222 , 0., lc1 } ;
Point(499) = { 237 ,  217 , 0., lc1 } ;
Point(500) = { 243 ,  217 , 0., lc1 } ;
Line(491) = { 491 ,  492 } ;
Line(492) = { 492 ,  493 } ;
Line(493) = { 493 ,  494 } ;
Line(494) = { 494 ,  495 } ;
Line(495) = { 495 ,  496 } ;
Line(496) = { 496 ,  497 } ;
Line(497) = { 497 ,  498 } ;
Line(498) = { 498 ,  499 } ;
Line(499) = { 499 ,  500 } ;
Line(500) = { 500 ,  491 } ;
Line Loop(60) = { 491, 492, 493, 494, 495, 496, 497, 498, 499, 500 } ;
Plane Surface( 60 ) = {60};
Point(501) = { 175 ,  216 , 0., lc1 } ;
Point(502) = { 179 ,  217 , 0., lc1 } ;
Point(503) = { 182 ,  221 , 0., lc1 } ;
Point(504) = { 182 ,  227 , 0., lc1 } ;
Point(505) = { 178 ,  226 , 0., lc1 } ;
Point(506) = { 175 ,  222 , 0., lc1 } ;
Line(501) = { 501 ,  502 } ;
Line(502) = { 502 ,  503 } ;
Line(503) = { 503 ,  504 } ;
Line(504) = { 504 ,  505 } ;
Line(505) = { 505 ,  506 } ;
Line(506) = { 506 ,  501 } ;
Line Loop(61) = { 501, 502, 503, 504, 505, 506 } ;
Plane Surface( 61 ) = {61};
Point(507) = { 378 ,  211 , 0., lc1 } ;
Point(508) = { 382 ,  212 , 0., lc1 } ;
Point(509) = { 385 ,  216 , 0., lc1 } ;
Point(510) = { 385 ,  222 , 0., lc1 } ;
Point(511) = { 381 ,  221 , 0., lc1 } ;
Point(512) = { 378 ,  217 , 0., lc1 } ;
Line(507) = { 507 ,  508 } ;
Line(508) = { 508 ,  509 } ;
Line(509) = { 509 ,  510 } ;
Line(510) = { 510 ,  511 } ;
Line(511) = { 511 ,  512 } ;
Line(512) = { 512 ,  507 } ;
Line Loop(62) = { 507, 508, 509, 510, 511, 512 } ;
Plane Surface( 62 ) = {62};
Point(513) = { 94 ,  211 , 0., lc1 } ;
Point(514) = { 98 ,  212 , 0., lc1 } ;
Point(515) = { 102 ,  217 , 0., lc1 } ;
Point(516) = { 101 ,  222 , 0., lc1 } ;
Point(517) = { 97 ,  221 , 0., lc1 } ;
Point(518) = { 94 ,  217 , 0., lc1 } ;
Line(513) = { 513 ,  514 } ;
Line(514) = { 514 ,  515 } ;
Line(515) = { 515 ,  516 } ;
Line(516) = { 516 ,  517 } ;
Line(517) = { 517 ,  518 } ;
Line(518) = { 518 ,  513 } ;
Line Loop(63) = { 513, 514, 515, 516, 517, 518 } ;
Plane Surface( 63 ) = {63};
Point(519) = { 47 ,  211 , 0., lc1 } ;
Point(520) = { 46 ,  217 , 0., lc1 } ;
Point(521) = { 37 ,  227 , 0., lc1 } ;
Point(522) = { 28 ,  232 , 0., lc1 } ;
Point(523) = { 22 ,  232 , 0., lc1 } ;
Point(524) = { 20 ,  230 , 0., lc1 } ;
Point(525) = { 20 ,  226 , 0., lc1 } ;
Point(526) = { 23 ,  221 , 0., lc1 } ;
Point(527) = { 33 ,  212 , 0., lc1 } ;
Point(528) = { 39 ,  209 , 0., lc1 } ;
Point(529) = { 45 ,  209 , 0., lc1 } ;
Line(519) = { 519 ,  520 } ;
Line(520) = { 520 ,  521 } ;
Line(521) = { 521 ,  522 } ;
Line(522) = { 522 ,  523 } ;
Line(523) = { 523 ,  524 } ;
Line(524) = { 524 ,  525 } ;
Line(525) = { 525 ,  526 } ;
Line(526) = { 526 ,  527 } ;
Line(527) = { 527 ,  528 } ;
Line(528) = { 528 ,  529 } ;
Line(529) = { 529 ,  519 } ;
Line Loop(64) = { 519, 520, 521, 522, 523, 524, 525, 526, 527, 528, 529 } ;
Plane Surface( 64 ) = {64};
Point(530) = { 153 ,  210 , 0., lc1 } ;
Point(531) = { 153 ,  214 , 0., lc1 } ;
Point(532) = { 150 ,  219 , 0., lc1 } ;
Point(533) = { 140 ,  228 , 0., lc1 } ;
Point(534) = { 134 ,  231 , 0., lc1 } ;
Point(535) = { 128 ,  231 , 0., lc1 } ;
Point(536) = { 126 ,  229 , 0., lc1 } ;
Point(537) = { 126 ,  225 , 0., lc1 } ;
Point(538) = { 129 ,  220 , 0., lc1 } ;
Point(539) = { 139 ,  211 , 0., lc1 } ;
Point(540) = { 145 ,  208 , 0., lc1 } ;
Point(541) = { 151 ,  208 , 0., lc1 } ;
Line(530) = { 530 ,  531 } ;
Line(531) = { 531 ,  532 } ;
Line(532) = { 532 ,  533 } ;
Line(533) = { 533 ,  534 } ;
Line(534) = { 534 ,  535 } ;
Line(535) = { 535 ,  536 } ;
Line(536) = { 536 ,  537 } ;
Line(537) = { 537 ,  538 } ;
Line(538) = { 538 ,  539 } ;
Line(539) = { 539 ,  540 } ;
Line(540) = { 540 ,  541 } ;
Line(541) = { 541 ,  530 } ;
Line Loop(65) = { 530, 531, 532, 533, 534, 535, 536, 537, 538, 539, 540, 541 } ;
Plane Surface( 65 ) = {65};
Point(542) = { 310 ,  200 , 0., lc1 } ;
Point(543) = { 309 ,  206 , 0., lc1 } ;
Point(544) = { 300 ,  216 , 0., lc1 } ;
Point(545) = { 291 ,  221 , 0., lc1 } ;
Point(546) = { 285 ,  221 , 0., lc1 } ;
Point(547) = { 283 ,  219 , 0., lc1 } ;
Point(548) = { 284 ,  213 , 0., lc1 } ;
Point(549) = { 293 ,  203 , 0., lc1 } ;
Point(550) = { 302 ,  198 , 0., lc1 } ;
Point(551) = { 308 ,  198 , 0., lc1 } ;
Line(542) = { 542 ,  543 } ;
Line(543) = { 543 ,  544 } ;
Line(544) = { 544 ,  545 } ;
Line(545) = { 545 ,  546 } ;
Line(546) = { 546 ,  547 } ;
Line(547) = { 547 ,  548 } ;
Line(548) = { 548 ,  549 } ;
Line(549) = { 549 ,  550 } ;
Line(550) = { 550 ,  551 } ;
Line(551) = { 551 ,  542 } ;
Line Loop(66) = { 542, 543, 544, 545, 546, 547, 548, 549, 550, 551 } ;
Plane Surface( 66 ) = {66};
Point(552) = { 335 ,  189 , 0., lc1 } ;
Point(553) = { 339 ,  190 , 0., lc1 } ;
Point(554) = { 342 ,  194 , 0., lc1 } ;
Point(555) = { 342 ,  200 , 0., lc1 } ;
Point(556) = { 338 ,  199 , 0., lc1 } ;
Point(557) = { 335 ,  195 , 0., lc1 } ;
Line(552) = { 552 ,  553 } ;
Line(553) = { 553 ,  554 } ;
Line(554) = { 554 ,  555 } ;
Line(555) = { 555 ,  556 } ;
Line(556) = { 556 ,  557 } ;
Line(557) = { 557 ,  552 } ;
Line Loop(67) = { 552, 553, 554, 555, 556, 557 } ;
Plane Surface( 67 ) = {67};
Point(558) = { 224 ,  182 , 0., lc1 } ;
Point(559) = { 223 ,  188 , 0., lc1 } ;
Point(560) = { 214 ,  198 , 0., lc1 } ;
Point(561) = { 205 ,  203 , 0., lc1 } ;
Point(562) = { 199 ,  203 , 0., lc1 } ;
Point(563) = { 197 ,  201 , 0., lc1 } ;
Point(564) = { 198 ,  195 , 0., lc1 } ;
Point(565) = { 207 ,  185 , 0., lc1 } ;
Point(566) = { 216 ,  180 , 0., lc1 } ;
Point(567) = { 222 ,  180 , 0., lc1 } ;
Line(558) = { 558 ,  559 } ;
Line(559) = { 559 ,  560 } ;
Line(560) = { 560 ,  561 } ;
Line(561) = { 561 ,  562 } ;
Line(562) = { 562 ,  563 } ;
Line(563) = { 563 ,  564 } ;
Line(564) = { 564 ,  565 } ;
Line(565) = { 565 ,  566 } ;
Line(566) = { 566 ,  567 } ;
Line(567) = { 567 ,  558 } ;
Line Loop(68) = { 558, 559, 560, 561, 562, 563, 564, 565, 566, 567 } ;
Plane Surface( 68 ) = {68};
Point(568) = { 424 ,  176 , 0., lc1 } ;
Point(569) = { 423 ,  182 , 0., lc1 } ;
Point(570) = { 414 ,  192 , 0., lc1 } ;
Point(571) = { 405 ,  197 , 0., lc1 } ;
Point(572) = { 399 ,  197 , 0., lc1 } ;
Point(573) = { 397 ,  195 , 0., lc1 } ;
Point(574) = { 398 ,  189 , 0., lc1 } ;
Point(575) = { 407 ,  179 , 0., lc1 } ;
Point(576) = { 416 ,  174 , 0., lc1 } ;
Point(577) = { 422 ,  174 , 0., lc1 } ;
Line(568) = { 568 ,  569 } ;
Line(569) = { 569 ,  570 } ;
Line(570) = { 570 ,  571 } ;
Line(571) = { 571 ,  572 } ;
Line(572) = { 572 ,  573 } ;
Line(573) = { 573 ,  574 } ;
Line(574) = { 574 ,  575 } ;
Line(575) = { 575 ,  576 } ;
Line(576) = { 576 ,  577 } ;
Line(577) = { 577 ,  568 } ;
Line Loop(69) = { 568, 569, 570, 571, 572, 573, 574, 575, 576, 577 } ;
Plane Surface( 69 ) = {69};
Point(578) = { 471 ,  175 , 0., lc1 } ;
Point(579) = { 470 ,  181 , 0., lc1 } ;
Point(580) = { 461 ,  191 , 0., lc1 } ;
Point(581) = { 452 ,  196 , 0., lc1 } ;
Point(582) = { 446 ,  196 , 0., lc1 } ;
Point(583) = { 444 ,  194 , 0., lc1 } ;
Point(584) = { 445 ,  188 , 0., lc1 } ;
Point(585) = { 454 ,  178 , 0., lc1 } ;
Point(586) = { 463 ,  173 , 0., lc1 } ;
Point(587) = { 469 ,  173 , 0., lc1 } ;
Line(578) = { 578 ,  579 } ;
Line(579) = { 579 ,  580 } ;
Line(580) = { 580 ,  581 } ;
Line(581) = { 581 ,  582 } ;
Line(582) = { 582 ,  583 } ;
Line(583) = { 583 ,  584 } ;
Line(584) = { 584 ,  585 } ;
Line(585) = { 585 ,  586 } ;
Line(586) = { 586 ,  587 } ;
Line(587) = { 587 ,  578 } ;
Line Loop(70) = { 578, 579, 580, 581, 582, 583, 584, 585, 586, 587 } ;
Plane Surface( 70 ) = {70};
Point(588) = { 45 ,  172 , 0., lc1 } ;
Point(589) = { 49 ,  173 , 0., lc1 } ;
Point(590) = { 52 ,  177 , 0., lc1 } ;
Point(591) = { 52 ,  183 , 0., lc1 } ;
Point(592) = { 48 ,  182 , 0., lc1 } ;
Point(593) = { 45 ,  178 , 0., lc1 } ;
Line(588) = { 588 ,  589 } ;
Line(589) = { 589 ,  590 } ;
Line(590) = { 590 ,  591 } ;
Line(591) = { 591 ,  592 } ;
Line(592) = { 592 ,  593 } ;
Line(593) = { 593 ,  588 } ;
Line Loop(71) = { 588, 589, 590, 591, 592, 593 } ;
Plane Surface( 71 ) = {71};
Point(594) = { 247 ,  170 , 0., lc1 } ;
Point(595) = { 251 ,  171 , 0., lc1 } ;
Point(596) = { 254 ,  175 , 0., lc1 } ;
Point(597) = { 254 ,  181 , 0., lc1 } ;
Point(598) = { 250 ,  180 , 0., lc1 } ;
Point(599) = { 247 ,  176 , 0., lc1 } ;
Line(594) = { 594 ,  595 } ;
Line(595) = { 595 ,  596 } ;
Line(596) = { 596 ,  597 } ;
Line(597) = { 597 ,  598 } ;
Line(598) = { 598 ,  599 } ;
Line(599) = { 599 ,  594 } ;
Line Loop(72) = { 594, 595, 596, 597, 598, 599 } ;
Plane Surface( 72 ) = {72};
Point(600) = { 116 ,  161 , 0., lc1 } ;
Point(601) = { 116 ,  164 , 0., lc1 } ;
Point(602) = { 113 ,  165 , 0., lc1 } ;
Point(603) = { 110 ,  163 , 0., lc1 } ;
Point(604) = { 106 ,  156 , 0., lc1 } ;
Point(605) = { 103 ,  161 , 0., lc1 } ;
Point(606) = { 93 ,  170 , 0., lc1 } ;
Point(607) = { 87 ,  173 , 0., lc1 } ;
Point(608) = { 81 ,  173 , 0., lc1 } ;
Point(609) = { 79 ,  171 , 0., lc1 } ;
Point(610) = { 79 ,  167 , 0., lc1 } ;
Point(611) = { 82 ,  162 , 0., lc1 } ;
Point(612) = { 89 ,  155 , 0., lc1 } ;
Point(613) = { 98 ,  150 , 0., lc1 } ;
Point(614) = { 104 ,  150 , 0., lc1 } ;
Point(615) = { 106 ,  153 , 0., lc1 } ;
Point(616) = { 109 ,  153 , 0., lc1 } ;
Point(617) = { 113 ,  156 , 0., lc1 } ;
Line(600) = { 600 ,  601 } ;
Line(601) = { 601 ,  602 } ;
Line(602) = { 602 ,  603 } ;
Line(603) = { 603 ,  604 } ;
Line(604) = { 604 ,  605 } ;
Line(605) = { 605 ,  606 } ;
Line(606) = { 606 ,  607 } ;
Line(607) = { 607 ,  608 } ;
Line(608) = { 608 ,  609 } ;
Line(609) = { 609 ,  610 } ;
Line(610) = { 610 ,  611 } ;
Line(611) = { 611 ,  612 } ;
Line(612) = { 612 ,  613 } ;
Line(613) = { 613 ,  614 } ;
Line(614) = { 614 ,  615 } ;
Line(615) = { 615 ,  616 } ;
Line(616) = { 616 ,  617 } ;
Line(617) = { 617 ,  600 } ;
Line Loop(73) = { 600, 601, 602, 603, 604, 605, 606, 607, 608, 609, 610, 611, 612, 613, 614, 615, 616, 617 } ;
Plane Surface( 73 ) = {73};
Point(618) = { 395 ,  149 , 0., lc1 } ;
Point(619) = { 399 ,  150 , 0., lc1 } ;
Point(620) = { 402 ,  154 , 0., lc1 } ;
Point(621) = { 402 ,  160 , 0., lc1 } ;
Point(622) = { 398 ,  159 , 0., lc1 } ;
Point(623) = { 395 ,  155 , 0., lc1 } ;
Line(618) = { 618 ,  619 } ;
Line(619) = { 619 ,  620 } ;
Line(620) = { 620 ,  621 } ;
Line(621) = { 621 ,  622 } ;
Line(622) = { 622 ,  623 } ;
Line(623) = { 623 ,  618 } ;
Line Loop(74) = { 618, 619, 620, 621, 622, 623 } ;
Plane Surface( 74 ) = {74};
Point(624) = { 205 ,  149 , 0., lc1 } ;
Point(625) = { 209 ,  150 , 0., lc1 } ;
Point(626) = { 212 ,  154 , 0., lc1 } ;
Point(627) = { 212 ,  160 , 0., lc1 } ;
Point(628) = { 208 ,  159 , 0., lc1 } ;
Point(629) = { 205 ,  155 , 0., lc1 } ;
Line(624) = { 624 ,  625 } ;
Line(625) = { 625 ,  626 } ;
Line(626) = { 626 ,  627 } ;
Line(627) = { 627 ,  628 } ;
Line(628) = { 628 ,  629 } ;
Line(629) = { 629 ,  624 } ;
Line Loop(75) = { 624, 625, 626, 627, 628, 629 } ;
Plane Surface( 75 ) = {75};
Point(630) = { 448 ,  148 , 0., lc1 } ;
Point(631) = { 452 ,  149 , 0., lc1 } ;
Point(632) = { 455 ,  153 , 0., lc1 } ;
Point(633) = { 455 ,  159 , 0., lc1 } ;
Point(634) = { 451 ,  158 , 0., lc1 } ;
Point(635) = { 447 ,  153 , 0., lc1 } ;
Line(630) = { 630 ,  631 } ;
Line(631) = { 631 ,  632 } ;
Line(632) = { 632 ,  633 } ;
Line(633) = { 633 ,  634 } ;
Line(634) = { 634 ,  635 } ;
Line(635) = { 635 ,  630 } ;
Line Loop(76) = { 630, 631, 632, 633, 634, 635 } ;
Plane Surface( 76 ) = {76};
Point(636) = { 358 ,  148 , 0., lc1 } ;
Point(637) = { 357 ,  154 , 0., lc1 } ;
Point(638) = { 348 ,  164 , 0., lc1 } ;
Point(639) = { 339 ,  169 , 0., lc1 } ;
Point(640) = { 333 ,  169 , 0., lc1 } ;
Point(641) = { 331 ,  167 , 0., lc1 } ;
Point(642) = { 332 ,  161 , 0., lc1 } ;
Point(643) = { 341 ,  151 , 0., lc1 } ;
Point(644) = { 350 ,  146 , 0., lc1 } ;
Point(645) = { 356 ,  146 , 0., lc1 } ;
Line(636) = { 636 ,  637 } ;
Line(637) = { 637 ,  638 } ;
Line(638) = { 638 ,  639 } ;
Line(639) = { 639 ,  640 } ;
Line(640) = { 640 ,  641 } ;
Line(641) = { 641 ,  642 } ;
Line(642) = { 642 ,  643 } ;
Line(643) = { 643 ,  644 } ;
Line(644) = { 644 ,  645 } ;
Line(645) = { 645 ,  636 } ;
Line Loop(77) = { 636, 637, 638, 639, 640, 641, 642, 643, 644, 645 } ;
Plane Surface( 77 ) = {77};
Point(646) = { 159 ,  143 , 0., lc1 } ;
Point(647) = { 161 ,  145 , 0., lc1 } ;
Point(648) = { 161 ,  150 , 0., lc1 } ;
Point(649) = { 158 ,  155 , 0., lc1 } ;
Point(650) = { 148 ,  165 , 0., lc1 } ;
Point(651) = { 138 ,  170 , 0., lc1 } ;
Point(652) = { 134 ,  170 , 0., lc1 } ;
Point(653) = { 131 ,  167 , 0., lc1 } ;
Point(654) = { 133 ,  159 , 0., lc1 } ;
Point(655) = { 142 ,  149 , 0., lc1 } ;
Point(656) = { 150 ,  144 , 0., lc1 } ;
Line(646) = { 646 ,  647 } ;
Line(647) = { 647 ,  648 } ;
Line(648) = { 648 ,  649 } ;
Line(649) = { 649 ,  650 } ;
Line(650) = { 650 ,  651 } ;
Line(651) = { 651 ,  652 } ;
Line(652) = { 652 ,  653 } ;
Line(653) = { 653 ,  654 } ;
Line(654) = { 654 ,  655 } ;
Line(655) = { 655 ,  656 } ;
Line(656) = { 656 ,  646 } ;
Line Loop(78) = { 646, 647, 648, 649, 650, 651, 652, 653, 654, 655, 656 } ;
Plane Surface( 78 ) = {78};
Point(657) = { 95 ,  118 , 0., lc1 } ;
Point(658) = { 99 ,  119 , 0., lc1 } ;
Point(659) = { 102 ,  123 , 0., lc1 } ;
Point(660) = { 102 ,  129 , 0., lc1 } ;
Point(661) = { 98 ,  128 , 0., lc1 } ;
Point(662) = { 95 ,  124 , 0., lc1 } ;
Line(657) = { 657 ,  658 } ;
Line(658) = { 658 ,  659 } ;
Line(659) = { 659 ,  660 } ;
Line(660) = { 660 ,  661 } ;
Line(661) = { 661 ,  662 } ;
Line(662) = { 662 ,  657 } ;
Line Loop(79) = { 657, 658, 659, 660, 661, 662 } ;
Plane Surface( 79 ) = {79};
Point(663) = { 313 ,  118 , 0., lc1 } ;
Point(664) = { 313 ,  122 , 0., lc1 } ;
Point(665) = { 310 ,  127 , 0., lc1 } ;
Point(666) = { 300 ,  136 , 0., lc1 } ;
Point(667) = { 288 ,  140 , 0., lc1 } ;
Point(668) = { 283 ,  149 , 0., lc1 } ;
Point(669) = { 276 ,  156 , 0., lc1 } ;
Point(670) = { 267 ,  161 , 0., lc1 } ;
Point(671) = { 261 ,  161 , 0., lc1 } ;
Point(672) = { 259 ,  159 , 0., lc1 } ;
Point(673) = { 259 ,  155 , 0., lc1 } ;
Point(674) = { 262 ,  150 , 0., lc1 } ;
Point(675) = { 272 ,  141 , 0., lc1 } ;
Point(676) = { 284 ,  137 , 0., lc1 } ;
Point(677) = { 289 ,  128 , 0., lc1 } ;
Point(678) = { 295 ,  122 , 0., lc1 } ;
Point(679) = { 305 ,  116 , 0., lc1 } ;
Point(680) = { 311 ,  116 , 0., lc1 } ;
Line(663) = { 663 ,  664 } ;
Line(664) = { 664 ,  665 } ;
Line(665) = { 665 ,  666 } ;
Line(666) = { 666 ,  667 } ;
Line(667) = { 667 ,  668 } ;
Line(668) = { 668 ,  669 } ;
Line(669) = { 669 ,  670 } ;
Line(670) = { 670 ,  671 } ;
Line(671) = { 671 ,  672 } ;
Line(672) = { 672 ,  673 } ;
Line(673) = { 673 ,  674 } ;
Line(674) = { 674 ,  675 } ;
Line(675) = { 675 ,  676 } ;
Line(676) = { 676 ,  677 } ;
Line(677) = { 677 ,  678 } ;
Line(678) = { 678 ,  679 } ;
Line(679) = { 679 ,  680 } ;
Line(680) = { 680 ,  663 } ;
Line Loop(80) = { 663, 664, 665, 666, 667, 668, 669, 670, 671, 672, 673, 674, 675, 676, 677, 678, 679, 680 } ;
Plane Surface( 80 ) = {80};
Point(681) = { 260 ,  117 , 0., lc1 } ;
Point(682) = { 259 ,  123 , 0., lc1 } ;
Point(683) = { 250 ,  133 , 0., lc1 } ;
Point(684) = { 241 ,  138 , 0., lc1 } ;
Point(685) = { 235 ,  138 , 0., lc1 } ;
Point(686) = { 233 ,  136 , 0., lc1 } ;
Point(687) = { 234 ,  130 , 0., lc1 } ;
Point(688) = { 243 ,  120 , 0., lc1 } ;
Point(689) = { 252 ,  115 , 0., lc1 } ;
Point(690) = { 258 ,  115 , 0., lc1 } ;
Line(681) = { 681 ,  682 } ;
Line(682) = { 682 ,  683 } ;
Line(683) = { 683 ,  684 } ;
Line(684) = { 684 ,  685 } ;
Line(685) = { 685 ,  686 } ;
Line(686) = { 686 ,  687 } ;
Line(687) = { 687 ,  688 } ;
Line(688) = { 688 ,  689 } ;
Line(689) = { 689 ,  690 } ;
Line(690) = { 690 ,  681 } ;
Line Loop(81) = { 681, 682, 683, 684, 685, 686, 687, 688, 689, 690 } ;
Plane Surface( 81 ) = {81};
Point(691) = { 56 ,  117 , 0., lc1 } ;
Point(692) = { 55 ,  123 , 0., lc1 } ;
Point(693) = { 46 ,  133 , 0., lc1 } ;
Point(694) = { 37 ,  138 , 0., lc1 } ;
Point(695) = { 31 ,  138 , 0., lc1 } ;
Point(696) = { 29 ,  136 , 0., lc1 } ;
Point(697) = { 30 ,  130 , 0., lc1 } ;
Point(698) = { 39 ,  120 , 0., lc1 } ;
Point(699) = { 48 ,  115 , 0., lc1 } ;
Point(700) = { 54 ,  115 , 0., lc1 } ;
Line(691) = { 691 ,  692 } ;
Line(692) = { 692 ,  693 } ;
Line(693) = { 693 ,  694 } ;
Line(694) = { 694 ,  695 } ;
Line(695) = { 695 ,  696 } ;
Line(696) = { 696 ,  697 } ;
Line(697) = { 697 ,  698 } ;
Line(698) = { 698 ,  699 } ;
Line(699) = { 699 ,  700 } ;
Line(700) = { 700 ,  691 } ;
Line Loop(82) = { 691, 692, 693, 694, 695, 696, 697, 698, 699, 700 } ;
Plane Surface( 82 ) = {82};
Point(701) = { 364 ,  107 , 0., lc1 } ;
Point(702) = { 363 ,  113 , 0., lc1 } ;
Point(703) = { 354 ,  123 , 0., lc1 } ;
Point(704) = { 345 ,  128 , 0., lc1 } ;
Point(705) = { 339 ,  128 , 0., lc1 } ;
Point(706) = { 337 ,  126 , 0., lc1 } ;
Point(707) = { 338 ,  120 , 0., lc1 } ;
Point(708) = { 347 ,  110 , 0., lc1 } ;
Point(709) = { 356 ,  105 , 0., lc1 } ;
Point(710) = { 362 ,  105 , 0., lc1 } ;
Line(701) = { 701 ,  702 } ;
Line(702) = { 702 ,  703 } ;
Line(703) = { 703 ,  704 } ;
Line(704) = { 704 ,  705 } ;
Line(705) = { 705 ,  706 } ;
Line(706) = { 706 ,  707 } ;
Line(707) = { 707 ,  708 } ;
Line(708) = { 708 ,  709 } ;
Line(709) = { 709 ,  710 } ;
Line(710) = { 710 ,  701 } ;
Line Loop(83) = { 701, 702, 703, 704, 705, 706, 707, 708, 709, 710 } ;
Plane Surface( 83 ) = {83};
Point(711) = { 458 ,  83 , 0., lc1 } ;
Point(712) = { 460 ,  86 , 0., lc1 } ;
Point(713) = { 461 ,  94 , 0., lc1 } ;
Point(714) = { 460 ,  100 , 0., lc1 } ;
Point(715) = { 456 ,  107 , 0., lc1 } ;
Point(716) = { 442 ,  119 , 0., lc1 } ;
Point(717) = { 436 ,  121 , 0., lc1 } ;
Point(718) = { 431 ,  120 , 0., lc1 } ;
Point(719) = { 429 ,  118 , 0., lc1 } ;
Point(720) = { 428 ,  109 , 0., lc1 } ;
Point(721) = { 429 ,  103 , 0., lc1 } ;
Point(722) = { 433 ,  96 , 0., lc1 } ;
Point(723) = { 444 ,  86 , 0., lc1 } ;
Point(724) = { 454 ,  82 , 0., lc1 } ;
Line(711) = { 711 ,  712 } ;
Line(712) = { 712 ,  713 } ;
Line(713) = { 713 ,  714 } ;
Line(714) = { 714 ,  715 } ;
Line(715) = { 715 ,  716 } ;
Line(716) = { 716 ,  717 } ;
Line(717) = { 717 ,  718 } ;
Line(718) = { 718 ,  719 } ;
Line(719) = { 719 ,  720 } ;
Line(720) = { 720 ,  721 } ;
Line(721) = { 721 ,  722 } ;
Line(722) = { 722 ,  723 } ;
Line(723) = { 723 ,  724 } ;
Line(724) = { 724 ,  711 } ;
Line Loop(84) = { 711, 712, 713, 714, 715, 716, 717, 718, 719, 720, 721, 722, 723, 724 } ;
Plane Surface( 84 ) = {84};
Point(725) = { 297 ,  82 , 0., lc1 } ;
Point(726) = { 301 ,  83 , 0., lc1 } ;
Point(727) = { 304 ,  87 , 0., lc1 } ;
Point(728) = { 304 ,  93 , 0., lc1 } ;
Point(729) = { 300 ,  92 , 0., lc1 } ;
Point(730) = { 297 ,  88 , 0., lc1 } ;
Line(725) = { 725 ,  726 } ;
Line(726) = { 726 ,  727 } ;
Line(727) = { 727 ,  728 } ;
Line(728) = { 728 ,  729 } ;
Line(729) = { 729 ,  730 } ;
Line(730) = { 730 ,  725 } ;
Line Loop(85) = { 725, 726, 727, 728, 729, 730 } ;
Plane Surface( 85 ) = {85};
Point(731) = { 148 ,  76 , 0., lc1 } ;
Point(732) = { 147 ,  82 , 0., lc1 } ;
Point(733) = { 138 ,  92 , 0., lc1 } ;
Point(734) = { 129 ,  97 , 0., lc1 } ;
Point(735) = { 123 ,  97 , 0., lc1 } ;
Point(736) = { 121 ,  95 , 0., lc1 } ;
Point(737) = { 122 ,  89 , 0., lc1 } ;
Point(738) = { 131 ,  79 , 0., lc1 } ;
Point(739) = { 140 ,  74 , 0., lc1 } ;
Point(740) = { 146 ,  74 , 0., lc1 } ;
Line(731) = { 731 ,  732 } ;
Line(732) = { 732 ,  733 } ;
Line(733) = { 733 ,  734 } ;
Line(734) = { 734 ,  735 } ;
Line(735) = { 735 ,  736 } ;
Line(736) = { 736 ,  737 } ;
Line(737) = { 737 ,  738 } ;
Line(738) = { 738 ,  739 } ;
Line(739) = { 739 ,  740 } ;
Line(740) = { 740 ,  731 } ;
Line Loop(86) = { 731, 732, 733, 734, 735, 736, 737, 738, 739, 740 } ;
Plane Surface( 86 ) = {86};
Point(741) = { 401 ,  75 , 0., lc1 } ;
Point(742) = { 400 ,  81 , 0., lc1 } ;
Point(743) = { 391 ,  91 , 0., lc1 } ;
Point(744) = { 382 ,  96 , 0., lc1 } ;
Point(745) = { 376 ,  96 , 0., lc1 } ;
Point(746) = { 374 ,  94 , 0., lc1 } ;
Point(747) = { 375 ,  88 , 0., lc1 } ;
Point(748) = { 384 ,  78 , 0., lc1 } ;
Point(749) = { 393 ,  73 , 0., lc1 } ;
Point(750) = { 399 ,  73 , 0., lc1 } ;
Line(741) = { 741 ,  742 } ;
Line(742) = { 742 ,  743 } ;
Line(743) = { 743 ,  744 } ;
Line(744) = { 744 ,  745 } ;
Line(745) = { 745 ,  746 } ;
Line(746) = { 746 ,  747 } ;
Line(747) = { 747 ,  748 } ;
Line(748) = { 748 ,  749 } ;
Line(749) = { 749 ,  750 } ;
Line(750) = { 750 ,  741 } ;
Line Loop(87) = { 741, 742, 743, 744, 745, 746, 747, 748, 749, 750 } ;
Plane Surface( 87 ) = {87};
Point(751) = { 337 ,  67 , 0., lc1 } ;
Point(752) = { 341 ,  68 , 0., lc1 } ;
Point(753) = { 344 ,  72 , 0., lc1 } ;
Point(754) = { 344 ,  78 , 0., lc1 } ;
Point(755) = { 340 ,  77 , 0., lc1 } ;
Point(756) = { 337 ,  73 , 0., lc1 } ;
Line(751) = { 751 ,  752 } ;
Line(752) = { 752 ,  753 } ;
Line(753) = { 753 ,  754 } ;
Line(754) = { 754 ,  755 } ;
Line(755) = { 755 ,  756 } ;
Line(756) = { 756 ,  751 } ;
Line Loop(88) = { 751, 752, 753, 754, 755, 756 } ;
Plane Surface( 88 ) = {88};
Point(757) = { 200 ,  68 , 0., lc1 } ;
Point(758) = { 199 ,  74 , 0., lc1 } ;
Point(759) = { 192 ,  82 , 0., lc1 } ;
Point(760) = { 197 ,  89 , 0., lc1 } ;
Point(761) = { 196 ,  93 , 0., lc1 } ;
Point(762) = { 192 ,  92 , 0., lc1 } ;
Point(763) = { 188 ,  86 , 0., lc1 } ;
Point(764) = { 181 ,  89 , 0., lc1 } ;
Point(765) = { 175 ,  89 , 0., lc1 } ;
Point(766) = { 173 ,  87 , 0., lc1 } ;
Point(767) = { 174 ,  81 , 0., lc1 } ;
Point(768) = { 183 ,  71 , 0., lc1 } ;
Point(769) = { 192 ,  66 , 0., lc1 } ;
Point(770) = { 198 ,  66 , 0., lc1 } ;
Line(757) = { 757 ,  758 } ;
Line(758) = { 758 ,  759 } ;
Line(759) = { 759 ,  760 } ;
Line(760) = { 760 ,  761 } ;
Line(761) = { 761 ,  762 } ;
Line(762) = { 762 ,  763 } ;
Line(763) = { 763 ,  764 } ;
Line(764) = { 764 ,  765 } ;
Line(765) = { 765 ,  766 } ;
Line(766) = { 766 ,  767 } ;
Line(767) = { 767 ,  768 } ;
Line(768) = { 768 ,  769 } ;
Line(769) = { 769 ,  770 } ;
Line(770) = { 770 ,  757 } ;
Line Loop(89) = { 757, 758, 759, 760, 761, 762, 763, 764, 765, 766, 767, 768, 769, 770 } ;
Plane Surface( 89 ) = {89};
Point(771) = { 252 ,  63 , 0., lc1 } ;
Point(772) = { 251 ,  69 , 0., lc1 } ;
Point(773) = { 242 ,  79 , 0., lc1 } ;
Point(774) = { 233 ,  84 , 0., lc1 } ;
Point(775) = { 227 ,  84 , 0., lc1 } ;
Point(776) = { 225 ,  82 , 0., lc1 } ;
Point(777) = { 226 ,  76 , 0., lc1 } ;
Point(778) = { 235 ,  66 , 0., lc1 } ;
Point(779) = { 244 ,  61 , 0., lc1 } ;
Point(780) = { 250 ,  61 , 0., lc1 } ;
Line(771) = { 771 ,  772 } ;
Line(772) = { 772 ,  773 } ;
Line(773) = { 773 ,  774 } ;
Line(774) = { 774 ,  775 } ;
Line(775) = { 775 ,  776 } ;
Line(776) = { 776 ,  777 } ;
Line(777) = { 777 ,  778 } ;
Line(778) = { 778 ,  779 } ;
Line(779) = { 779 ,  780 } ;
Line(780) = { 780 ,  771 } ;
Line Loop(90) = { 771, 772, 773, 774, 775, 776, 777, 778, 779, 780 } ;
Plane Surface( 90 ) = {90};
Point(781) = { 58 ,  62 , 0., lc1 } ;
Point(782) = { 57 ,  68 , 0., lc1 } ;
Point(783) = { 48 ,  78 , 0., lc1 } ;
Point(784) = { 39 ,  83 , 0., lc1 } ;
Point(785) = { 33 ,  83 , 0., lc1 } ;
Point(786) = { 31 ,  81 , 0., lc1 } ;
Point(787) = { 32 ,  75 , 0., lc1 } ;
Point(788) = { 41 ,  65 , 0., lc1 } ;
Point(789) = { 50 ,  60 , 0., lc1 } ;
Point(790) = { 56 ,  60 , 0., lc1 } ;
Line(781) = { 781 ,  782 } ;
Line(782) = { 782 ,  783 } ;
Line(783) = { 783 ,  784 } ;
Line(784) = { 784 ,  785 } ;
Line(785) = { 785 ,  786 } ;
Line(786) = { 786 ,  787 } ;
Line(787) = { 787 ,  788 } ;
Line(788) = { 788 ,  789 } ;
Line(789) = { 789 ,  790 } ;
Line(790) = { 790 ,  781 } ;
Line Loop(91) = { 781, 782, 783, 784, 785, 786, 787, 788, 789, 790 } ;
Plane Surface( 91 ) = {91};
Point(791) = { 100 ,  61 , 0., lc1 } ;
Point(792) = { 99 ,  67 , 0., lc1 } ;
Point(793) = { 90 ,  77 , 0., lc1 } ;
Point(794) = { 81 ,  82 , 0., lc1 } ;
Point(795) = { 75 ,  82 , 0., lc1 } ;
Point(796) = { 73 ,  80 , 0., lc1 } ;
Point(797) = { 74 ,  74 , 0., lc1 } ;
Point(798) = { 83 ,  64 , 0., lc1 } ;
Point(799) = { 92 ,  59 , 0., lc1 } ;
Point(800) = { 98 ,  59 , 0., lc1 } ;
Line(791) = { 791 ,  792 } ;
Line(792) = { 792 ,  793 } ;
Line(793) = { 793 ,  794 } ;
Line(794) = { 794 ,  795 } ;
Line(795) = { 795 ,  796 } ;
Line(796) = { 796 ,  797 } ;
Line(797) = { 797 ,  798 } ;
Line(798) = { 798 ,  799 } ;
Line(799) = { 799 ,  800 } ;
Line(800) = { 800 ,  791 } ;
Line Loop(92) = { 791, 792, 793, 794, 795, 796, 797, 798, 799, 800 } ;
Plane Surface( 92 ) = {92};
Point(801) = { 278 ,  48 , 0., lc1 } ;
Point(802) = { 282 ,  49 , 0., lc1 } ;
Point(803) = { 285 ,  53 , 0., lc1 } ;
Point(804) = { 285 ,  59 , 0., lc1 } ;
Point(805) = { 281 ,  58 , 0., lc1 } ;
Point(806) = { 278 ,  54 , 0., lc1 } ;
Line(801) = { 801 ,  802 } ;
Line(802) = { 802 ,  803 } ;
Line(803) = { 803 ,  804 } ;
Line(804) = { 804 ,  805 } ;
Line(805) = { 805 ,  806 } ;
Line(806) = { 806 ,  801 } ;
Line Loop(93) = { 801, 802, 803, 804, 805, 806 } ;
Plane Surface( 93 ) = {93};
Point(807) = { 123 ,  31 , 0., lc1 } ;
Point(808) = { 127 ,  32 , 0., lc1 } ;
Point(809) = { 130 ,  36 , 0., lc1 } ;
Point(810) = { 130 ,  42 , 0., lc1 } ;
Point(811) = { 126 ,  41 , 0., lc1 } ;
Point(812) = { 123 ,  37 , 0., lc1 } ;
Line(807) = { 807 ,  808 } ;
Line(808) = { 808 ,  809 } ;
Line(809) = { 809 ,  810 } ;
Line(810) = { 810 ,  811 } ;
Line(811) = { 811 ,  812 } ;
Line(812) = { 812 ,  807 } ;
Line Loop(94) = { 807, 808, 809, 810, 811, 812 } ;
Plane Surface( 94 ) = {94};
Point(813) = { 87 ,  30 , 0., lc1 } ;
Point(814) = { 91 ,  31 , 0., lc1 } ;
Point(815) = { 94 ,  35 , 0., lc1 } ;
Point(816) = { 94 ,  41 , 0., lc1 } ;
Point(817) = { 90 ,  40 , 0., lc1 } ;
Point(818) = { 87 ,  36 , 0., lc1 } ;
Line(813) = { 813 ,  814 } ;
Line(814) = { 814 ,  815 } ;
Line(815) = { 815 ,  816 } ;
Line(816) = { 816 ,  817 } ;
Line(817) = { 817 ,  818 } ;
Line(818) = { 818 ,  813 } ;
Line Loop(95) = { 813, 814, 815, 816, 817, 818 } ;
Plane Surface( 95 ) = {95};
Point(819) = { 52 ,  27 , 0., lc1 } ;
Point(820) = { 51 ,  33 , 0., lc1 } ;
Point(821) = { 42 ,  43 , 0., lc1 } ;
Point(822) = { 33 ,  48 , 0., lc1 } ;
Point(823) = { 27 ,  48 , 0., lc1 } ;
Point(824) = { 25 ,  46 , 0., lc1 } ;
Point(825) = { 26 ,  40 , 0., lc1 } ;
Point(826) = { 35 ,  30 , 0., lc1 } ;
Point(827) = { 44 ,  25 , 0., lc1 } ;
Point(828) = { 50 ,  25 , 0., lc1 } ;
Line(819) = { 819 ,  820 } ;
Line(820) = { 820 ,  821 } ;
Line(821) = { 821 ,  822 } ;
Line(822) = { 822 ,  823 } ;
Line(823) = { 823 ,  824 } ;
Line(824) = { 824 ,  825 } ;
Line(825) = { 825 ,  826 } ;
Line(826) = { 826 ,  827 } ;
Line(827) = { 827 ,  828 } ;
Line(828) = { 828 ,  819 } ;
Line Loop(96) = { 819, 820, 821, 822, 823, 824, 825, 826, 827, 828 } ;
Plane Surface( 96 ) = {96};
Point(829) = { 385 ,  24 , 0., lc1 } ;
Point(830) = { 384 ,  30 , 0., lc1 } ;
Point(831) = { 375 ,  40 , 0., lc1 } ;
Point(832) = { 366 ,  45 , 0., lc1 } ;
Point(833) = { 360 ,  45 , 0., lc1 } ;
Point(834) = { 358 ,  43 , 0., lc1 } ;
Point(835) = { 359 ,  37 , 0., lc1 } ;
Point(836) = { 368 ,  27 , 0., lc1 } ;
Point(837) = { 377 ,  22 , 0., lc1 } ;
Point(838) = { 383 ,  22 , 0., lc1 } ;
Line(829) = { 829 ,  830 } ;
Line(830) = { 830 ,  831 } ;
Line(831) = { 831 ,  832 } ;
Line(832) = { 832 ,  833 } ;
Line(833) = { 833 ,  834 } ;
Line(834) = { 834 ,  835 } ;
Line(835) = { 835 ,  836 } ;
Line(836) = { 836 ,  837 } ;
Line(837) = { 837 ,  838 } ;
Line(838) = { 838 ,  829 } ;
Line Loop(97) = { 829, 830, 831, 832, 833, 834, 835, 836, 837, 838 } ;
Plane Surface( 97 ) = {97};
Point(839) = { 239 ,  23 , 0., lc1 } ;
Point(840) = { 238 ,  29 , 0., lc1 } ;
Point(841) = { 229 ,  39 , 0., lc1 } ;
Point(842) = { 220 ,  44 , 0., lc1 } ;
Point(843) = { 214 ,  44 , 0., lc1 } ;
Point(844) = { 212 ,  42 , 0., lc1 } ;
Point(845) = { 213 ,  36 , 0., lc1 } ;
Point(846) = { 222 ,  26 , 0., lc1 } ;
Point(847) = { 231 ,  21 , 0., lc1 } ;
Point(848) = { 237 ,  21 , 0., lc1 } ;
Line(839) = { 839 ,  840 } ;
Line(840) = { 840 ,  841 } ;
Line(841) = { 841 ,  842 } ;
Line(842) = { 842 ,  843 } ;
Line(843) = { 843 ,  844 } ;
Line(844) = { 844 ,  845 } ;
Line(845) = { 845 ,  846 } ;
Line(846) = { 846 ,  847 } ;
Line(847) = { 847 ,  848 } ;
Line(848) = { 848 ,  839 } ;
Line Loop(98) = { 839, 840, 841, 842, 843, 844, 845, 846, 847, 848 } ;
Plane Surface( 98 ) = {98};
Point(849) = { 340 ,  22 , 0., lc1 } ;
Point(850) = { 339 ,  28 , 0., lc1 } ;
Point(851) = { 330 ,  38 , 0., lc1 } ;
Point(852) = { 321 ,  43 , 0., lc1 } ;
Point(853) = { 315 ,  43 , 0., lc1 } ;
Point(854) = { 313 ,  41 , 0., lc1 } ;
Point(855) = { 314 ,  35 , 0., lc1 } ;
Point(856) = { 323 ,  25 , 0., lc1 } ;
Point(857) = { 332 ,  20 , 0., lc1 } ;
Point(858) = { 338 ,  20 , 0., lc1 } ;
Line(849) = { 849 ,  850 } ;
Line(850) = { 850 ,  851 } ;
Line(851) = { 851 ,  852 } ;
Line(852) = { 852 ,  853 } ;
Line(853) = { 853 ,  854 } ;
Line(854) = { 854 ,  855 } ;
Line(855) = { 855 ,  856 } ;
Line(856) = { 856 ,  857 } ;
Line(857) = { 857 ,  858 } ;
Line(858) = { 858 ,  849 } ;
Line Loop(99) = { 849, 850, 851, 852, 853, 854, 855, 856, 857, 858 } ;
Plane Surface( 99 ) = {99};
Point(859) = { 137 ,  19 , 0., lc1 } ;
Point(860) = { 141 ,  20 , 0., lc1 } ;
Point(861) = { 144 ,  24 , 0., lc1 } ;
Point(862) = { 144 ,  30 , 0., lc1 } ;
Point(863) = { 140 ,  29 , 0., lc1 } ;
Point(864) = { 137 ,  25 , 0., lc1 } ;
Line(859) = { 859 ,  860 } ;
Line(860) = { 860 ,  861 } ;
Line(861) = { 861 ,  862 } ;
Line(862) = { 862 ,  863 } ;
Line(863) = { 863 ,  864 } ;
Line(864) = { 864 ,  859 } ;
Line Loop(100) = { 859, 860, 861, 862, 863, 864 } ;
Plane Surface( 100 ) = {100};
Point(865) = { 460 ,  19 , 0., lc1 } ;
Point(866) = { 459 ,  25 , 0., lc1 } ;
Point(867) = { 450 ,  35 , 0., lc1 } ;
Point(868) = { 441 ,  40 , 0., lc1 } ;
Point(869) = { 435 ,  40 , 0., lc1 } ;
Point(870) = { 433 ,  38 , 0., lc1 } ;
Point(871) = { 434 ,  32 , 0., lc1 } ;
Point(872) = { 443 ,  22 , 0., lc1 } ;
Point(873) = { 452 ,  17 , 0., lc1 } ;
Point(874) = { 458 ,  17 , 0., lc1 } ;
Line(865) = { 865 ,  866 } ;
Line(866) = { 866 ,  867 } ;
Line(867) = { 867 ,  868 } ;
Line(868) = { 868 ,  869 } ;
Line(869) = { 869 ,  870 } ;
Line(870) = { 870 ,  871 } ;
Line(871) = { 871 ,  872 } ;
Line(872) = { 872 ,  873 } ;
Line(873) = { 873 ,  874 } ;
Line(874) = { 874 ,  865 } ;
Line Loop(101) = { 865, 866, 867, 868, 869, 870, 871, 872, 873, 874 } ;
Plane Surface( 101 ) = {101};
Point(875) = { 267 ,  17 , 0., lc1 } ;
Point(876) = { 271 ,  18 , 0., lc1 } ;
Point(877) = { 274 ,  22 , 0., lc1 } ;
Point(878) = { 274 ,  28 , 0., lc1 } ;
Point(879) = { 270 ,  27 , 0., lc1 } ;
Point(880) = { 267 ,  23 , 0., lc1 } ;
Line(875) = { 875 ,  876 } ;
Line(876) = { 876 ,  877 } ;
Line(877) = { 877 ,  878 } ;
Line(878) = { 878 ,  879 } ;
Line(879) = { 879 ,  880 } ;
Line(880) = { 880 ,  875 } ;
Line Loop(102) = { 875, 876, 877, 878, 879, 880 } ;
Plane Surface( 102 ) = {102};
Point(881) = { 183 ,  15 , 0., lc1 } ;
Point(882) = { 187 ,  16 , 0., lc1 } ;
Point(883) = { 190 ,  20 , 0., lc1 } ;
Point(884) = { 190 ,  26 , 0., lc1 } ;
Point(885) = { 186 ,  25 , 0., lc1 } ;
Point(886) = { 183 ,  21 , 0., lc1 } ;
Line(881) = { 881 ,  882 } ;
Line(882) = { 882 ,  883 } ;
Line(883) = { 883 ,  884 } ;
Line(884) = { 884 ,  885 } ;
Line(885) = { 885 ,  886 } ;
Line(886) = { 886 ,  881 } ;
Line Loop(103) = { 881, 882, 883, 884, 885, 886 } ;
Plane Surface( 103 ) = {103};
Plane Surface( 104 ) = {1, 2, 3, 4, 5, 6, 7, 8, 9, 10, 11, 12, 13, 14, 15, 16, 17, 18, 19, 20, 21, 22, 23, 24, 25, 26, 27, 28, 29, 30, 31, 32, 33, 34, 35, 36, 37, 38, 39, 40, 41, 42, 43, 44, 45, 46, 47, 48, 49, 50, 51, 52, 53, 54, 55, 56, 57, 58, 59, 60, 61, 62, 63, 64, 65, 66, 67, 68, 69, 70, 71, 72, 73, 74, 75, 76, 77, 78, 79, 80, 81, 82, 83, 84, 85, 86, 87, 88, 89, 90, 91, 92, 93, 94, 95, 96, 97, 98, 99, 100, 101, 102, 103};
Physical Surface("DOMAIN_GRAIN") = {2, 3, 4, 5, 6, 7, 8, 9, 10, 11, 12, 13, 14, 15, 16, 17, 18, 19, 20, 21, 22, 23, 24, 25, 26, 27, 28, 29, 30, 31, 32, 33, 34, 35, 36, 37, 38, 39, 40, 41, 42, 43, 44, 45, 46, 47, 48, 49, 50, 51, 52, 53, 54, 55, 56, 57, 58, 59, 60, 61, 62, 63, 64, 65, 66, 67, 68, 69, 70, 71, 72, 73, 74, 75, 76, 77, 78, 79, 80, 81, 82, 83, 84, 85, 86, 87, 88, 89, 90, 91, 92, 93, 94, 95, 96, 97, 98, 99, 100, 101, 102, 103};
Physical Surface("DOMAIN_JOIN") = {-104};
Delete { 
  Surface{1, 2, 3, 4, 5, 6, 7, 8, 9, 10, 11, 12, 13, 14, 15, 16, 17, 18, 19, 20, 21, 22, 23, 24, 25, 26, 27, 28, 29, 30, 31, 32, 33, 34, 35, 36, 37, 38, 39, 40, 41, 42, 43, 44, 45, 46, 47, 48, 49, 50, 51, 52, 53, 54, 55, 56, 57, 58, 59, 60, 61, 62, 63, 64, 65, 66, 67, 68, 69, 70, 71, 72, 73, 74, 75, 76, 77, 78, 79, 80, 81, 82, 83, 84, 85, 86, 87, 88, 89, 90, 91, 92, 93, 94, 95, 96, 97, 98, 99, 100, 101, 102, 103};
} 
Physical Line("LEFT")   = {1}; 
Physical Line("RIGHT")   = {3}; 
Physical Line("BOT")  = {4}; 
Physical Line("TOP") = {2}; 
