/* By Emil Simonsen */
version 12.1X47-D15.4;
system {
    host-name vSRX_2;
    /* User: root Password: Rootpass */
    root-authentication {
        encrypted-password "$1$4TkbZDtp$6E8C6Bg7K6gnHR31XnJjl0";
    }
}
interfaces {
    ge-0/0/1 {
        unit 0 {
            family inet {
                address 192.168.12.1/24;
            }
        }
    }
    ge-0/0/2 {
        unit 0 {
            family inet {
                address 192.168.13.1/24;
            }
        }
    }
    ge-0/0/4 {
        unit 0 {
            family inet {
                address 10.10.10.2/30;
            }
        }
    }
}
routing-options {
    static {
        route 192.168.10.0/24 next-hop 10.10.10.1;
        route 192.168.11.0/24 next-hop 10.10.10.1;
    }
}
security {
    address-book {
        global {
            address ACTUATOR_LAN_A 192.168.12.0/24;
            address ACTUATOR_LAN_B 192.168.13.0/24;
            address WEB_SERVER 192.168.11.2/32;
            address PC4 192.168.13.2/32;
        }
    }
    policies {
        from-zone ACTUATOR_LAN_A to-zone ACTUATOR_LAN_B {
            policy allow-icmp-udp {
                match {
                    source-address any;
                    destination-address any;
                    /* udp enables traceroute */
                    application [ junos-icmp-ping junos-udp-any ];
                }
                then {
                    permit;
                }
            }
        }
        from-zone ACTUATOR_LAN_B to-zone ACTUATOR_LAN_A {
            policy allow-icmp-udp {
                match {
                    source-address any;
                    destination-address any;
                    /* udp enables traceroute */
                    application [ junos-icmp-ping junos-udp-any ];
                }
                then {
                    permit;
                }
            }
        }
        from-zone ACTUATOR_LAN_A to-zone INTER_LAN_1 {
            policy deny-icmp-udp {
                match {
                    source-address any;
                    destination-address any;
                    application [ junos-icmp-ping junos-udp-any ];
                }
                then {
                    deny;
                }
            }
        }
        from-zone ACTUATOR_LAN_B to-zone INTER_LAN_1 {
            policy deny-icmp-udp {
                match {
                    source-address any;
                    destination-address any;
                    application [ junos-icmp-ping junos-udp-any ];
                }
                then {
                    deny;
                }
            }
            policy allow-PC4-http-WEB_SERVER {
                match {
                    source-address PC4;
                    destination-address WEB_SERVER;
                    application [ junos-http my-http-8000 ];
                }
                then {
                    permit;
                }
            }
        }
        from-zone INTER_LAN_1 to-zone ACTUATOR_LAN_A {
            policy allow-icmp-udp {
                match {
                    source-address any;
                    destination-address any;
                    application [ junos-icmp-ping junos-udp-any ];
                }
                then {
                    permit;
                }
            }
        }
        from-zone INTER_LAN_1 to-zone ACTUATOR_LAN_B {
            policy allow-icmp-udp {
                match {
                    source-address any;
                    destination-address any;
                    application [ junos-icmp-ping junos-udp-any ];
                }
                then {
                    permit;
                }
            }
        }
        default-policy {
            deny-all;
        }
    }
    zones {
        security-zone ACTUATOR_LAN_A {
            interfaces {
                ge-0/0/1.0 {
                    host-inbound-traffic {
                        system-services {
                            ping;
                        }
                    }
                }
            }
        }
        security-zone ACTUATOR_LAN_B {
            interfaces {
                ge-0/0/2.0 {
                    host-inbound-traffic {
                        system-services {
                            ping;
                        }
                    }
                }
            }
        }
        security-zone INTER_LAN_1 {
            interfaces {
                ge-0/0/4.0 {
                    host-inbound-traffic {
                        system-services {
                            ping;
                        }
                    }
                }
            }
        }
    }
}
applications {
    application my-http-8000 {
        application-protocol http;
        protocol tcp;
        destination-port 8000;
    }
}
