/* Assignment 53. */
/* By Emil C. Simonsen*/
version 12.1X47-D15.4;
system {
    host-name vSRX1;
    /* User: root Password: Rootpass */
    root-authentication {
        encrypted-password "$1$4TkbZDtp$6E8C6Bg7K6gnHR31XnJjl0";
    }
    services {
        ssh;
    }
}
interfaces {
    ge-0/0/1 {
        unit 0 {
            family inet {
                address 192.168.10.1/24;
            }
        }
    }
    ge-0/0/2 {
        unit 0 {
            family inet {
                address 192.168.11.1/24;
            }
        }
    }
}
security {
    policies {
        from-zone USER_LAN to-zone SERVER_LAN {
            policy default-permit {
                match {
                    source-address any;
                    destination-address any;
                    application any;
                }
                then {
                    permit;
                }
            }
        }
        from-zone SERVER_LAN to-zone USER_LAN {
            policy default-deny {
                match {
                    source-address any;
                    destination-address any;
                    application any;
                }
                then {
                    deny;

                }
            }
        }
    }
    zones {
        security-zone USER_LAN {
            interfaces {
                ge-0/0/1.0 {
                    host-inbound-traffic {
                        system-services {
                            ping;
                        }
                    }
                }
            }
        }
        security-zone SERVER_LAN {
            interfaces {
                ge-0/0/2.0 {
                    host-inbound-traffic {
                        system-services {
                            ping;
                        }
                    }
                }
            }
        }
    }
}
