[
  { "timestamp": "2022-07-19 09:17:46",
    "originURL": "https://www.reddit.com/r/Supernote/comments/w0v6ic/comment/igr8nwl/",
    "filename": [ "20220719091746_pro_con.png" ],
    "tags": [ "notes" ],
    "owner": "u/Nerdy_Birdy_30",
    "title": "Pro-Con",
    "description": ""
  }
]