[
  { "timestamp": "2022-11-09 22:58:45",
    "originURL": "https://www.reddit.com/r/Supernote/comments/yqyb4o/notebook_cover_templates/",
    "filename": [ "20221109225845_cover_1.png", "20221109225845_cover_2.png", "20221109225845_cover_3.png" ],
    "tags": [ "cover" ],
    "owner": "?",
    "title": "Notebook Cover",
    "description": ""
  }
]