[
  { "timestamp": "2022-08-25 12:45:41",
    "originURL": "https://www.reddit.com/r/Supernote/comments/wxdb31/custom_ruled_line_tighter/",
    "filename": [ "20220825124541_lines.png" ],
    "tags": [ "lines" ],
    "owner": "u/TiemenSch",
    "title": "Ruled Line",
    "description": ""
  }
]