[
  { "timestamp": "2022-11-30 08:40:51",
    "originURL": "https://www.reddit.com/r/Supernote/comments/z8ma2o/giving_away_supernote_mindmap_for_toc_template/",
    "filename": [ "20221130084051_mindmap.png" ],
    "tags": [ "mindmap" ],
    "owner": "u/Quetzal_2000",
    "title": "Mind Map",
    "description": ""
  }
]