[
  { "timestamp": "2021-11-12 22:48:39",
    "originURL": "https://www.reddit.com/r/Supernote/comments/qsmziu/split_study_note_template/",
    "filename": [ "20211112224839_study.png" ],
    "tags": [ "notes" ],
    "owner": "u/kichien",
    "title": "Split Study Note",
    "description": ""
  }
]