[
  { "timestamp": "2021-05-20 20:02:05",
    "originURL": "https://www.reddit.com/r/Supernote/comments/nh9zq3/new_template_trackers_bujo/",
    "filename": [ "20210520200205_habit_daily_six.png" ],
    "tags": [ "tracker", "habit", "daily" ],
    "owner": "u/nikosan-zero",
    "title": "Daily Habit Tracker",
    "description": ""
  }
]