[
  { "timestamp": "2022-03-24 21:02:53",
    "originURL": "https://www.reddit.com/r/Supernote/comments/tn4kem/task_list_templates_5mm_6mm/",
    "filename": [ "20220324210253_task_5mm.png" ],
    "tags": [ "notes", "a5x 5mm" ],
    "owner": "u/mirocom",
    "title": "Task List (5mm)",
    "description": ""
  },
  { "timestamp": "2022-03-24 21:02:53",
    "originURL": "https://www.reddit.com/r/Supernote/comments/tn4kem/task_list_templates_5mm_6mm/",
    "filename": [ "20220324210253_task_6mm.png" ],
    "tags": [ "notes", "a5x 6mm" ],
    "owner": "u/mirocom",
    "title": "Task List (6mm)",
    "description": ""
  }
]
