[
  { "timestamp": "2021-10-18 22:47:00",
    "originURL": "https://www.reddit.com/r/Supernote/comments/qaxypr/recreated_a_blank_hobonichi_weekly_template/",
    "filename": [ "20211018224700_hobonichi_mtw.png", "20211018224700_hobonichi_rfss.png" ],
    "tags": [ "planner", "weekly" ],
    "owner": "u/inlove_outdoors",
    "title": "Hobonichi Weekly",
    "description": ""
  },
  { "timestamp": "2021-10-18 22:47:00",
    "originURL": "https://www.reddit.com/r/Supernote/comments/qaxypr/recreated_a_blank_hobonichi_weekly_template/",
    "filename": [ "20211018224700_hobonichi_wide_mtw.png", "20211018224700_hobonichi_wide_rfss.png" ],
    "tags": [ "planner", "weekly" ],
    "owner": "u/inlove_outdoors",
    "title": "Hobonichi Weekly (Wide)",
    "description": ""
  }
]