[
  { "timestamp": "2021-08-29 19:55:02",
    "originURL": "https://www.reddit.com/r/Supernote/comments/pe2eru/journaling_templates_daily_reflections_when_bad/",
    "filename": [ "20210829195502_reflect_thing.png" ],
    "tags": [ "mood" ],
    "owner": "u/Suspicious_Novel6428",
    "title": "Bad Things Happen Reflection",
    "description": ""
  },
  { "timestamp": "2021-08-29 19:55:02",
    "originURL": "https://www.reddit.com/r/Supernote/comments/pe2eru/journaling_templates_daily_reflections_when_bad/",
    "filename": [ "20210829195502_reflect_daily.png" ],
    "tags": [ "mood" ],
    "owner": "u/Suspicious_Novel6428",
    "title": "Daily Reflections",
    "description": ""
  }
]
