[
  { "timestamp": "2021-12-27 10:11:27",
    "originURL": "https://www.reddit.com/r/Supernote/comments/rpkd1h/another_meeting_notes_template_optimised_for_a6x/",
    "filename": [ "20211227101127_meeting_1.png", "20211227101127_meeting_2.png" ],
    "tags": [ "log", "meeting", "a6x" ],
    "owner": "u/andrewmelder_",
    "title": "Meeting Notes",
    "description": ""
  }
]