[
  { "timestamp": "2021-07-16 10:19:25",
    "originURL": "https://www.reddit.com/r/Supernote/comments/ole23c/striped_table_template/",
    "filename": [ "20210716101925_striped_table.png" ],
    "tags": [ "table" ],
    "owner": "u/Gerqus",
    "title": "Striped Table",
    "description": ""
  }
]