[
  { "timestamp": "2022-03-27 23:49:09",
    "originURL": "https://www.reddit.com/r/Supernote/comments/tpwdjl/7mm_partly_transparent_lined_and_grid_templates/",
    "filename": [ "20220327234909_7mm_line.png" ],
    "tags": [ "lines", "7mm", "a5x" ],
    "owner": "u/dinosaur__fan",
    "title": "Lines (7mm)",
    "description": ""
  },
  { "timestamp": "2022-03-27 23:49:09",
    "originURL": "https://www.reddit.com/r/Supernote/comments/tpwdjl/7mm_partly_transparent_lined_and_grid_templates/",
    "filename": [ "20220327234909_7mm_grid.png" ],
    "tags": [ "grid", "7mm", "a5x" ],
    "owner": "u/dinosaur__fan",
    "title": "Grid (7mm)",
    "description": ""
  }
]
