[
  { "timestamp": "2021-02-01 06:46:10",
    "originURL": "https://www.reddit.com/r/Supernote/comments/l9x16r/minimalist_monthly_horizontal_and_weekly_overview/",
    "filename": [ "20210201064610_overview_monthly.png" ],
    "tags": [ "planner", "monthly" ],
    "owner": "u/scamper_",
    "title": "Minimalist Monthly Overview",
    "description": ""
  },
  { "timestamp": "2021-02-01 06:46:10",
    "originURL": "https://www.reddit.com/r/Supernote/comments/l9x16r/minimalist_monthly_horizontal_and_weekly_overview/",
    "filename": [ "20210201064610_overview_weekly.png" ],
    "tags": [ "planner", "weekly" ],
    "owner": "u/scamper_",
    "title": "Minimalist Weekly Overview",
    "description": ""
  }
]
