[
  { "timestamp": "2022-07-24 23:59:32",
    "originURL": "https://www.reddit.com/r/Supernote/comments/w79tig/just_got_my_a6x_in_immediately_hyperfixated_on/",
    "filename": [ "20220724235932_daily.png" ],
    "tags": [ "planner", "daily" ],
    "owner": "u/toboldlynerd",
    "title": "Daily Planner",
    "description": ""
  },
  { "timestamp": "2022-07-24 23:59:32",
    "originURL": "https://www.reddit.com/r/Supernote/comments/w79tig/just_got_my_a6x_in_immediately_hyperfixated_on/",
    "filename": [ "20220724235932_weekly.png" ],
    "tags": [ "planner", "weekly" ],
    "owner": "u/toboldlynerd",
    "title": "Weekly Planner",
    "description": ""
  },
  { "timestamp": "2022-07-24 23:59:32",
    "originURL": "https://www.reddit.com/r/Supernote/comments/w79tig/just_got_my_a6x_in_immediately_hyperfixated_on/",
    "filename": [ "20220724235932_dispensary_product.png" ],
    "tags": [ "tracker" ],
    "owner": "u/toboldlynerd",
    "title": "Dispensary Product Tracker",
    "description": ""
  }
]