[
  { "timestamp": "2022-07-26 17:29:02",
    "originURL": "https://www.reddit.com/r/Supernote/comments/w8pomn/calendar_template/",
    "filename": [ "20220726172902_monthly.png" ],
    "tags": [ "planner", "monthly" ],
    "owner": "u/jordanlizzy",
    "title": "Monthly Planner",
    "description": ""
  }
]
