[
  { "timestamp": "2022-09-13 21:26:34",
    "originURL": "https://github.com/kudrykv/latex-yearly-planner",
    "filename": [ "type_pdf.png" ],
    "tags": [ "pdf", "planner" ],
    "owner": "github/kudrykv",
    "title": "LaTeX Yearly Planner Generator",
    "description": ""
  }
]
