[
  { "timestamp": "2022-05-06 21:14:03",
    "originURL": "https://www.reddit.com/r/Supernote/comments/ujxi7v/priority_matrix_template/",
    "filename": [ "20220506211403_priority_matrix.png" ],
    "tags": [ "matrix" ],
    "owner": "u/Nerdy_Birdy_30",
    "title": "Priority Matrix",
    "description": ""
  }
]