[
  { "timestamp": "2022-09-26 13:41:00",
    "originURL": "https://www.reddit.com/r/Supernote/comments/xojmka/daily_planner/",
    "filename": [ "20220926134100_daily1.png" ],
    "tags": [ "planner", "daily" ],
    "owner": "u/GroceryTerrible4372",
    "title": "Daily Planner",
    "description": ""
  },
  { "timestamp": "2022-09-26 13:41:00",
    "originURL": "https://www.reddit.com/r/Supernote/comments/xojmka/daily_planner/",
    "filename": [ "20220926134100_weekly.png" ],
    "tags": [ "planner", "weekly" ],
    "owner": "u/GroceryTerrible4372",
    "title": "Weekly Planner",
    "description": ""
  },
  { "timestamp": "2022-09-26 13:41:00",
    "originURL": "https://www.reddit.com/r/Supernote/comments/xojmka/daily_planner/",
    "filename": [ "20220926134100_daily2.png" ],
    "tags": [ "planner", "daily" ],
    "owner": "u/GroceryTerrible4372",
    "title": "Daily Planner",
    "description": ""
  },
  { "timestamp": "2022-09-26 13:41:00",
    "originURL": "https://www.reddit.com/r/Supernote/comments/xojmka/daily_planner/",
    "filename": [ "20220926134100_daily3.png" ],
    "tags": [ "planner", "daily" ],
    "owner": "u/GroceryTerrible4372",
    "title": "Daily Planner",
    "description": ""
  }
]
