[
  { "timestamp": "2021-06-09 07:33:09",
    "originURL": "https://www.reddit.com/r/Supernote/comments/nvpzhn/daily_weekly_and_monthly_template/",
    "filename": [ "20210609073309_planner_daily.png" ],
    "tags": [ "planner", "daily" ],
    "owner": "u/bgnfu7re",
    "title": "Daily Planner",
    "description": ""
  },
  { "timestamp": "2021-06-09 07:33:09",
    "originURL": "https://www.reddit.com/r/Supernote/comments/nvpzhn/daily_weekly_and_monthly_template/",
    "filename": [ "20210609073309_planner_weekly.png" ],
    "tags": [ "planner", "weekly" ],
    "owner": "u/bgnfu7re",
    "title": "Weekly Planner",
    "description": ""
  },
  { "timestamp": "2021-06-09 07:33:09",
    "originURL": "https://www.reddit.com/r/Supernote/comments/nvpzhn/daily_weekly_and_monthly_template/",
    "filename": [ "20210609073309_planner_monthly_mon.png", "20210609073309_planner_monthly_sun.png" ],
    "tags": [ "planner", "monthly" ],
    "owner": "u/bgnfu7re",
    "title": "Monthly Planner",
    "description": ""
  }
]
