[
  { "timestamp": "2023-01-22 15:39:40",
    "originURL": "https://www.reddit.com/r/Supernote/comments/10imez5/a_few_templates/",
    "filename": [ "20230122153940_meeting.png" ],
    "tags": [ "log", "meeting" ],
    "owner": "u/az-at",
    "title": "Group Meeting Notes",
    "description": ""
  },
  { "timestamp": "2023-01-22 15:39:40",
    "originURL": "https://www.reddit.com/r/Supernote/comments/10imez5/a_few_templates/",
    "filename": [ "20230122153940_1_1_meeting.png" ],
    "tags": [ "log", "meeting" ],
    "owner": "u/az-at",
    "title": "1:1 Meeting Notes",
    "description": ""
  },
  { "timestamp": "2023-01-22 15:39:40",
    "originURL": "https://www.reddit.com/r/Supernote/comments/10imez5/a_few_templates/",
    "filename": [ "20230122153940_todo.png" ],
    "tags": [ "planner" ],
    "owner": "u/az-at",
    "title": "TO DO",
    "description": ""
  },
  { "timestamp": "2023-01-22 15:39:40",
    "originURL": "https://www.reddit.com/r/Supernote/comments/10imez5/a_few_templates/",
    "filename": [ "20230122153940_recipe.png" ],
    "tags": [ "recipe" ],
    "owner": "u/az-at",
    "title": "Recipe",
    "description": ""
  }
]