[
  { "timestamp": "2021-05-14 23:45:41",
    "originURL": "https://www.reddit.com/r/Supernote/comments/ncm62m/rocketbook_templates_version_supernote/",
    "filename": [ "20210514234541_rocketbook_dotted_5mm.png" ],
    "tags": [ "dotted grid", "square", "a5x 5mm" ],
    "owner": "u/Suspicious_Novel6428",
    "title": "Rocketbook Dotted Grid (5mm)",
    "description": ""
  },
  { "timestamp": "2021-05-14 23:45:41",
    "originURL": "https://www.reddit.com/r/Supernote/comments/ncm62m/rocketbook_templates_version_supernote/",
    "filename": [ "20210514234541_rocketbook_grid.png" ],
    "tags": [ "grid", "square" ],
    "owner": "u/Suspicious_Novel6428",
    "title": "Rocketbook Grid",
    "description": ""
  },
  { "timestamp": "2021-05-14 23:45:41",
    "originURL": "https://www.reddit.com/r/Supernote/comments/ncm62m/rocketbook_templates_version_supernote/",
    "filename": [ "20210514234541_rocketbook_lined.png" ],
    "tags": [ "lines" ],
    "owner": "u/Suspicious_Novel6428",
    "title": "Rocketbook Lined Sheet",
    "description": ""
  },
  { "timestamp": "2021-05-14 23:45:41",
    "originURL": "https://www.reddit.com/r/Supernote/comments/ncm62m/rocketbook_templates_version_supernote/",
    "filename": [ "20210514234541_rocketbook_music.png" ],
    "tags": [ "music" ],
    "owner": "u/Suspicious_Novel6428",
    "title": "Rocketbook Music Sheet",
    "description": ""
  }
]
