[
  { "timestamp": "2021-09-27 10:40:12",
    "originURL": "https://www.reddit.com/r/Supernote/comments/pwedk0/eisenhower_matrix_urgent_important/",
    "filename": [ "20210927104012_eisenhower.png" ],
    "tags": [ "matrix" ],
    "owner": "u/Mariannereddit",
    "title": "Eisenhower Matrix (Urgent / Important)",
    "description": ""
  }
]
