{
  "productName": "instrumenta",
  "directories": {
    "output": "release/"
  },
  "files": [
    "**/*",
    "!**/*.ts",
    "!.github",
    "!.vscode",
    "!.code-workspace",
    "!.npmrc",
    "!*.md",
    "!package.json",
    "!package-lock.json",
    "!src/",
    "!e2e/",
    "!hooks/",
    "!_config.yml",
    "!angular.json",
    "!tsconfig*.json",
    "!tslint.json",
    "!.eslintrc.json",
    "!karma.conf.js",
    "!angular.webpack.js",
    "!*.map"
  ],
  "extraFiles": [
    {
      "from": "jars",
      "to": ""
    }
  ],
  "win": {
    "icon": "dist/assets/icons",
    "target": ["portable"]
  },
  "portable": {
    "splashImage": "dist/assets/icons/electron.bmp"
  },
  "mac": {
    "icon": "dist/assets/icons",
    "target": ["dmg"]
  },
  "linux": {
    "icon": "dist/assets/icons",
    "target": ["AppImage"]
  }
}
