[gd_resource type="Animation" format=2]

[resource]
resource_name = "Fire"
length = 0.05
step = 0.05
tracks/0/type = "value"
tracks/0/path = NodePath("Body/Gun1/Sprite:visible")
tracks/0/interp = 1
tracks/0/loop_wrap = true
tracks/0/imported = false
tracks/0/enabled = true
tracks/0/keys = {
"times": PoolRealArray( 0, 0.05 ),
"transitions": PoolRealArray( 1, 1 ),
"update": 1,
"values": [ true, false ]
}
