[gd_scene load_steps=24 format=2]

[ext_resource path="res://Nodes/Actors/Player.tscn" type="PackedScene" id=1]
[ext_resource path="res://Resources/Sprites/PrototypeSprites/grid.png" type="Texture" id=2]
[ext_resource path="res://Nodes/Actors/EnemyRemains.tscn" type="PackedScene" id=3]
[ext_resource path="res://Nodes/Actors/ChasingEnemy.tscn" type="PackedScene" id=4]
[ext_resource path="res://Nodes/UI/AmmunitionCounter.tscn" type="PackedScene" id=5]
[ext_resource path="res://Nodes/UI/ColorSelectionIndicator.tscn" type="PackedScene" id=6]
[ext_resource path="res://Nodes/Environment/Button.tscn" type="PackedScene" id=7]
[ext_resource path="res://Nodes/Environment/Laser.tscn" type="PackedScene" id=8]
[ext_resource path="res://Resources/Sprites/PrototypeSprites/white_square.png" type="Texture" id=9]
[ext_resource path="res://Nodes/Actors/ChargingEnemy.tscn" type="PackedScene" id=10]
[ext_resource path="res://Resources/Sprites/UI/Tutorial/tut4.png" type="Texture" id=11]
[ext_resource path="res://Resources/Sprites/UI/Tutorial/tut1.png" type="Texture" id=12]
[ext_resource path="res://Resources/Sprites/UI/Tutorial/tut2.png" type="Texture" id=13]
[ext_resource path="res://Resources/Sprites/UI/Tutorial/tut5.png" type="Texture" id=14]
[ext_resource path="res://Resources/Sprites/UI/Tutorial/tut3.png" type="Texture" id=15]
[ext_resource path="res://Resources/Sprites/UI/Tutorial/tut6.png" type="Texture" id=16]
[ext_resource path="res://Resources/Sprites/UI/Tutorial/tut7.png" type="Texture" id=17]
[ext_resource path="res://Nodes/Actors/ShootingEnemy.tscn" type="PackedScene" id=18]
[ext_resource path="res://MusicAndSFX/CloudfightOST1.mp3" type="AudioStream" id=19]

[sub_resource type="ConvexPolygonShape2D" id=1]
points = PoolVector2Array( 0, 0, 16, 0, 16, 16, 0, 16 )

[sub_resource type="TileSet" id=2]
0/name = "white_square.png 0"
0/texture = ExtResource( 9 )
0/tex_offset = Vector2( 0, 0 )
0/modulate = Color( 1, 1, 1, 1 )
0/region = Rect2( 0, 0, 16, 16 )
0/tile_mode = 0
0/occluder_offset = Vector2( 0, 0 )
0/navigation_offset = Vector2( 0, 0 )
0/shape_offset = Vector2( 0, 0 )
0/shape_transform = Transform2D( 1, 0, 0, 1, 0, 0 )
0/shape = SubResource( 1 )
0/shape_one_way = false
0/shape_one_way_margin = 1.0
0/shapes = [ {
"autotile_coord": Vector2( 0, 0 ),
"one_way": false,
"one_way_margin": 1.0,
"shape": SubResource( 1 ),
"shape_transform": Transform2D( 1, 0, 0, 1, 0, 0 )
} ]
0/z_index = 0

[sub_resource type="Animation" id=3]
length = 0.001
tracks/0/type = "value"
tracks/0/path = NodePath(".:volume_db")
tracks/0/interp = 1
tracks/0/loop_wrap = true
tracks/0/imported = false
tracks/0/enabled = true
tracks/0/keys = {
"times": PoolRealArray( 0 ),
"transitions": PoolRealArray( 1 ),
"update": 0,
"values": [ -80.0 ]
}

[sub_resource type="Animation" id=4]
resource_name = "fade_in"
length = 4.0
tracks/0/type = "value"
tracks/0/path = NodePath(".:volume_db")
tracks/0/interp = 1
tracks/0/loop_wrap = true
tracks/0/imported = false
tracks/0/enabled = true
tracks/0/keys = {
"times": PoolRealArray( 0, 3 ),
"transitions": PoolRealArray( 1, 1 ),
"update": 0,
"values": [ -80.0, 0.0 ]
}

[node name="Game Manager" type="Node2D"]
rotation = 0.00489884

[node name="Grid" type="TextureRect" parent="."]
modulate = Color( 0.235294, 0.235294, 0.235294, 1 )
margin_left = -5047.0
margin_top = -3807.0
margin_right = 153.0
margin_bottom = -1036.0
rect_scale = Vector2( 4.77145, 11.9495 )
texture = ExtResource( 2 )
stretch_mode = 2
__meta__ = {
"_edit_lock_": true,
"_edit_use_anchors_": false
}

[node name="Labels" type="Node2D" parent="."]

[node name="Tut1" type="Sprite" parent="Labels"]
modulate = Color( 0.443137, 0.443137, 0.443137, 1 )
position = Vector2( 501.6, 475.856 )
texture = ExtResource( 12 )

[node name="Tut2" type="Sprite" parent="Labels"]
modulate = Color( 0.443137, 0.443137, 0.443137, 1 )
position = Vector2( 2899.16, 252.216 )
texture = ExtResource( 13 )

[node name="Tut3" type="Sprite" parent="Labels"]
modulate = Color( 0.443137, 0.443137, 0.443137, 1 )
position = Vector2( 4112, 266.682 )
texture = ExtResource( 15 )

[node name="Tut4" type="Sprite" parent="Labels"]
modulate = Color( 0.443137, 0.443137, 0.443137, 1 )
position = Vector2( 8864.89, 3460.75 )
texture = ExtResource( 11 )

[node name="Tut5" type="Sprite" parent="Labels"]
modulate = Color( 0.443137, 0.443137, 0.443137, 1 )
position = Vector2( 3551.43, 3622.53 )
texture = ExtResource( 14 )

[node name="Tut6" type="Sprite" parent="Labels"]
modulate = Color( 0.443137, 0.443137, 0.443137, 1 )
position = Vector2( 8851.55, 1522.4 )
texture = ExtResource( 16 )

[node name="Tut7" type="Sprite" parent="Labels"]
modulate = Color( 0.443137, 0.443137, 0.443137, 1 )
position = Vector2( 2365.33, 5030.23 )
texture = ExtResource( 17 )

[node name="Tut8" type="Sprite" parent="Labels"]
modulate = Color( 0.443137, 0.443137, 0.443137, 1 )
position = Vector2( 2608.6, 3047.14 )
scale = Vector2( 2, 2 )

[node name="CanvasLayer" type="CanvasLayer" parent="."]

[node name="Ammunition" parent="CanvasLayer" instance=ExtResource( 5 )]
margin_top = 947.384
margin_bottom = 1026.38

[node name="ColorSelection" parent="CanvasLayer" instance=ExtResource( 6 )]
margin_left = 151.818
margin_top = 868.299
margin_right = 151.818
margin_bottom = 868.299

[node name="Environment" type="Node2D" parent="."]

[node name="TileMap" type="TileMap" parent="Environment"]
scale = Vector2( 16, 16 )
tile_set = SubResource( 2 )
cell_size = Vector2( 16, 16 )
collision_layer = 33
collision_mask = 255
format = 1
tile_data = PoolIntArray( -262130, 0, 0, -262129, 0, 0, -262128, 0, 0, -262127, 0, 0, -262126, 0, 0, -262125, 0, 0, -262124, 0, 0, -262123, 0, 0, -262122, 0, 0, -262121, 0, 0, -262120, 0, 0, -262119, 0, 0, -262118, 0, 0, -262117, 0, 0, -131077, 0, 0, -131076, 0, 0, -131075, 0, 0, -131074, 0, 0, -131073, 0, 0, -196608, 0, 0, -196607, 0, 0, -196606, 0, 0, -196605, 0, 0, -196604, 0, 0, -196603, 0, 0, -196602, 0, 0, -196601, 0, 0, -196594, 0, 0, -196584, 0, 0, -196581, 0, 0, -65541, 0, 0, -131065, 0, 0, -131064, 0, 0, -131063, 0, 0, -131062, 0, 0, -131061, 0, 0, -131060, 0, 0, -131059, 0, 0, -131058, 0, 0, -131048, 0, 0, -131045, 0, 0, -5, 0, 0, -65512, 0, 0, -65509, 0, 0, -65508, 0, 0, -65507, 0, 0, -65506, 0, 0, -65505, 0, 0, -65504, 0, 0, -65503, 0, 0, -65502, 0, 0, -65501, 0, 0, -65500, 0, 0, 65531, 0, 0, 36, 0, 0, 131067, 0, 0, 65543, 0, 0, 65544, 0, 0, 65545, 0, 0, 65546, 0, 0, 65547, 0, 0, 65548, 0, 0, 65549, 0, 0, 65550, 0, 0, 65572, 0, 0, 196603, 0, 0, 196604, 0, 0, 196605, 0, 0, 196606, 0, 0, 196607, 0, 0, 131072, 0, 0, 131073, 0, 0, 131074, 0, 0, 131075, 0, 0, 131076, 0, 0, 131077, 0, 0, 131078, 0, 0, 131079, 0, 0, 131086, 0, 0, 131087, 0, 0, 131088, 0, 0, 131089, 0, 0, 131090, 0, 0, 131091, 0, 0, 131092, 0, 0, 131093, 0, 0, 131094, 0, 0, 131095, 0, 0, 131096, 0, 0, 131097, 0, 0, 131098, 0, 0, 131099, 0, 0, 131100, 0, 0, 131101, 0, 0, 131102, 0, 0, 131103, 0, 0, 131104, 0, 0, 131108, 0, 0, 196623, 0, 0, 196624, 0, 0, 196625, 0, 0, 196626, 0, 0, 196627, 0, 0, 196628, 0, 0, 196629, 0, 0, 196630, 0, 0, 196631, 0, 0, 196632, 0, 0, 196633, 0, 0, 196634, 0, 0, 196635, 0, 0, 196636, 0, 0, 196637, 0, 0, 196638, 0, 0, 196639, 0, 0, 196640, 0, 0, 196644, 0, 0, 196645, 0, 0, 196646, 0, 0, 196647, 0, 0, 262159, 0, 0, 262176, 0, 0, 262182, 0, 0, 262183, 0, 0, 327695, 0, 0, 327712, 0, 0, 327716, 0, 0, 327717, 0, 0, 327718, 0, 0, 327719, 0, 0, 327720, 0, 0, 327721, 0, 0, 327722, 0, 0, 393221, 0, 0, 393222, 0, 0, 393223, 0, 0, 393224, 0, 0, 393225, 0, 0, 393226, 0, 0, 393227, 0, 0, 393228, 0, 0, 393229, 0, 0, 393230, 0, 0, 393231, 0, 0, 393248, 0, 0, 393258, 0, 0, 458757, 0, 0, 458767, 0, 0, 458784, 0, 0, 458794, 0, 0, 524293, 0, 0, 524303, 0, 0, 524320, 0, 0, 524321, 0, 0, 524322, 0, 0, 524323, 0, 0, 524324, 0, 0, 524325, 0, 0, 524326, 0, 0, 524327, 0, 0, 524330, 0, 0, 589829, 0, 0, 589839, 0, 0, 589856, 0, 0, 589857, 0, 0, 589858, 0, 0, 589859, 0, 0, 589860, 0, 0, 589861, 0, 0, 589862, 0, 0, 589863, 0, 0, 589866, 0, 0, 655365, 0, 0, 655375, 0, 0, 655378, 0, 0, 655397, 0, 0, 655402, 0, 0, 720901, 0, 0, 720902, 0, 0, 720903, 0, 0, 720904, 0, 0, 720905, 0, 0, 720906, 0, 0, 720907, 0, 0, 720910, 0, 0, 720911, 0, 0, 720914, 0, 0, 720933, 0, 0, 720938, 0, 0, 786437, 0, 0, 786438, 0, 0, 786439, 0, 0, 786440, 0, 0, 786441, 0, 0, 786442, 0, 0, 786443, 0, 0, 786446, 0, 0, 786447, 0, 0, 786450, 0, 0, 786469, 0, 0, 786470, 0, 0, 786471, 0, 0, 786474, 0, 0, 851973, 0, 0, 851986, 0, 0, 852010, 0, 0, 917509, 0, 0, 917522, 0, 0, 917546, 0, 0, 983045, 0, 0, 983046, 0, 0, 983050, 0, 0, 983051, 0, 0, 983052, 0, 0, 983053, 0, 0, 983054, 0, 0, 983055, 0, 0, 983056, 0, 0, 983057, 0, 0, 983058, 0, 0, 983059, 0, 0, 983060, 0, 0, 983061, 0, 0, 983062, 0, 0, 983063, 0, 0, 983064, 0, 0, 983065, 0, 0, 983066, 0, 0, 983067, 0, 0, 983068, 0, 0, 983069, 0, 0, 983070, 0, 0, 983071, 0, 0, 983072, 0, 0, 983073, 0, 0, 983074, 0, 0, 983075, 0, 0, 983076, 0, 0, 983077, 0, 0, 983078, 0, 0, 983079, 0, 0, 983080, 0, 0, 983081, 0, 0, 983082, 0, 0, 1048581, 0, 0, 1048582, 0, 0, 1048586, 0, 0, 1048587, 0, 0, 1048588, 0, 0, 1048589, 0, 0, 1048590, 0, 0, 1048591, 0, 0, 1048592, 0, 0, 1048593, 0, 0, 1048594, 0, 0, 1048595, 0, 0, 1048596, 0, 0, 1048597, 0, 0, 1048598, 0, 0, 1048599, 0, 0, 1048600, 0, 0, 1048601, 0, 0, 1048602, 0, 0, 1048603, 0, 0, 1048604, 0, 0, 1048605, 0, 0, 1048606, 0, 0, 1048607, 0, 0, 1048608, 0, 0, 1048609, 0, 0, 1048610, 0, 0, 1048611, 0, 0, 1048612, 0, 0, 1048613, 0, 0, 1048614, 0, 0, 1048615, 0, 0, 1048616, 0, 0, 1048617, 0, 0, 1048618, 0, 0, 1114117, 0, 0, 1114118, 0, 0, 1114122, 0, 0, 1114123, 0, 0, 1114124, 0, 0, 1114125, 0, 0, 1114126, 0, 0, 1114127, 0, 0, 1114128, 0, 0, 1114129, 0, 0, 1114130, 0, 0, 1114131, 0, 0, 1114132, 0, 0, 1114133, 0, 0, 1114134, 0, 0, 1114135, 0, 0, 1114136, 0, 0, 1114137, 0, 0, 1114138, 0, 0, 1114139, 0, 0, 1114140, 0, 0, 1114141, 0, 0, 1114142, 0, 0, 1114143, 0, 0, 1114144, 0, 0, 1114145, 0, 0, 1114146, 0, 0, 1114147, 0, 0, 1114148, 0, 0, 1114149, 0, 0, 1114150, 0, 0, 1114151, 0, 0, 1114152, 0, 0, 1114153, 0, 0, 1114154, 0, 0, 1179653, 0, 0, 1179659, 0, 0, 1245189, 0, 0, 1245195, 0, 0, 1310725, 0, 0, 1310731, 0, 0, 1376261, 0, 0, 1376267, 0, 0, 1441797, 0, 0, 1441803, 0, 0, 1507333, 0, 0, 1507334, 0, 0, 1507335, 0, 0, 1507336, 0, 0, 1507337, 0, 0, 1507338, 0, 0, 1507339, 0, 0 )

[node name="Player" parent="." instance=ExtResource( 1 )]
position = Vector2( 453.47, 19.1029 )

[node name="Camera2D" type="Camera2D" parent="Player"]
current = true
zoom = Vector2( 2, 2 )

[node name="ChasingEnemy" parent="." instance=ExtResource( 4 )]
position = Vector2( 5396.54, -22.1945 )

[node name="ChargingEnemy" parent="." instance=ExtResource( 10 )]
position = Vector2( 6627.93, 2921.55 )
color = 1
has_shield = true

[node name="ShootingEnemy" parent="." instance=ExtResource( 18 )]
position = Vector2( 5734.35, 2579.86 )

[node name="ChasingEnemy4" parent="." instance=ExtResource( 4 )]
position = Vector2( 6428.38, 1957.08 )
has_shield = true

[node name="ChasingEnemy3" parent="." instance=ExtResource( 4 )]
position = Vector2( 2200.24, 2237.15 )
color = 3
has_shield = true

[node name="ChasingEnemy2" parent="." instance=ExtResource( 4 )]
position = Vector2( 7404.24, 243.746 )
color = 1

[node name="Laser1" parent="." instance=ExtResource( 8 )]
position = Vector2( 7032.95, 261.754 )
scale = Vector2( 1.63427, 1.62599 )

[node name="Laser3" parent="." instance=ExtResource( 8 )]
position = Vector2( 9307.29, 1803.05 )
scale = Vector2( 1.63427, 1.62599 )
color_index = 2

[node name="Laser4" parent="." instance=ExtResource( 8 )]
position = Vector2( 2925.63, 3594.66 )
scale = Vector2( 1.63427, 1.62599 )
color_index = 2

[node name="Laser5" parent="." instance=ExtResource( 8 )]
position = Vector2( 2724.02, 3589.3 )
scale = Vector2( 1.63427, 1.62599 )
color_index = 1

[node name="Laser2" parent="." instance=ExtResource( 8 )]
position = Vector2( 9292.19, 1154.62 )
scale = Vector2( 0.788823, 0.784827 )
color_index = 1

[node name="Button1" parent="." instance=ExtResource( 7 )]
position = Vector2( 6820.42, -258.556 )
rotation = -1.57079
connector = NodePath("../Laser1")

[node name="Button3" parent="." instance=ExtResource( 7 )]
position = Vector2( 1634.04, 3499.4 )
rotation = 1.57079
color_index = 1
connector = NodePath("../Laser5")

[node name="Button4" parent="." instance=ExtResource( 7 )]
position = Vector2( 1637.62, 3652.12 )
rotation = 1.57079
color_index = 2
connector = NodePath("../Laser4")

[node name="Button2" parent="." instance=ExtResource( 7 )]
position = Vector2( 9630.39, 1157.77 )
rotation = -1.57079
color_index = 2
connector = NodePath("../Laser3")

[node name="Remains" parent="." instance=ExtResource( 3 )]
position = Vector2( 2867.03, -25.0405 )
amount = 100

[node name="Remains2" parent="." instance=ExtResource( 3 )]
position = Vector2( 6790.51, -655.899 )
amount = 100

[node name="Remains3" parent="." instance=ExtResource( 3 )]
position = Vector2( 8941.66, 1809.12 )
color_index = 1
amount = 100

[node name="Remains4" parent="." instance=ExtResource( 3 )]
position = Vector2( 9171.69, 2939.45 )
color_index = 1
amount = 100

[node name="Remains5" parent="." instance=ExtResource( 3 )]
position = Vector2( 8650.35, 2834.25 )
amount = 100

[node name="Remains6" parent="." instance=ExtResource( 3 )]
position = Vector2( 1672.19, 2661.9 )
color_index = 3
amount = 100

[node name="AudioStreamPlayer" type="AudioStreamPlayer" parent="."]
stream = ExtResource( 19 )
volume_db = -80.0
autoplay = true

[node name="AnimationPlayer" type="AnimationPlayer" parent="AudioStreamPlayer"]
autoplay = "fade_in"
anims/RESET = SubResource( 3 )
anims/fade_in = SubResource( 4 )
