<?xml version="1.0" encoding="UTF-8"?>
<!DOCTYPE svg PUBLIC "-//W3C//DTD SVG 1.1//EN" "http://www.w3.org/Graphics/SVG/1.1/DTD/svg11.dtd">
<svg xmlns="http://www.w3.org/2000/svg" xmlns:xlink="http://www.w3.org/1999/xlink" version="1.1" width="501px"
    height="221px" viewBox="-0.5 -0.5 501 221" style="background-color: rgb(255, 255, 255);">
    <defs />
    <g>
        <rect x="0" y="90" width="370" height="130" fill="rgb(255, 255, 255)" stroke="rgb(0, 0, 0)"
            stroke-dasharray="3 3" pointer-events="all" />
        <rect x="30" y="140" width="120" height="60" rx="9" ry="9" fill="rgb(255, 255, 255)" stroke="rgb(0, 0, 0)"
            pointer-events="all" />
        <g transform="translate(-0.5 -0.5)">
            <switch>
                <foreignObject pointer-events="none" width="100%" height="100%"
                    requiredFeatures="http://www.w3.org/TR/SVG11/feature#Extensibility"
                    style="overflow: visible; text-align: left;">
                    <div xmlns="http://www.w3.org/1999/xhtml"
                        style="display: flex; align-items: unsafe center; justify-content: unsafe center; width: 118px; height: 1px; padding-top: 170px; margin-left: 31px;">
                        <div data-drawio-colors="color: rgb(0, 0, 0); "
                            style="box-sizing: border-box; font-size: 0px; text-align: center;">
                            <div
                                style="display: inline-block; font-size: 12px; font-family: Helvetica; color: rgb(0, 0, 0); line-height: 1.2; pointer-events: all; white-space: normal; overflow-wrap: normal;">
                                IDT Docker Container Image</div>
                        </div>
                    </div>
                </foreignObject><text x="90" y="174" fill="rgb(0, 0, 0)" font-family="Helvetica" font-size="12px"
                    text-anchor="middle">IDT Docker Container...</text>
            </switch>
        </g>
        <rect x="120" y="100" width="140" height="30" fill="none" stroke="none" pointer-events="all" />
        <g transform="translate(-0.5 -0.5)">
            <switch>
                <foreignObject pointer-events="none" width="100%" height="100%"
                    requiredFeatures="http://www.w3.org/TR/SVG11/feature#Extensibility"
                    style="overflow: visible; text-align: left;">
                    <div xmlns="http://www.w3.org/1999/xhtml"
                        style="display: flex; align-items: unsafe center; justify-content: unsafe center; width: 1px; height: 1px; padding-top: 115px; margin-left: 190px;">
                        <div data-drawio-colors="color: rgb(0, 0, 0); "
                            style="box-sizing: border-box; font-size: 0px; text-align: center;">
                            <div
                                style="display: inline-block; font-size: 12px; font-family: Helvetica; color: rgb(0, 0, 0); line-height: 1.2; pointer-events: all; white-space: nowrap;">
                                <b>Lava Test framework</b></div>
                        </div>
                    </div>
                </foreignObject><text x="190" y="119" fill="rgb(0, 0, 0)" font-family="Helvetica" font-size="12px"
                    text-anchor="middle">Lava Test framework</text>
            </switch>
        </g>
        <rect x="220" y="140" width="120" height="60" rx="9" ry="9" fill="rgb(255, 255, 255)" stroke="rgb(0, 0, 0)"
            pointer-events="all" />
        <g transform="translate(-0.5 -0.5)">
            <switch>
                <foreignObject pointer-events="none" width="100%" height="100%"
                    requiredFeatures="http://www.w3.org/TR/SVG11/feature#Extensibility"
                    style="overflow: visible; text-align: left;">
                    <div xmlns="http://www.w3.org/1999/xhtml"
                        style="display: flex; align-items: unsafe center; justify-content: unsafe center; width: 118px; height: 1px; padding-top: 170px; margin-left: 221px;">
                        <div data-drawio-colors="color: rgb(0, 0, 0); "
                            style="box-sizing: border-box; font-size: 0px; text-align: center;">
                            <div
                                style="display: inline-block; font-size: 12px; font-family: Helvetica; color: rgb(0, 0, 0); line-height: 1.2; pointer-events: all; white-space: normal; overflow-wrap: normal;">
                                Device Under Test</div>
                        </div>
                    </div>
                </foreignObject><text x="280" y="174" fill="rgb(0, 0, 0)" font-family="Helvetica" font-size="12px"
                    text-anchor="middle">Device Under Test</text>
            </switch>
        </g>
        <rect x="130" y="0" width="120" height="60" rx="9" ry="9" fill="rgb(255, 255, 255)" stroke="rgb(0, 0, 0)"
            pointer-events="all" />
        <g transform="translate(-0.5 -0.5)">
            <switch>
                <foreignObject pointer-events="none" width="100%" height="100%"
                    requiredFeatures="http://www.w3.org/TR/SVG11/feature#Extensibility"
                    style="overflow: visible; text-align: left;">
                    <div xmlns="http://www.w3.org/1999/xhtml"
                        style="display: flex; align-items: unsafe center; justify-content: unsafe center; width: 118px; height: 1px; padding-top: 30px; margin-left: 131px;">
                        <div data-drawio-colors="color: rgb(0, 0, 0); "
                            style="box-sizing: border-box; font-size: 0px; text-align: center;">
                            <div
                                style="display: inline-block; font-size: 12px; font-family: Helvetica; color: rgb(0, 0, 0); line-height: 1.2; pointer-events: all; white-space: normal; overflow-wrap: normal;">
                                AWS</div>
                        </div>
                    </div>
                </foreignObject><text x="190" y="34" fill="rgb(0, 0, 0)" font-family="Helvetica" font-size="12px"
                    text-anchor="middle">AWS</text>
            </switch>
        </g>
        <path d="M 190 83.63 L 190 66.37" fill="none" stroke="rgb(0, 0, 0)" stroke-miterlimit="10"
            pointer-events="stroke" />
        <path d="M 190 88.88 L 186.5 81.88 L 190 83.63 L 193.5 81.88 Z" fill="rgb(0, 0, 0)" stroke="rgb(0, 0, 0)"
            stroke-miterlimit="10" pointer-events="all" />
        <path d="M 190 61.12 L 193.5 68.12 L 190 66.37 L 186.5 68.12 Z" fill="rgb(0, 0, 0)" stroke="rgb(0, 0, 0)"
            stroke-miterlimit="10" pointer-events="all" />
        <path
            d="M 440 130 C 440 121.72 453.43 115 470 115 C 477.96 115 485.59 116.58 491.21 119.39 C 496.84 122.21 500 126.02 500 130 L 500 180 C 500 188.28 486.57 195 470 195 C 453.43 195 440 188.28 440 180 Z"
            fill="rgb(255, 255, 255)" stroke="rgb(0, 0, 0)" stroke-miterlimit="10" pointer-events="all" />
        <path d="M 500 130 C 500 138.28 486.57 145 470 145 C 453.43 145 440 138.28 440 130" fill="none"
            stroke="rgb(0, 0, 0)" stroke-miterlimit="10" pointer-events="all" />
        <g transform="translate(-0.5 -0.5)">
            <switch>
                <foreignObject pointer-events="none" width="100%" height="100%"
                    requiredFeatures="http://www.w3.org/TR/SVG11/feature#Extensibility"
                    style="overflow: visible; text-align: left;">
                    <div xmlns="http://www.w3.org/1999/xhtml"
                        style="display: flex; align-items: unsafe center; justify-content: unsafe center; width: 58px; height: 1px; padding-top: 168px; margin-left: 441px;">
                        <div data-drawio-colors="color: rgb(0, 0, 0); "
                            style="box-sizing: border-box; font-size: 0px; text-align: center;">
                            <div
                                style="display: inline-block; font-size: 12px; font-family: Helvetica; color: rgb(0, 0, 0); line-height: 1.2; pointer-events: all; white-space: normal; overflow-wrap: normal;">
                                Artifactory (optional)</div>
                        </div>
                    </div>
                </foreignObject><text x="470" y="171" fill="rgb(0, 0, 0)" font-family="Helvetica" font-size="12px"
                    text-anchor="middle">Artifactor...</text>
            </switch>
        </g>
        <path d="M 376.37 155 L 433.63 155" fill="none" stroke="rgb(0, 0, 0)" stroke-miterlimit="10"
            pointer-events="stroke" />
        <path d="M 371.12 155 L 378.12 151.5 L 376.37 155 L 378.12 158.5 Z" fill="rgb(0, 0, 0)" stroke="rgb(0, 0, 0)"
            stroke-miterlimit="10" pointer-events="all" />
        <path d="M 438.88 155 L 431.88 158.5 L 433.63 155 L 431.88 151.5 Z" fill="rgb(0, 0, 0)" stroke="rgb(0, 0, 0)"
            stroke-miterlimit="10" pointer-events="all" />
    </g>
    <switch>
        <g requiredFeatures="http://www.w3.org/TR/SVG11/feature#Extensibility" /><a transform="translate(0,-5)"
            xlink:href="https://www.drawio.com/doc/faq/svg-export-text-problems" target="_blank"><text
                text-anchor="middle" font-size="10px" x="50%" y="100%">Text is not SVG - cannot display</text></a>
    </switch>
</svg>
