{
    "server": {
        "address": "0.0.0.0",
        "port": 4000
    },
    "system": {
        "relay_product_name": "USBRelay2",
        "can_interfaces": [
            {
                "name": "can0",
                "bitrate": 125000
            }
        ]
    }
}
