<?xml version="1.0" encoding="utf-8"?>
<!-- Generator: Adobe Illustrator 25.2.2, SVG Export Plug-In . SVG Version: 6.00 Build 0)  -->
<svg version="1.1" id="Livello_1" xmlns="http://www.w3.org/2000/svg" xmlns:xlink="http://www.w3.org/1999/xlink" x="0px" y="0px"
	 viewBox="0 0 24.2 45.5" style="enable-background:new 0 0 24.2 45.5;" xml:space="preserve">
<style type="text/css">
	.st0{fill:none;stroke:#FFFFFF;stroke-width:2;stroke-linecap:round;}
</style>
<g transform="translate(-1797.164 -1352.236)">
	<path class="st0" d="M1819.9,1353.7l-21.3,21.3"/>
	<path class="st0" d="M1820,1396.3l-21.4-21.4"/>
</g>
</svg>
