<svg width="23" height="25" viewBox="0 0 23 25" fill="none" xmlns="http://www.w3.org/2000/svg">
    <g clip-path="url(#a)">
        <path d="M22.326 7.675 10.193 20.863c-.899.977-2.356.977-3.255 0L.674 14.055c-.899-.977-.899-2.562 0-3.539.9-.977 2.357-.977 3.255 0l4.637 5.04L19.07 4.137c.899-.977 2.356-.976 3.255 0 .899.977.899 2.56 0 3.538z" fill="#fff"/>
    </g>
    <defs>
        <clipPath id="a">
            <path fill="#fff" d="M0 0h23v25H0z"/>
        </clipPath>
    </defs>
</svg>
