<svg width="427" height="382" viewBox="0 0 427 382" fill="none" xmlns="http://www.w3.org/2000/svg">
    <path d="M450.115-113.895c5.67-2.402 11.815 2.235 11.06 8.347l-59.227 479.599c-.755 6.112-7.843 9.115-12.759 5.405L3.458 88.364c-4.916-3.71-3.972-11.35 1.698-13.752l444.959-188.507z" fill="#30849E"/>
</svg>
