<svg width="316" height="284" viewBox="0 0 316 284" fill="none" xmlns="http://www.w3.org/2000/svg">
<path d="M316 197.374C316 305.898 228.248 393.874 120 393.874C11.7522 393.874 -76 305.898 -76 197.374C-76 88.8501 11.7522 0.874023 120 0.874023C228.248 0.874023 316 88.8501 316 197.374Z" fill="#F7C889"/>
</svg>
