{
    "1": {
        "name": "Invertor hibrid unda pura 1000W cu regulator PWM 50A MPPSOLAR",
        "power": 1000,
        "voltage": 12,
        "charging": 50,
        "price": 2639,
        "picture": "https://www.solar-depot.ro/poze_prod/360/159.jpg",
        "link": "https://www.solar-depot.ro/159/Invertor-hibrid-unda-pura-1000W-cu-regulator-PWM-50A-MPPSOLAR"
    },
    "2": {
        "name": "Invertor MPPSOLAR 2424MSE1 tip hibrid",
        "power": 2400,
        "voltage": 12,
        "charging": 50,
        "price": 2749,
        "picture": "../static/assets/pictures/Invertor_2.jpg",
        "link": "https://www.solar-depot.ro/204/Invertor-hibrid-unda-pura-2400W-cu-regulator-MPPT-40A-MPPSOLAR"
    },
    "3": {
        "name": "Invertor hibrid unda pura 3000W cu regulator MPPT 40A MPPSOLAR",
        "power": 1000,
        "voltage": 24,
        "charging": 40,
        "price": 3509,
        "picture": "https://www.solar-depot.ro/poze_prod/360/140.jpg",
        "link": "https://www.solar-depot.ro/140/Invertor-hibrid-unda-pura-3000W-cu-regulator-MPPT-40A-MPPSOLAR"
    },
    "4": {
        "name": "Invertor hibrid unda pura 3000W cu regulator MPPT 60A MPPSOLAR",
        "power": 1500,
        "voltage": 24,
        "charging": 60,
        "price": 3949,
        "picture": "https://www.solar-depot.ro/poze_prod/360/145.jpg",
        "link": "https://www.solar-depot.ro/145/Invertor-hibrid-unda-pura-3000W-cu-regulator-MPPT-60A-MPPSOLAR"
    },
    "5": {
        "name": "Invertor hibrid unda pura 4000W cu regulator MPPT 80A MPPSOLAR",
        "power": 4000,
        "voltage": 48,
        "charging": 80,
        "price": 4384,
        "picture": "https://www.solar-depot.ro/poze_prod/360/141.jpg",
        "link": "https://www.solar-depot.ro/141/Invertor-hibrid-unda-pura-4000W-cu-regulator-MPPT-80A-MPPSOLAR"
    },
    "6": {
        "name": "Invertor MPPSOLAR 3024GK tip hibrid",
        "power": 3000,
        "voltage": 12,
        "charging": 80,
        "price": 4399,
        "picture": "../static/assets/pictures/Invertor_6.jpg",
        "link": "https://www.solar-depot.ro/160/Invertor-hibrid-unda-pura-3000W-cu-regulator-MPPT-80A-fara-stocare"
    },
    "7": {
        "name": "Invertor hibrid unda pura 5000W cu regulator MPPT 80A MPPSOLAR",
        "power": 4000,
        "voltage": 48,
        "charging": 80,
        "price": 5169,
        "picture": "https://www.solar-depot.ro/poze_prod/360/158.jpg",
        "link": "https://www.solar-depot.ro/158/Invertor-hibrid-unda-pura-5000W-cu-regulator-MPPT-80A-MPPSOLAR"
    },
    "8": {
        "name": "Invertor hibrid unda pura 3000W cu regulator MPPT 60A si transfer 0ms",
        "power": 1500,
        "voltage": 24,
        "charging": 60,
        "price": 5279,
        "picture": "https://www.solar-depot.ro/poze_prod/360/156.jpg",
        "link": "https://www.solar-depot.ro/156/Invertor-hibrid-unda-pura-3000W-cu-regulator-MPPT-60A-si-transfer-0ms"
    },
    "9": {
        "name": "Invertor  MPPSOLAR PIP 5048GK tip hibrid",
        "power": 5000,
        "voltage": 12,
        "charging": 80,
        "price": 5389,
        "picture": "../static/assets/pictures/Invertor_9.jpg",
        "link": "https://www.solar-depot.ro/199/Invertor-hibrid-unda-pura-5000W-cu-regulator-MPPT-80A-MPPSOLAR"
    },
    "10": {
        "name": "Invertor hibrid OnGrid MPI 5.5K",
        "power": 6500,
        "voltage": 12,
        "charging": 60,
        "price": 9790,
        "picture": "../static/assets/pictures/Invertor_10.jpg",
        "link": "https://www.solar-depot.ro/157/Invertor-hibrid-unda-pura-5500W-cu-regulator-MPPT-60A"
    },
    "11": {
        "name": "Invertor hibrid unda pura 5000W cu regulator MPPT 100A MPPSOLAR",
        "power": 10000,
        "voltage": 48,
        "charging": 100,
        "price": 11659,
        "picture": "https://www.solar-depot.ro/poze_prod/360/143.jpg",
        "link": "https://www.solar-depot.ro/143/Invertor-hibrid-unda-pura-5000W-cu-regulator-MPPT-100A-MPPSOLAR"
    },
    "12": {
        "name": "Invertor hibrid trifazic unda pura 10kW cu regulator MPPT 200A",
        "power": 14850,
        "voltage": 48,
        "charging": 200,
        "price": 18666,
        "picture": "https://www.solar-depot.ro/poze_prod/360/146.jpg",
        "link": "https://www.solar-depot.ro/146/Invertor-hibrid-trifazic-unda-pura-10kW-cu-regulator-MPPT-200A"
    }
}