[
    [
        {
            "price": 1319,
            "link": "https://www.solar-depot.ro/183/Panou-fotovoltaic-monocristalin-360W"
        },
        {
            "price": 1012,
            "link": "https://www.solar-depot.ro/178/Panou-fotovoltaic-monocristalin-300W"
        },
        {
            "price": 769,
            "link": "https://www.solar-depot.ro/161/Panou-fotovoltaic-270W"
        },
        {
            "name": "Panou fotovoltaic 260W",
            "type": "policristalin",
            "power": 260,
            "voltage": 31.98,
            "length": 1.645,
            "width": 0.99,
            "price": 659,
            "picture": "https://www.solar-depot.ro/poze_prod/360/24.jpg",
            "link": "https://www.solar-depot.ro/24/Panou-fotovoltaic-260W"
        },
        {
            "price": 604,
            "link": "https://www.solar-depot.ro/211/Panou-fotovoltaic-policristalin-250W"
        },
        {
            "name": "Panou fotovoltaic 100w",
            "type": "policristalin",
            "power": 90,
            "voltage": 18.4,
            "length": 0.995,
            "width": 0.668,
            "price": 435,
            "picture": "https://www.solar-depot.ro/poze_prod/360/133.jpg",
            "link": "https://www.solar-depot.ro/133/Panou-fotovoltaic-100w"
        },
        {
            "name": "Panou fotovoltaic 55w",
            "type": "policristalin",
            "power": 55,
            "voltage": 18.14,
            "length": 0.668,
            "width": 0.62,
            "price": 328,
            "picture": "https://www.solar-depot.ro/poze_prod/360/134.jpg",
            "link": "https://www.solar-depot.ro/134/Panou-fotovoltaic-55w"
        }
    ],
    [
        {
            "name": "Baterie solara AGM GEL 250Ah",
            "brand": "Caranda",
            "type": "AGMGEL",
            "capacity": 250,
            "voltage": 12,
            "price": 2299,
            "picture": "https://www.solar-depot.ro/poze_prod/360/111.jpg",
            "link": "https://www.solar-depot.ro/111/Baterie-solara-AGM-GEL-250Ah"
        },
        {
            "name": "Baterie solara AGM GEL 150Ah",
            "brand": "Caranda",
            "type": "AGMGEL",
            "capacity": 150,
            "voltage": 12,
            "price": 1529,
            "picture": "https://www.solar-depot.ro/poze_prod/360/110.jpg",
            "link": "https://www.solar-depot.ro/110/Baterie-solara-AGM-GEL-150Ah"
        },
        {
            "name": "Baterie solara VRLA 200Ah",
            "brand": "Caranda",
            "type": "200",
            "capacity": 200,
            "voltage": 12,
            "price": 1529,
            "picture": "https://www.solar-depot.ro/poze_prod/360/136.jpg",
            "link": "https://www.solar-depot.ro/136/Baterie-solara-VRLA-200Ah"
        },
        {
            "name": "Baterie solara VRLA 150Ah",
            "brand": "Caranda",
            "type": "VRLA(AGM)",
            "capacity": 150,
            "voltage": 12,
            "price": 1319,
            "picture": "https://www.solar-depot.ro/poze_prod/360/162.jpg",
            "link": "https://www.solar-depot.ro/162/Baterie-solara-VRLA-150Ah"
        },
        {
            "price": 1078,
            "link": "https://www.solar-depot.ro/175/Baterie-solara-VRLA-150Ah"
        },
        {
            "name": "Baterie solara AGM GEL 100Ah",
            "brand": "Caranda",
            "type": "AGMGEL",
            "capacity": 100,
            "voltage": 12,
            "price": 1040,
            "picture": "https://www.solar-depot.ro/poze_prod/360/109.jpg",
            "link": "https://www.solar-depot.ro/109/Baterie-solara-AGM-GEL-100Ah"
        },
        {
            "name": "Baterie solara AGM GEL 55Ah",
            "brand": "Caranda",
            "type": "AGMGEL",
            "capacity": 55,
            "voltage": 12,
            "price": 710,
            "picture": "https://www.solar-depot.ro/poze_prod/360/108.jpg",
            "link": "https://www.solar-depot.ro/108/Baterie-solara-AGM-GEL-55Ah"
        },
        {
            "name": "Baterie solara VRLA 150Ah",
            "brand": "Caranda",
            "type": "VRLA",
            "capacity": 150,
            "voltage": 12,
            "price": 946,
            "picture": "https://www.solar-depot.ro/poze_prod/360/118.jpg",
            "link": "https://www.solar-depot.ro/118/Baterie-solara-VRLA-150Ah"
        }
    ],
    [
        {
            "name": "Invertor hibrid trifazic unda pura 10kW cu regulator MPPT 200A",
            "power": 14850,
            "voltage": 48,
            "charging": 200,
            "price": 18666,
            "picture": "https://www.solar-depot.ro/poze_prod/360/146.jpg",
            "link": "https://www.solar-depot.ro/146/Invertor-hibrid-trifazic-unda-pura-10kW-cu-regulator-MPPT-200A"
        },
        {
            "price": 4835,
            "link": "https://www.solar-depot.ro/189/Invertor-hibrid-HUAWEI-SUN2000L_3KTL"
        },
        {
            "price": 4175,
            "link": "https://www.solar-depot.ro/188/Invertor-hibrid-HUAWEI-SUN2000L_2KTL"
        },
        {
            "price": 14299,
            "link": "https://www.solar-depot.ro/190/Invertor-hibrid-Fronius-Symo-5kW-5.0_3_S"
        },
        {
            "price": 9790,
            "link": "https://www.solar-depot.ro/157/Invertor-hibrid-unda-pura-5500W-cu-regulator-MPPT-60A"
        },
        {
            "name": "Invertor hibrid unda pura 5000W cu regulator MPPT 100A MPPSOLAR",
            "power": 10000,
            "voltage": 48,
            "charging": 100,
            "price": 11659,
            "picture": "https://www.solar-depot.ro/poze_prod/360/143.jpg",
            "link": "https://www.solar-depot.ro/143/Invertor-hibrid-unda-pura-5000W-cu-regulator-MPPT-100A-MPPSOLAR"
        },
        {
            "price": 8899,
            "link": "https://www.solar-depot.ro/147/Kit-Invertor-hibrid-unda-pura-8000W-cu-regulator-MPPT-160A-MPPSOLAR"
        },
        {
            "price": 5389,
            "link": "https://www.solar-depot.ro/199/Invertor-hibrid-unda-pura-5000W-cu-regulator-MPPT-80A-MPPSOLAR"
        },
        {
            "name": "Invertor hibrid unda pura 3000W cu regulator MPPT 60A si transfer 0ms",
            "power": 1500,
            "voltage": 24,
            "charging": 60,
            "price": 5279,
            "picture": "https://www.solar-depot.ro/poze_prod/360/156.jpg",
            "link": "https://www.solar-depot.ro/156/Invertor-hibrid-unda-pura-3000W-cu-regulator-MPPT-60A-si-transfer-0ms"
        },
        {
            "name": "Invertor hibrid unda pura 5000W cu regulator MPPT 80A MPPSOLAR",
            "power": 4000,
            "voltage": 48,
            "charging": 80,
            "price": 5169,
            "picture": "https://www.solar-depot.ro/poze_prod/360/158.jpg",
            "link": "https://www.solar-depot.ro/158/Invertor-hibrid-unda-pura-5000W-cu-regulator-MPPT-80A-MPPSOLAR"
        },
        {
            "price": 4399,
            "link": "https://www.solar-depot.ro/160/Invertor-hibrid-unda-pura-3000W-cu-regulator-MPPT-80A-fara-stocare"
        },
        {
            "name": "Invertor hibrid unda pura 4000W cu regulator MPPT 80A MPPSOLAR",
            "power": 4000,
            "voltage": 48,
            "charging": 80,
            "price": 4384,
            "picture": "https://www.solar-depot.ro/poze_prod/360/141.jpg",
            "link": "https://www.solar-depot.ro/141/Invertor-hibrid-unda-pura-4000W-cu-regulator-MPPT-80A-MPPSOLAR"
        },
        {
            "name": "Invertor hibrid unda pura 3000W cu regulator MPPT 60A MPPSOLAR",
            "power": 1500,
            "voltage": 24,
            "charging": 60,
            "price": 3949,
            "picture": "https://www.solar-depot.ro/poze_prod/360/145.jpg",
            "link": "https://www.solar-depot.ro/145/Invertor-hibrid-unda-pura-3000W-cu-regulator-MPPT-60A-MPPSOLAR"
        },
        {
            "name": "Invertor hibrid unda pura 3000W cu regulator MPPT 40A MPPSOLAR",
            "power": 1000,
            "voltage": 24,
            "charging": 40,
            "price": 3509,
            "picture": "https://www.solar-depot.ro/poze_prod/360/140.jpg",
            "link": "https://www.solar-depot.ro/140/Invertor-hibrid-unda-pura-3000W-cu-regulator-MPPT-40A-MPPSOLAR"
        },
        {
            "price": 2749,
            "link": "https://www.solar-depot.ro/204/Invertor-hibrid-unda-pura-2400W-cu-regulator-MPPT-40A-MPPSOLAR"
        },
        {
            "name": "Invertor hibrid unda pura 1000W cu regulator PWM 50A MPPSOLAR",
            "power": 1000,
            "voltage": 12,
            "charging": 50,
            "price": 2639,
            "picture": "https://www.solar-depot.ro/poze_prod/360/159.jpg",
            "link": "https://www.solar-depot.ro/159/Invertor-hibrid-unda-pura-1000W-cu-regulator-PWM-50A-MPPSOLAR"
        }
    ]
]