<svg width="362" height="288" viewBox="0 0 362 288" fill="none" xmlns="http://www.w3.org/2000/svg">
    <path d="M383.421-135.291c5.671-2.403 11.816 2.234 11.061 8.346L344.204 280.18c-.754 6.112-7.842 9.115-12.758 5.405L4.004 38.481C-.91 34.771.032 27.131 5.703 24.73L383.42-135.29z" fill="#30849E"/>
</svg>
