digraph {
    node [shape=box];

    FecHandler;
    JpegFrame;
    RTPpacket;
    RtpHandler [shape=record,label="{RtpHandler||
        + byte[] createFecPacket()
        \l+ ReceptionStatistic getReceptionStatistic()
        \l+ boolean isFecPacketAvailable()
        \l+ byte[] jpegToRtpPacket(final byte[] jpegImage, int framerate)
        \l+ byte[] nextPlaybackImage()
        \l+ void processRtpPacket(byte[] packetData, int packetLength)
        \l+ void setFecGroupSize(int newGroupSize)\l}"];

    Client;
    Server;

    Client -> RtpHandler [dir=back,arrowtail=odiamond];
    RtpHandler -> JpegFrame [arrowhead=none];
    RtpHandler -> ReceptionStatistic [arrowhead=none];
    RtpHandler -> RTPpacket [arrowhead=none];
    RtpHandler -> FecHandler [dir=back,arrowtail=odiamond];
    Server -> RtpHandler [dir=back,arrowtail=odiamond];
}

