digraph {
    node [shape=record];

    {
        rank=same;
        file [label="<f0> Frame 1|<f1> Frame 2|<f2> ...|<f3> Frame X"];
    }

    {
        rank=same;
        jpeg1 [label="{boundary = --7b3cc56e...|Content-Type: image/jpeg |Content-Length: 41129|JPEG 1}"];
        jpeg2 [label="{boundary = --7b3cc56e...|Content-Type: image/jpeg |Content-Length: 42121|JPEG 2}"];
        jpegX [label="{boundary = --7b3cc56e...|Content-Type: image/jpeg |Content-Length: 11149|JPEG X}"];
    }

    file:f0 -> jpeg1;
    file:f1 -> jpeg2;
    file:f3 -> jpegX;
}

