Img-Name,SHA256,Final-R
pietà_mic14.jpg,0b7acc159ea85e458323045e6545214e42f296e65e65ca905c24c8f1526575fd,"[0, 0, 0, 0, 0, 1, 0, 0, 0, 0, 0, 0, 0, 0, 1, 0, 1, 0, 0, 0, 0, 0, 0, 0, 0, 0, 0, 0, 0, 1, 0, 0]"
pietà_mic6.jpg,e9fa588edf6720f5cdb3052e8166f6637f6ce6d124e165460f9baac87bd5abc3,"[0, 0, 0, 1, 0, 0, 1, 0, 0, 0, 0, 0, 0, 0, 0, 0, 0, 0, 0, 0, 0, 1, 0, 0, 0, 0, 0, 0, 0, 0, 0, 0]"
pietà_mic9.jpg,5a680b6578352c92680fd3ac268cfb72bb61d491195be5fc405b1ae0988e5df9,"[0, 0, 0, 0, 0, 0, 0, 0, 0, 0, 0, 0, 0, 0, 0, 0, 0, 0, 1, 0, 0, 0, 0, 0, 0, 1, 0, 0, 1, 0, 0, 0]"
pietà_mic7.jpg,3d56a9c48d24263cddd47352f70a40572bd92af4203fa3821552994632729165,"[0, 0, 1, 0, 0, 1, 0, 0, 0, 0, 0, 0, 0, 0, 0, 0, 0, 0, 0, 0, 0, 0, 0, 1, 0, 0, 0, 0, 1, 0, 0, 0]"
pietà_mic2.jpg,46262f3c4219448c03d9972c34cb40154e526c2da3c6e2cee0cf615a82f72831,"[0, 0, 0, 0, 0, 0, 0, 0, 0, 0, 0, 0, 1, 0, 1, 0, 0, 1, 0, 0, 0, 1, 0, 0, 0, 0, 0, 0, 0, 0, 0, 0]"
pietà_mic4.jpg,f05493aa73f6ecf0bc037438161b07095aa9006ef230f54d8a4f7bac4332a038,"[0, 0, 0, 0, 0, 0, 0, 0, 0, 1, 0, 0, 0, 1, 0, 0, 1, 0, 0, 0, 0, 0, 0, 0, 1, 0, 0, 0, 0, 0, 0, 0]"
pietà_mic1.jpg,4fb132d24311bf90448073e43ff2ac8ec61a354380e797b897527e7cebedce85,"[0, 0, 0, 0, 0, 1, 0, 0, 0, 0, 0, 0, 0, 0, 1, 0, 1, 0, 0, 0, 0, 0, 0, 0, 1, 0, 0, 0, 0, 0, 0, 0]"
pietà_mic13.jpg,afaa975dc62915552af85429d323be31eba62d182df531fe415ca44f64cf77b1,"[0, 0, 0, 0, 0, 0, 0, 0, 0, 0, 0, 0, 0, 0, 0, 0, 0, 1, 0, 0, 0, 1, 0, 0, 0, 0, 0, 0, 0, 0, 1, 0]"
pietà_mic10.jpg,c02114522e70ca6320912b40c9305d927134b9211377e27f8229d8a901fc7f4e,"[0, 0, 0, 1, 0, 0, 0, 0, 0, 0, 0, 0, 0, 0, 1, 0, 0, 0, 1, 0, 0, 0, 0, 0, 0, 0, 0, 0, 0, 0, 0, 1]"
pietà_mic11.jpg,e09e740453232b194f5fd2ec2a46552fcce4d9daef96432ebd06b266130818fd,"[0, 0, 0, 0, 0, 0, 0, 0, 0, 0, 0, 0, 0, 0, 1, 1, 0, 0, 0, 0, 0, 0, 0, 0, 0, 1, 0, 0, 0, 1, 0, 0]"
pietà_mic3.jpg,5c4df1a33eff199e898cc5c8740e7cec9185621b3e00dcbd76a05e6a47a73e48,"[0, 0, 0, 0, 0, 0, 0, 0, 1, 0, 0, 0, 1, 0, 0, 0, 0, 0, 0, 0, 0, 0, 0, 0, 0, 0, 0, 0, 0, 1, 1, 0]"
pietà_mic5.jpg,2f1e96ec1c1995ead1a01ded398d044dad9cc9ad981ce3a1f0dce82e2e83b6a2,"[0, 1, 1, 0, 0, 0, 0, 0, 0, 0, 1, 0, 0, 1, 0, 0, 0, 0, 0, 0, 0, 0, 0, 0, 0, 0, 0, 0, 0, 0, 0, 0]"
pietà_mic0.jpg,561d5265f538d37084c7a128c43b0590733c710f0b5ebaeafa0aed2b6324e0c8,"[0, 0, 0, 0, 0, 0, 0, 0, 1, 0, 1, 0, 0, 0, 0, 0, 1, 0, 0, 0, 0, 0, 0, 0, 0, 0, 0, 0, 0, 0, 0, 0]"
pietà_mic8.jpg,c026d99b6bb6f2d196466ec14f1d4256c7bc844fe5f13bbd2b55f79255f86cda,"[0, 0, 0, 0, 0, 0, 0, 0, 0, 0, 0, 0, 0, 0, 0, 0, 0, 1, 0, 0, 0, 0, 1, 0, 0, 0, 1, 0, 0, 1, 0, 0]"
pietà_mic12.jpg,305908b40243ad083a90d86dbed731ddb3fb856ac4d6e3bb662e155d23ed6890,"[0, 0, 0, 0, 0, 0, 0, 0, 1, 0, 0, 0, 0, 0, 0, 0, 1, 0, 0, 0, 0, 0, 0, 0, 0, 0, 0, 1, 0, 1, 0, 0]"
