Img-Name,Meta,R-Meta,Content,R-Content,Final-R
arena_verona12.jpg,AAA4MKLJSYJWCELD,"[0, 1, 1, 1, 1, 1, 0, 1]",EEAZHP2IYA7ZPELI,"[1, 1, 1, 0, 0, 1, 0, 0]","[1, 1, 1, 0, 0, 1, 0, 0]"
arena_verona13.jpg,AAA4MJT5SIJWCELD,"[0, 1, 1, 0, 1, 1, 0, 1]",EEA7QA25YYYITV3N,"[0, 1, 0, 0, 0, 1, 1, 1]","[0, 1, 0, 0, 0, 1, 1, 1]"
arena_verona9.jpg,AAA5PP75SIJWCELD,"[1, 1, 0, 0, 1, 1, 0, 1]",EEA4RM3FGLH4DMB5,"[0, 0, 0, 0, 1, 1, 1, 0]","[0, 0, 0, 0, 1, 1, 1, 0]"
arena_verona1.jpg,AAA7M775SYJWCELD,"[0, 1, 0, 0, 1, 1, 0, 1]",EEAZHP2IYA7ZPELI,"[1, 1, 1, 0, 0, 1, 0, 0]","[1, 1, 1, 0, 0, 1, 0, 0]"
arena_verona6.jpg,AAA6O375SYJWCELD,"[0, 1, 0, 1, 1, 1, 1, 1]",EEA4HZHMSM4RSJT4,"[0, 0, 1, 0, 1, 1, 0, 0]","[0, 0, 1, 0, 1, 1, 0, 0]"
arena_verona3.jpg,AAA7O3752YJWCELD,"[0, 1, 0, 1, 1, 1, 0, 1]",EEAZG7COSI4Y6ZUY,"[0, 1, 1, 0, 0, 1, 0, 1]","[0, 1, 1, 0, 0, 1, 0, 1]"
arena_verona2.jpg,AAA74375SYJWCELD,"[0, 1, 0, 1, 1, 1, 0, 1]",EEAZOPOI5KLJLSKC,"[1, 1, 1, 1, 0, 1, 0, 0]","[1, 1, 1, 1, 0, 1, 0, 0]"
arena_verona4.jpg,AAA7N7PNSYJWCELD,"[0, 1, 0, 0, 1, 1, 1, 1]",EEA4URITXTF4CLE7,"[0, 0, 1, 0, 1, 1, 0, 1]","[0, 0, 1, 0, 1, 1, 0, 1]"
arena_verona14.jpg,AAA7MP75SQJWCELD,"[1, 1, 0, 0, 1, 1, 0, 1]",EEA4HX3U6XBKQKES,"[1, 0, 0, 1, 1, 1, 0, 0]","[1, 0, 0, 1, 1, 1, 0, 0]"
arena_verona5.jpg,AAA5O335SYJWCELD,"[0, 1, 0, 1, 1, 1, 0, 1]",EEAZWL6E6U5JEZDE,"[0, 0, 1, 0, 1, 1, 0, 0]","[0, 0, 1, 0, 1, 1, 0, 0]"
arena_verona11.jpg,AAA6M575CYJWCELD,"[0, 1, 0, 0, 1, 1, 1, 1]",EEA5FNAIYW7ZVE6U,"[0, 1, 1, 0, 0, 1, 1, 1]","[0, 1, 1, 0, 0, 1, 1, 1]"
arena_verona0.jpg,AAA77Z35SYJWCELD,"[0, 1, 1, 0, 1, 1, 0, 1]",EEA5HN2MYAXZVEMV,"[0, 1, 1, 0, 0, 1, 1, 0]","[0, 1, 1, 0, 0, 1, 1, 0]"
arena_verona8.jpg,AAA7MP75SIJWCELD,"[1, 1, 0, 0, 1, 1, 0, 1]",EEA5RDXIGUR7XXEA,"[1, 1, 0, 0, 1, 1, 0, 1]","[1, 1, 0, 0, 1, 1, 0, 1]"
arena_verona7.jpg,AAA7O37V2YJWCELD,"[0, 1, 0, 1, 1, 1, 1, 1]",EEA6FQJ7B3AHYUVX,"[1, 1, 0, 1, 0, 1, 1, 1]","[1, 1, 0, 1, 0, 1, 1, 1]"
arena_verona10.jpg,AAA7OLX5SQJWCELD,"[0, 1, 0, 0, 1, 1, 0, 1]",EEAZYBTDNFVZNFHW,"[0, 0, 1, 0, 1, 1, 1, 1]","[0, 0, 1, 0, 1, 1, 1, 1]"
