,arena_verona12.jpg,arena_verona13.jpg,arena_verona9.jpg,arena_verona1.jpg,arena_verona6.jpg,arena_verona3.jpg,arena_verona2.jpg,arena_verona4.jpg,arena_verona14.jpg,arena_verona5.jpg,arena_verona11.jpg,arena_verona0.jpg,arena_verona8.jpg,arena_verona7.jpg,arena_verona10.jpg
Type,SHA256,SHA256,SHA256,SHA256,SHA256,SHA256,SHA256,SHA256,SHA256,SHA256,SHA256,SHA256,SHA256,SHA256,SHA256
arena_verona12.jpg,0,56,62,60,59,59,59,58,58,62,59,61,61,62,57
arena_verona13.jpg,56,0,59,63,63,58,60,63,57,62,59,61,62,61,58
arena_verona9.jpg,62,59,0,60,59,64,61,55,58,61,62,56,63,60,60
arena_verona1.jpg,60,63,60,0,61,61,57,60,61,59,60,55,61,59,58
arena_verona6.jpg,59,63,59,61,0,64,61,59,63,60,59,60,62,57,60
arena_verona3.jpg,59,58,64,61,64,0,60,57,59,61,61,58,61,61,61
arena_verona2.jpg,59,60,61,57,61,60,0,61,63,59,63,62,58,61,59
arena_verona4.jpg,58,63,55,60,59,57,61,0,58,56,61,57,61,61,59
arena_verona14.jpg,58,57,58,61,63,59,63,58,0,58,61,60,58,60,60
arena_verona5.jpg,62,62,61,59,60,61,59,56,58,0,56,60,58,63,60
arena_verona11.jpg,59,59,62,60,59,61,63,61,61,56,0,62,60,63,62
arena_verona0.jpg,61,61,56,55,60,58,62,57,60,60,62,0,61,60,61
arena_verona8.jpg,61,62,63,61,62,61,58,61,58,58,60,61,0,61,55
arena_verona7.jpg,62,61,60,59,57,61,61,61,60,63,63,60,61,0,63
arena_verona10.jpg,57,58,60,58,60,61,59,59,60,60,62,61,55,63,0
Type,Final-R,Final-R,Final-R,Final-R,Final-R,Final-R,Final-R,Final-R,Final-R,Final-R,Final-R,Final-R,Final-R,Final-R,Final-R
arena_verona12.jpg,0,16,16,16,12,15,15,16,12,13,12,15,16,16,16
arena_verona13.jpg,16,0,16,16,16,15,15,16,14,13,14,15,14,14,14
arena_verona9.jpg,16,16,0,14,16,15,15,16,14,15,14,13,16,14,14
arena_verona1.jpg,16,16,14,0,16,15,13,16,16,15,16,13,16,12,16
arena_verona6.jpg,12,16,16,16,0,15,13,16,12,13,14,15,16,16,14
arena_verona3.jpg,15,15,15,15,15,0,14,15,15,14,13,12,11,15,15
arena_verona2.jpg,15,15,15,13,13,14,0,15,15,14,13,14,15,15,15
arena_verona4.jpg,16,16,16,16,16,15,15,0,14,13,14,13,16,16,14
arena_verona14.jpg,12,14,14,16,12,15,15,14,0,15,10,15,14,14,14
arena_verona5.jpg,13,13,15,15,13,14,14,13,15,0,15,14,15,15,15
arena_verona11.jpg,12,14,14,16,14,13,13,14,10,15,0,13,16,16,14
arena_verona0.jpg,15,15,13,13,15,12,14,13,15,14,13,0,13,15,13
arena_verona8.jpg,16,14,16,16,16,11,15,16,14,15,16,13,0,14,16
arena_verona7.jpg,16,14,14,12,16,15,15,16,14,15,16,15,14,0,16
arena_verona10.jpg,16,14,14,16,14,15,15,14,14,15,14,13,16,16,0
