Img-Name,Meta,R-Meta,Content,R-Content,Final-R
san_petronio6.jpg,AAA5D53VYYYDFL3R,"[0, 1, 1, 0, 1, 1, 1, 0]",EEA6D4WPBDEPYF6C,"[1, 0, 0, 1, 1, 1, 1, 0]","[1, 1, 1, 1, 1, 1, 1, 0]"
san_petronio1.jpg,AAA5PV7V6YYDFL3R,"[0, 1, 1, 0, 1, 1, 1, 0]",EEA7B5MDRPWCZSBN,"[1, 0, 0, 1, 1, 1, 1, 1]","[1, 1, 1, 1, 1, 1, 1, 1]"
san_petronio14.jpg,AAA5NXTVSYYDFL3R,"[1, 1, 1, 0, 1, 1, 1, 0]",EEA3LYUHJM4IKSTP,"[1, 1, 0, 1, 0, 1, 0, 0]","[1, 1, 1, 1, 1, 1, 1, 0]"
san_petronio8.jpg,AAA5J53V4YYDFL3R,"[0, 1, 1, 0, 1, 1, 1, 0]",EEA2HIYTZFUNYPJ4,"[1, 1, 1, 0, 1, 1, 1, 0]","[1, 1, 1, 0, 1, 1, 1, 0]"
san_petronio0.jpg,AAA575T5SYYDFL3R,"[0, 1, 1, 0, 1, 1, 0, 0]",EEA7D4UDLIPKK2QO,"[0, 1, 1, 1, 1, 1, 0, 1]","[0, 1, 1, 1, 1, 1, 0, 1]"
san_petronio5.jpg,AAA5757VSYYDFL3R,"[0, 1, 1, 0, 1, 1, 1, 0]",EEA6DZUWLL4JLUJI,"[0, 1, 1, 0, 1, 1, 1, 1]","[0, 1, 1, 0, 1, 1, 1, 1]"
san_petronio13.jpg,AAA5HZRV4YYDFL3R,"[0, 1, 1, 0, 1, 1, 1, 0]",EEA2LLY6DQ6JMYRN,"[0, 1, 1, 0, 1, 1, 1, 0]","[0, 1, 1, 0, 1, 1, 1, 0]"
san_petronio12.jpg,AAAZPT3V6YYDFL3R,"[0, 1, 1, 0, 1, 0, 1, 0]",EEA7DM4LBH6E5B4E,"[1, 0, 1, 0, 1, 1, 0, 1]","[1, 1, 1, 0, 1, 1, 1, 1]"
san_petronio11.jpg,AAA5PV7VSYYDFL3R,"[0, 1, 1, 0, 1, 1, 1, 0]",EEA6JI4W254KTVIC,"[0, 1, 0, 1, 0, 1, 1, 1]","[0, 1, 1, 1, 1, 1, 1, 1]"
san_petronio7.jpg,AAA5P53VYYYDFL3R,"[0, 1, 1, 0, 1, 1, 1, 0]",EEA6PJUMTRI4SPMJ,"[1, 0, 1, 0, 1, 1, 1, 0]","[1, 1, 1, 0, 1, 1, 1, 0]"
san_petronio2.jpg,AAA5737V2YYDFL3R,"[0, 1, 1, 1, 1, 1, 1, 0]",EEA6NZ4GYINZZUDY,"[0, 1, 1, 0, 0, 1, 1, 1]","[0, 1, 1, 1, 1, 1, 1, 1]"
san_petronio3.jpg,AAA5L5ZVYYYDFL3R,"[0, 1, 1, 0, 1, 1, 1, 0]",EEAYE46VD3QD3UEP,"[1, 1, 0, 1, 1, 1, 1, 0]","[1, 1, 1, 1, 1, 1, 1, 0]"
san_petronio10.jpg,AAA5P7TV3YYDFL3R,"[0, 1, 1, 0, 1, 1, 1, 1]",EEA2JNSKJW6FB4JP,"[1, 0, 1, 1, 1, 1, 1, 1]","[1, 1, 1, 1, 1, 1, 1, 1]"
san_petronio4.jpg,AAA5P73VYYYDFL3R,"[0, 1, 1, 0, 1, 1, 1, 1]",EEA7TY4AR4PNRCNJ,"[0, 1, 1, 1, 1, 1, 1, 1]","[0, 1, 1, 1, 1, 1, 1, 1]"
san_petronio9.jpg,AAAZ77T52YYDFL3R,"[0, 1, 1, 0, 1, 1, 0, 1]",EEA7DY4OSZMETTMY,"[0, 1, 1, 0, 1, 1, 0, 1]","[0, 1, 1, 0, 1, 1, 0, 1]"
