,reggia_caserta11.jpg,reggia_caserta2.jpg,reggia_caserta14.jpg,reggia_caserta9.jpg,reggia_caserta10.jpg,reggia_caserta7.jpg,reggia_caserta8.jpg,reggia_caserta6.jpg,reggia_caserta1.jpg,reggia_caserta0.jpg,reggia_caserta5.jpg,reggia_caserta3.jpg,reggia_caserta12.jpg,reggia_caserta13.jpg,reggia_caserta4.jpg
Type,SHA256,SHA256,SHA256,SHA256,SHA256,SHA256,SHA256,SHA256,SHA256,SHA256,SHA256,SHA256,SHA256,SHA256,SHA256
reggia_caserta11.jpg,0,64,61,60,57,61,59,58,63,58,62,59,57,59,59
reggia_caserta2.jpg,64,0,61,60,63,59,58,62,64,63,59,62,61,57,62
reggia_caserta14.jpg,61,61,0,61,60,59,60,59,61,60,58,59,58,60,58
reggia_caserta9.jpg,60,60,61,0,56,53,60,57,58,62,63,64,59,61,59
reggia_caserta10.jpg,57,63,60,56,0,60,60,57,61,59,61,61,58,58,62
reggia_caserta7.jpg,61,59,59,53,60,0,62,61,63,59,57,64,63,61,59
reggia_caserta8.jpg,59,58,60,60,60,62,0,62,60,61,62,60,59,59,62
reggia_caserta6.jpg,58,62,59,57,57,61,62,0,59,61,61,58,54,64,58
reggia_caserta1.jpg,63,64,61,58,61,63,60,59,0,58,60,61,59,59,63
reggia_caserta0.jpg,58,63,60,62,59,59,61,61,58,0,61,60,54,60,64
reggia_caserta5.jpg,62,59,58,63,61,57,62,61,60,61,0,63,61,59,57
reggia_caserta3.jpg,59,62,59,64,61,64,60,58,61,60,63,0,60,63,61
reggia_caserta12.jpg,57,61,58,59,58,63,59,54,59,54,61,60,0,61,61
reggia_caserta13.jpg,59,57,60,61,58,61,59,64,59,60,59,63,61,0,63
reggia_caserta4.jpg,59,62,58,59,62,59,62,58,63,64,57,61,61,63,0
Type,Final-R,Final-R,Final-R,Final-R,Final-R,Final-R,Final-R,Final-R,Final-R,Final-R,Final-R,Final-R,Final-R,Final-R,Final-R
reggia_caserta11.jpg,0,8,8,8,8,8,8,8,8,8,8,8,8,8,8
reggia_caserta2.jpg,8,0,8,8,8,8,8,8,8,8,8,8,8,8,8
reggia_caserta14.jpg,8,8,0,8,8,8,8,8,8,8,8,8,8,8,8
reggia_caserta9.jpg,8,8,8,0,8,8,8,6,8,8,8,8,8,8,8
reggia_caserta10.jpg,8,8,8,8,0,8,8,8,8,8,8,8,8,8,8
reggia_caserta7.jpg,8,8,8,8,8,0,8,8,8,8,8,8,8,8,8
reggia_caserta8.jpg,8,8,8,8,8,8,0,8,8,8,8,8,8,8,8
reggia_caserta6.jpg,8,8,8,6,8,8,8,0,8,8,8,8,8,8,8
reggia_caserta1.jpg,8,8,8,8,8,8,8,8,0,8,8,8,8,8,8
reggia_caserta0.jpg,8,8,8,8,8,8,8,8,8,0,8,8,8,8,8
reggia_caserta5.jpg,8,8,8,8,8,8,8,8,8,8,0,8,8,8,8
reggia_caserta3.jpg,8,8,8,8,8,8,8,8,8,8,8,0,8,8,8
reggia_caserta12.jpg,8,8,8,8,8,8,8,8,8,8,8,8,0,8,8
reggia_caserta13.jpg,8,8,8,8,8,8,8,8,8,8,8,8,8,0,8
reggia_caserta4.jpg,8,8,8,8,8,8,8,8,8,8,8,8,8,8,0
