,ultima_cena3.jpg,ultima_cena13.jpg,ultima_cena11.jpg,ultima_cena2.jpg,ultima_cena6.jpg,ultima_cena0.jpg,ultima_cena10.jpg,ultima_cena7.jpg,ultima_cena4.jpg,ultima_cena1.jpg,ultima_cena14.jpg,ultima_cena8.jpg,ultima_cena9.jpg,ultima_cena12.jpg,ultima_cena5.jpg
Type,Meta,Meta,Meta,Meta,Meta,Meta,Meta,Meta,Meta,Meta,Meta,Meta,Meta,Meta,Meta
ultima_cena3.jpg,0,3,4,6,5,4,5,5,6,6,6,6,3,5,6
ultima_cena13.jpg,3,0,4,7,7,4,5,4,6,5,6,5,5,5,7
ultima_cena11.jpg,4,4,0,5,5,4,4,4,5,4,6,4,3,4,6
ultima_cena2.jpg,6,7,5,0,3,6,4,5,5,5,5,4,5,3,4
ultima_cena6.jpg,5,7,5,3,0,6,4,4,5,5,4,5,4,3,3
ultima_cena0.jpg,4,4,4,6,6,0,6,4,4,4,6,5,4,6,6
ultima_cena10.jpg,5,5,4,4,4,6,0,4,6,4,4,4,5,2,5
ultima_cena7.jpg,5,4,4,5,4,4,4,0,3,4,6,5,5,3,5
ultima_cena4.jpg,6,6,5,5,5,4,6,3,0,5,6,6,5,5,5
ultima_cena1.jpg,6,5,4,5,5,4,4,4,5,0,5,3,5,4,5
ultima_cena14.jpg,6,6,6,5,4,6,4,6,6,5,0,5,5,5,4
ultima_cena8.jpg,6,5,4,4,5,5,4,5,6,3,5,0,4,4,4
ultima_cena9.jpg,3,5,3,5,4,4,5,5,5,5,5,4,0,5,4
ultima_cena12.jpg,5,5,4,3,3,6,2,3,5,4,5,4,5,0,4
ultima_cena5.jpg,6,7,6,4,3,6,5,5,5,5,4,4,4,4,0
Type,R-Meta,R-Meta,R-Meta,R-Meta,R-Meta,R-Meta,R-Meta,R-Meta,R-Meta,R-Meta,R-Meta,R-Meta,R-Meta,R-Meta,R-Meta
ultima_cena3.jpg,0,2,1,4,4,2,4,4,4,5,6,4,0,3,6
ultima_cena13.jpg,2,0,3,6,6,2,6,4,4,5,4,4,2,5,4
ultima_cena11.jpg,1,3,0,5,5,3,5,5,5,6,7,5,1,4,7
ultima_cena2.jpg,4,6,5,0,2,6,4,6,6,5,6,2,4,1,2
ultima_cena6.jpg,4,6,5,2,0,6,2,4,6,5,4,4,4,1,4
ultima_cena0.jpg,2,2,3,6,6,0,6,2,2,3,6,4,2,5,6
ultima_cena10.jpg,4,6,5,4,2,6,0,6,8,5,4,4,4,3,6
ultima_cena7.jpg,4,4,5,6,4,2,6,0,2,5,6,6,4,5,6
ultima_cena4.jpg,4,4,5,6,6,2,8,2,0,5,8,6,4,5,6
ultima_cena1.jpg,5,5,6,5,5,3,5,5,5,0,5,3,5,4,5
ultima_cena14.jpg,6,4,7,6,4,6,4,6,8,5,0,4,6,5,4
ultima_cena8.jpg,4,4,5,2,4,4,4,6,6,3,4,0,4,3,2
ultima_cena9.jpg,0,2,1,4,4,2,4,4,4,5,6,4,0,3,6
ultima_cena12.jpg,3,5,4,1,1,5,3,5,5,4,5,3,3,0,3
ultima_cena5.jpg,6,4,7,2,4,6,6,6,6,5,4,2,6,3,0
Type,Content,Content,Content,Content,Content,Content,Content,Content,Content,Content,Content,Content,Content,Content,Content
ultima_cena3.jpg,0,12,13,12,12,13,11,13,12,12,10,13,13,13,13
ultima_cena13.jpg,12,0,10,11,11,13,13,13,11,13,11,13,12,13,12
ultima_cena11.jpg,13,10,0,12,12,13,11,13,10,11,12,13,6,12,11
ultima_cena2.jpg,12,11,12,0,13,13,11,13,11,12,12,12,13,12,12
ultima_cena6.jpg,12,11,12,13,0,12,13,12,13,12,12,12,12,13,12
ultima_cena0.jpg,13,13,13,13,12,0,13,11,13,11,13,13,12,8,13
ultima_cena10.jpg,11,13,11,11,13,13,0,13,11,12,13,12,12,13,12
ultima_cena7.jpg,13,13,13,13,12,11,13,0,13,11,12,13,12,12,13
ultima_cena4.jpg,12,11,10,11,13,13,11,13,0,12,12,13,10,13,12
ultima_cena1.jpg,12,13,11,12,12,11,12,11,12,0,13,12,10,13,13
ultima_cena14.jpg,10,11,12,12,12,13,13,12,12,13,0,10,12,13,11
ultima_cena8.jpg,13,13,13,12,12,13,12,13,13,12,10,0,13,13,11
ultima_cena9.jpg,13,12,6,13,12,12,12,12,10,10,12,13,0,12,11
ultima_cena12.jpg,13,13,12,12,13,8,13,12,13,13,13,13,12,0,13
ultima_cena5.jpg,13,12,11,12,12,13,12,13,12,13,11,11,11,13,0
Type,R-Content,R-Content,R-Content,R-Content,R-Content,R-Content,R-Content,R-Content,R-Content,R-Content,R-Content,R-Content,R-Content,R-Content,R-Content
ultima_cena3.jpg,0,9,12,9,11,13,10,8,9,8,7,12,10,11,10
ultima_cena13.jpg,9,0,11,6,12,14,11,11,10,9,8,7,13,14,9
ultima_cena11.jpg,12,11,0,9,9,9,8,10,7,8,7,8,4,9,6
ultima_cena2.jpg,9,6,9,0,12,12,9,11,8,9,8,9,11,12,9
ultima_cena6.jpg,11,12,9,12,0,12,13,7,14,11,8,11,7,12,9
ultima_cena0.jpg,13,14,9,12,12,0,9,7,8,7,12,11,7,6,11
ultima_cena10.jpg,10,11,8,9,13,9,0,10,7,6,11,10,8,9,10
ultima_cena7.jpg,8,11,10,11,7,7,10,0,11,8,7,10,6,11,8
ultima_cena4.jpg,9,10,7,8,14,8,7,11,0,7,10,11,9,8,9
ultima_cena1.jpg,8,9,8,9,11,7,6,8,7,0,9,10,6,9,10
ultima_cena14.jpg,7,8,7,8,8,12,11,7,10,9,0,9,7,8,7
ultima_cena8.jpg,12,7,8,9,11,11,10,10,11,10,9,0,10,11,8
ultima_cena9.jpg,10,13,4,11,7,7,8,6,9,6,7,10,0,9,6
ultima_cena12.jpg,11,14,9,12,12,6,9,11,8,9,8,11,9,0,13
ultima_cena5.jpg,10,9,6,9,9,11,10,8,9,10,7,8,6,13,0
Type,Final-R,Final-R,Final-R,Final-R,Final-R,Final-R,Final-R,Final-R,Final-R,Final-R,Final-R,Final-R,Final-R,Final-R,Final-R
ultima_cena3.jpg,0,9,12,9,11,13,10,8,9,8,7,12,10,11,10
ultima_cena13.jpg,9,0,11,6,12,14,11,11,10,9,8,7,13,14,9
ultima_cena11.jpg,12,11,0,9,9,9,8,10,7,8,7,8,4,9,6
ultima_cena2.jpg,9,6,9,0,12,12,9,11,8,9,8,9,11,12,9
ultima_cena6.jpg,11,12,9,12,0,12,13,7,14,11,8,11,7,12,9
ultima_cena0.jpg,13,14,9,12,12,0,9,7,8,7,12,11,7,6,11
ultima_cena10.jpg,10,11,8,9,13,9,0,10,7,6,11,10,8,9,10
ultima_cena7.jpg,8,11,10,11,7,7,10,0,11,8,7,10,6,11,8
ultima_cena4.jpg,9,10,7,8,14,8,7,11,0,7,10,11,9,8,9
ultima_cena1.jpg,8,9,8,9,11,7,6,8,7,0,9,10,6,9,10
ultima_cena14.jpg,7,8,7,8,8,12,11,7,10,9,0,9,7,8,7
ultima_cena8.jpg,12,7,8,9,11,11,10,10,11,10,9,0,10,11,8
ultima_cena9.jpg,10,13,4,11,7,7,8,6,9,6,7,10,0,9,6
ultima_cena12.jpg,11,14,9,12,12,6,9,11,8,9,8,11,9,0,13
ultima_cena5.jpg,10,9,6,9,9,11,10,8,9,10,7,8,6,13,0
