Img-Name,SHA256,Final-R
nettuno9.jpg,668cf22d21ad7134fa6c841f7fbf5c754c2c3ceecccabb8344946057393c4311,"[0, 0, 0, 1, 0, 0, 0, 0, 0, 0, 0, 0, 0, 0, 0, 0, 0, 1, 0, 0, 1, 1, 0, 0, 0, 0, 0, 0, 0, 0, 0, 0]"
nettuno3.jpg,07a647e533097ec66af463bf4dd0a3efdb5e2e69e8f27b9c816f8538a73972b1,"[0, 0, 0, 0, 0, 0, 1, 0, 0, 0, 0, 0, 0, 0, 0, 1, 0, 1, 0, 0, 0, 0, 0, 0, 0, 0, 0, 0, 1, 0, 0, 0]"
nettuno2.jpg,bd83cdb7afdaffcf17fabcf97fa51d9db538fa31e84c29afac0bf41906055ea5,"[0, 0, 0, 0, 0, 1, 0, 0, 0, 0, 0, 0, 0, 0, 0, 1, 0, 0, 0, 0, 0, 0, 0, 0, 0, 0, 0, 0, 0, 1, 0, 0]"
nettuno11.jpg,0b18a56cab61f7eb09eff4090c5bbb4869e3dd06a7002049e59eff6a573139de,"[0, 0, 0, 0, 0, 0, 0, 0, 1, 1, 0, 1, 0, 0, 0, 0, 0, 0, 0, 0, 0, 0, 0, 0, 0, 0, 0, 0, 0, 0, 1, 0]"
nettuno0.jpg,9d482e3f1d88418e3966d8941ef7b91f98d75a9d6e3d60ce4914d3369b095c02,"[0, 0, 1, 0, 0, 0, 0, 0, 0, 0, 0, 0, 0, 0, 1, 0, 0, 0, 0, 0, 0, 0, 0, 0, 0, 0, 0, 0, 0, 0, 0, 1]"
nettuno5.jpg,24f88a0f1f4b95cd399ec2c0fe55c8feb1206c660d4b4790404c0ab26afda6e9,"[0, 0, 0, 0, 0, 0, 0, 0, 0, 1, 0, 0, 0, 1, 0, 0, 1, 0, 0, 0, 0, 0, 0, 0, 0, 0, 0, 0, 0, 0, 1, 0]"
nettuno4.jpg,3b030586733eb5c1d2c80a1f931efff6beb322fdfd35172bf876d4b9fb0f419c,"[0, 1, 0, 0, 0, 0, 0, 0, 0, 0, 0, 1, 0, 0, 0, 0, 0, 0, 0, 0, 0, 0, 1, 0, 0, 0, 0, 0, 1, 0, 0, 0]"
nettuno12.jpg,b0b05f9d65e16eedb5b40482780560d21f4193e074eef88f69eba8def3050684,"[0, 0, 0, 0, 1, 0, 0, 0, 0, 0, 0, 0, 0, 1, 0, 1, 0, 0, 1, 0, 0, 0, 0, 0, 0, 0, 0, 0, 0, 0, 0, 0]"
nettuno6.jpg,f296f1d18fdc16fb0073345e8a125a3e57c99956889529ded292f02ccc6447cc,"[0, 0, 0, 0, 0, 0, 0, 0, 0, 0, 0, 0, 1, 0, 0, 0, 0, 0, 0, 0, 0, 0, 0, 0, 0, 0, 0, 1, 0, 0, 1, 0]"
nettuno10.jpg,ffb36cbbde9ef3d267c1141f00cb5a4f979613164e082a6ad5ad345876091022,"[0, 0, 1, 0, 0, 0, 0, 0, 0, 0, 1, 0, 0, 0, 0, 1, 0, 0, 1, 0, 0, 0, 0, 0, 0, 0, 0, 0, 0, 0, 0, 0]"
nettuno7.jpg,393c83071344084104d9f5af70bc494167af1305adc3b9cd513223dd556302cd,"[0, 1, 0, 0, 0, 0, 0, 0, 0, 0, 0, 0, 0, 1, 0, 0, 0, 0, 0, 0, 0, 0, 0, 0, 0, 0, 0, 0, 0, 0, 0, 0]"
nettuno8.jpg,8c82f255cdb21489356010fbf60b04536255b25b605bf1ee4b8d83a55cb050d4,"[0, 0, 0, 0, 0, 0, 0, 0, 0, 1, 0, 0, 0, 0, 1, 0, 0, 0, 0, 1, 1, 0, 0, 0, 0, 0, 0, 0, 0, 0, 0, 0]"
nettuno1.jpg,58ae0fae7a8e2263aef169e75b5020a01408867e5f5b93b6af62ae10dcc1ff67,"[1, 0, 0, 1, 0, 0, 0, 1, 0, 0, 0, 0, 0, 0, 0, 0, 0, 0, 0, 0, 0, 0, 1, 0, 0, 0, 0, 0, 0, 0, 0, 0]"
nettuno13.jpg,097803372016dacef793829bceeee1aef390688ec108a6777c53fb14a0fa4777,"[0, 0, 0, 0, 0, 0, 0, 0, 0, 0, 0, 0, 0, 0, 1, 0, 0, 0, 0, 0, 0, 0, 0, 1, 0, 0, 0, 0, 0, 0, 0, 0]"
nettuno14.jpg,9770492bbde668c235acaae248254eb7db7cbddefee305699bc3a7aa209a23d3,"[0, 0, 1, 0, 0, 0, 0, 0, 0, 1, 0, 0, 0, 0, 0, 0, 0, 0, 0, 1, 0, 0, 0, 1, 0, 0, 0, 0, 0, 0, 0, 0]"
