,hamburger2.jpg,hamburger0.jpg,hamburger11.jpg,hamburger14.jpg,hamburger1.jpg,hamburger10.jpg,hamburger9.jpg,hamburger8.jpg,hamburger6.jpg,hamburger3.jpg,hamburger5.jpg,hamburger4.jpg,hamburger13.jpg,hamburger7.jpg,hamburger12.jpg
Type,Meta,Meta,Meta,Meta,Meta,Meta,Meta,Meta,Meta,Meta,Meta,Meta,Meta,Meta,Meta
hamburger2.jpg,0,3,2,4,5,5,4,4,5,4,4,3,1,4,5
hamburger0.jpg,3,0,3,4,3,4,4,6,3,4,5,3,3,4,4
hamburger11.jpg,2,3,0,4,5,5,5,5,5,5,5,4,2,5,5
hamburger14.jpg,4,4,4,0,6,4,5,6,5,5,2,3,4,5,3
hamburger1.jpg,5,3,5,6,0,4,4,4,3,4,5,5,5,4,4
hamburger10.jpg,5,4,5,4,4,0,3,5,1,2,4,4,5,3,3
hamburger9.jpg,4,4,5,5,4,3,0,3,3,3,3,2,5,2,4
hamburger8.jpg,4,6,5,6,4,5,3,0,5,5,4,4,5,3,5
hamburger6.jpg,5,3,5,5,3,1,3,5,0,2,4,4,5,3,2
hamburger3.jpg,4,4,5,5,4,2,3,5,2,0,4,4,4,3,3
hamburger5.jpg,4,5,5,2,5,4,3,4,4,4,0,3,5,3,2
hamburger4.jpg,3,3,4,3,5,4,2,4,4,4,3,0,4,3,5
hamburger13.jpg,1,3,2,4,5,5,5,5,5,4,5,4,0,5,5
hamburger7.jpg,4,4,5,5,4,3,2,3,3,3,3,3,5,0,4
hamburger12.jpg,5,4,5,3,4,3,4,5,2,3,2,5,5,4,0
Type,R-Meta,R-Meta,R-Meta,R-Meta,R-Meta,R-Meta,R-Meta,R-Meta,R-Meta,R-Meta,R-Meta,R-Meta,R-Meta,R-Meta,R-Meta
hamburger2.jpg,0,2,0,4,2,4,4,2,4,4,4,4,0,4,4
hamburger0.jpg,2,0,2,4,0,2,2,4,2,2,4,2,2,2,4
hamburger11.jpg,0,2,0,4,2,4,4,2,4,4,4,4,0,4,4
hamburger14.jpg,4,4,4,0,4,4,4,4,4,4,0,2,4,4,2
hamburger1.jpg,2,0,2,4,0,2,2,4,2,2,4,2,2,2,4
hamburger10.jpg,4,2,4,4,2,0,2,4,0,0,4,2,4,2,2
hamburger9.jpg,4,2,4,4,2,2,0,4,2,2,4,2,4,2,4
hamburger8.jpg,2,4,2,4,4,4,4,0,4,4,4,4,2,2,4
hamburger6.jpg,4,2,4,4,2,0,2,4,0,0,4,2,4,2,2
hamburger3.jpg,4,2,4,4,2,0,2,4,0,0,4,2,4,2,2
hamburger5.jpg,4,4,4,0,4,4,4,4,4,4,0,2,4,4,2
hamburger4.jpg,4,2,4,2,2,2,2,4,2,2,2,0,4,2,4
hamburger13.jpg,0,2,0,4,2,4,4,2,4,4,4,4,0,4,4
hamburger7.jpg,4,2,4,4,2,2,2,2,2,2,4,2,4,0,4
hamburger12.jpg,4,4,4,2,4,2,4,4,2,2,2,4,4,4,0
Type,Content,Content,Content,Content,Content,Content,Content,Content,Content,Content,Content,Content,Content,Content,Content
hamburger2.jpg,0,13,13,12,13,13,12,13,13,12,12,13,10,12,13
hamburger0.jpg,13,0,13,13,13,13,13,12,13,11,13,13,13,13,11
hamburger11.jpg,13,13,0,13,12,13,13,13,13,12,12,13,12,13,12
hamburger14.jpg,12,13,13,0,13,13,12,13,13,13,13,13,13,13,13
hamburger1.jpg,13,13,12,13,0,13,13,13,12,12,11,13,13,12,13
hamburger10.jpg,13,13,13,13,13,0,13,13,10,13,13,12,13,11,13
hamburger9.jpg,12,13,13,12,13,13,0,13,13,13,13,13,13,12,11
hamburger8.jpg,13,12,13,13,13,13,13,0,12,13,13,13,13,13,13
hamburger6.jpg,13,13,13,13,12,10,13,12,0,12,12,13,13,12,12
hamburger3.jpg,12,11,12,13,12,13,13,13,12,0,11,13,12,13,13
hamburger5.jpg,12,13,12,13,11,13,13,13,12,11,0,13,13,10,13
hamburger4.jpg,13,13,13,13,13,12,13,13,13,13,13,0,13,13,13
hamburger13.jpg,10,13,12,13,13,13,13,13,13,12,13,13,0,12,13
hamburger7.jpg,12,13,13,13,12,11,12,13,12,13,10,13,12,0,13
hamburger12.jpg,13,11,12,13,13,13,11,13,12,13,13,13,13,13,0
Type,R-Content,R-Content,R-Content,R-Content,R-Content,R-Content,R-Content,R-Content,R-Content,R-Content,R-Content,R-Content,R-Content,R-Content,R-Content
hamburger2.jpg,0,5,4,6,7,3,3,7,2,5,6,3,3,4,3
hamburger0.jpg,5,0,5,5,4,4,4,4,5,4,3,6,4,5,6
hamburger11.jpg,4,5,0,4,5,5,5,7,4,5,4,7,7,0,5
hamburger14.jpg,6,5,4,0,5,5,5,5,4,5,4,7,5,4,5
hamburger1.jpg,7,4,5,5,0,6,8,6,7,4,3,8,8,5,8
hamburger10.jpg,3,4,5,5,6,0,6,8,5,4,5,4,4,5,6
hamburger9.jpg,3,4,5,5,8,6,0,4,1,8,5,6,4,5,2
hamburger8.jpg,7,4,7,5,6,8,4,0,5,6,5,8,6,7,4
hamburger6.jpg,2,5,4,4,7,5,1,5,0,7,6,5,5,4,1
hamburger3.jpg,5,4,5,5,4,4,8,6,7,0,5,4,6,5,8
hamburger5.jpg,6,3,4,4,3,5,5,5,6,5,0,7,5,4,7
hamburger4.jpg,3,6,7,7,8,4,6,8,5,4,7,0,4,7,6
hamburger13.jpg,3,4,7,5,8,4,4,6,5,6,5,4,0,7,6
hamburger7.jpg,4,5,0,4,5,5,5,7,4,5,4,7,7,0,5
hamburger12.jpg,3,6,5,5,8,6,2,4,1,8,7,6,6,5,0
Type,Final-R,Final-R,Final-R,Final-R,Final-R,Final-R,Final-R,Final-R,Final-R,Final-R,Final-R,Final-R,Final-R,Final-R,Final-R
hamburger2.jpg,0,3,2,8,5,2,5,6,4,5,8,3,3,3,5
hamburger0.jpg,3,0,5,7,4,5,4,5,5,6,5,6,4,4,4
hamburger11.jpg,2,5,0,8,5,4,7,8,6,5,8,5,5,3,7
hamburger14.jpg,8,7,8,0,7,8,5,6,6,7,4,7,7,7,5
hamburger1.jpg,5,4,5,7,0,7,8,9,7,6,5,8,8,6,6
hamburger10.jpg,2,5,4,8,7,0,5,4,2,3,8,3,5,3,3
hamburger9.jpg,5,4,7,5,8,5,0,5,3,8,7,6,4,4,4
hamburger8.jpg,6,5,8,6,9,4,5,0,4,5,6,7,5,7,3
hamburger6.jpg,4,5,6,6,7,2,3,4,0,5,8,5,7,3,1
hamburger3.jpg,5,6,5,7,6,3,8,5,5,0,7,4,8,6,4
hamburger5.jpg,8,5,8,4,5,8,7,6,8,7,0,7,7,7,7
hamburger4.jpg,3,6,5,7,8,3,6,7,5,4,7,0,6,4,6
hamburger13.jpg,3,4,5,7,8,5,4,5,7,8,7,6,0,6,8
hamburger7.jpg,3,4,3,7,6,3,4,7,3,6,7,4,6,0,4
hamburger12.jpg,5,4,7,5,6,3,4,3,1,4,7,6,8,4,0
