,piazza_san_marco6.jpg,piazza_san_marco14.jpg,piazza_san_marco1.jpg,piazza_san_marco10.jpg,piazza_san_marco11.jpg,piazza_san_marco4.jpg,piazza_san_marco12.jpg,piazza_san_marco7.jpg,piazza_san_marco8.jpg,piazza_san_marco0.jpg,piazza_san_marco13.jpg,piazza_san_marco9.jpg,piazza_san_marco3.jpg,piazza_san_marco2.jpg,piazza_san_marco5.jpg
Type,Meta,Meta,Meta,Meta,Meta,Meta,Meta,Meta,Meta,Meta,Meta,Meta,Meta,Meta,Meta
piazza_san_marco6.jpg,0,3,3,4,4,5,4,3,5,3,3,4,3,3,4
piazza_san_marco14.jpg,3,0,3,3,3,3,3,4,4,4,1,4,0,3,4
piazza_san_marco1.jpg,3,3,0,3,4,4,4,3,4,5,4,6,3,3,5
piazza_san_marco10.jpg,4,3,3,0,4,3,3,4,4,5,3,6,3,4,6
piazza_san_marco11.jpg,4,3,4,4,0,5,3,6,6,3,3,5,3,3,4
piazza_san_marco4.jpg,5,3,4,3,5,0,3,2,2,5,3,4,3,5,5
piazza_san_marco12.jpg,4,3,4,3,3,3,0,3,4,4,3,4,3,5,5
piazza_san_marco7.jpg,3,4,3,4,6,2,3,0,2,6,4,3,4,5,5
piazza_san_marco8.jpg,5,4,4,4,6,2,4,2,0,5,4,4,4,4,4
piazza_san_marco0.jpg,3,4,5,5,3,5,4,6,5,0,4,5,4,3,2
piazza_san_marco13.jpg,3,1,4,3,3,3,3,4,4,4,0,4,1,3,5
piazza_san_marco9.jpg,4,4,6,6,5,4,4,3,4,5,4,0,4,5,4
piazza_san_marco3.jpg,3,0,3,3,3,3,3,4,4,4,1,4,0,3,4
piazza_san_marco2.jpg,3,3,3,4,3,5,5,5,4,3,3,5,3,0,4
piazza_san_marco5.jpg,4,4,5,6,4,5,5,5,4,2,5,4,4,4,0
Type,R-Meta,R-Meta,R-Meta,R-Meta,R-Meta,R-Meta,R-Meta,R-Meta,R-Meta,R-Meta,R-Meta,R-Meta,R-Meta,R-Meta,R-Meta
piazza_san_marco6.jpg,0,0,2,2,0,3,2,4,4,1,0,2,0,1,2
piazza_san_marco14.jpg,0,0,2,2,0,3,2,4,4,1,0,2,0,1,2
piazza_san_marco1.jpg,2,2,0,0,2,1,0,2,2,3,2,4,2,3,4
piazza_san_marco10.jpg,2,2,0,0,2,1,0,2,2,3,2,4,2,3,4
piazza_san_marco11.jpg,0,0,2,2,0,3,2,4,4,1,0,2,0,1,2
piazza_san_marco4.jpg,3,3,1,1,3,0,1,1,1,2,3,3,3,2,3
piazza_san_marco12.jpg,2,2,0,0,2,1,0,2,2,3,2,4,2,3,4
piazza_san_marco7.jpg,4,4,2,2,4,1,2,0,0,3,4,2,4,3,2
piazza_san_marco8.jpg,4,4,2,2,4,1,2,0,0,3,4,2,4,3,2
piazza_san_marco0.jpg,1,1,3,3,1,2,3,3,3,0,1,1,1,0,1
piazza_san_marco13.jpg,0,0,2,2,0,3,2,4,4,1,0,2,0,1,2
piazza_san_marco9.jpg,2,2,4,4,2,3,4,2,2,1,2,0,2,1,0
piazza_san_marco3.jpg,0,0,2,2,0,3,2,4,4,1,0,2,0,1,2
piazza_san_marco2.jpg,1,1,3,3,1,2,3,3,3,0,1,1,1,0,1
piazza_san_marco5.jpg,2,2,4,4,2,3,4,2,2,1,2,0,2,1,0
Type,Content,Content,Content,Content,Content,Content,Content,Content,Content,Content,Content,Content,Content,Content,Content
piazza_san_marco6.jpg,0,12,13,13,13,12,12,13,11,12,13,12,13,12,13
piazza_san_marco14.jpg,12,0,13,13,13,12,11,12,13,12,13,13,13,12,13
piazza_san_marco1.jpg,13,13,0,13,13,13,13,10,13,12,13,12,11,12,13
piazza_san_marco10.jpg,13,13,13,0,12,13,13,13,13,13,13,13,12,13,13
piazza_san_marco11.jpg,13,13,13,12,0,12,13,12,12,13,13,13,11,12,13
piazza_san_marco4.jpg,12,12,13,13,12,0,12,13,13,13,13,12,13,11,12
piazza_san_marco12.jpg,12,11,13,13,13,12,0,13,10,13,12,13,13,12,13
piazza_san_marco7.jpg,13,12,10,13,12,13,13,0,12,12,13,11,13,13,13
piazza_san_marco8.jpg,11,13,13,13,12,13,10,12,0,13,13,13,13,13,12
piazza_san_marco0.jpg,12,12,12,13,13,13,13,12,13,0,12,12,12,13,12
piazza_san_marco13.jpg,13,13,13,13,13,13,12,13,13,12,0,13,9,10,12
piazza_san_marco9.jpg,12,13,12,13,13,12,13,11,13,12,13,0,13,13,13
piazza_san_marco3.jpg,13,13,11,12,11,13,13,13,13,12,9,13,0,12,12
piazza_san_marco2.jpg,12,12,12,13,12,11,12,13,13,13,10,13,12,0,13
piazza_san_marco5.jpg,13,13,13,13,13,12,13,13,12,12,12,13,12,13,0
Type,R-Content,R-Content,R-Content,R-Content,R-Content,R-Content,R-Content,R-Content,R-Content,R-Content,R-Content,R-Content,R-Content,R-Content,R-Content
piazza_san_marco6.jpg,0,3,4,3,3,3,4,5,3,4,5,3,4,1,4
piazza_san_marco14.jpg,3,0,1,6,2,6,3,4,4,5,4,2,5,2,5
piazza_san_marco1.jpg,4,1,0,5,1,5,2,5,3,4,3,3,4,3,4
piazza_san_marco10.jpg,3,6,5,0,4,2,3,4,2,1,4,4,1,4,1
piazza_san_marco11.jpg,3,2,1,4,0,4,3,6,2,3,4,2,3,2,3
piazza_san_marco4.jpg,3,6,5,2,4,0,3,4,2,3,2,6,3,4,3
piazza_san_marco12.jpg,4,3,2,3,3,3,0,5,3,2,3,5,4,5,4
piazza_san_marco7.jpg,5,4,5,4,6,4,5,0,4,5,2,4,3,4,3
piazza_san_marco8.jpg,3,4,3,2,2,2,3,4,0,3,2,4,1,2,1
piazza_san_marco0.jpg,4,5,4,1,3,3,2,5,3,0,5,3,2,5,2
piazza_san_marco13.jpg,5,4,3,4,4,2,3,2,2,5,0,6,3,4,3
piazza_san_marco9.jpg,3,2,3,4,2,6,5,4,4,3,6,0,3,2,3
piazza_san_marco3.jpg,4,5,4,1,3,3,4,3,1,2,3,3,0,3,0
piazza_san_marco2.jpg,1,2,3,4,2,4,5,4,2,5,4,2,3,0,3
piazza_san_marco5.jpg,4,5,4,1,3,3,4,3,1,2,3,3,0,3,0
Type,Final-R,Final-R,Final-R,Final-R,Final-R,Final-R,Final-R,Final-R,Final-R,Final-R,Final-R,Final-R,Final-R,Final-R,Final-R
piazza_san_marco6.jpg,0,0,2,2,0,3,2,4,4,1,0,2,0,1,2
piazza_san_marco14.jpg,0,0,2,2,0,3,2,4,4,1,0,2,0,1,2
piazza_san_marco1.jpg,2,2,0,0,2,1,0,2,2,3,2,4,2,3,4
piazza_san_marco10.jpg,2,2,0,0,2,1,0,2,2,3,2,4,2,3,4
piazza_san_marco11.jpg,0,0,2,2,0,3,2,4,4,1,0,2,0,1,2
piazza_san_marco4.jpg,3,3,1,1,3,0,1,1,1,2,3,3,3,2,3
piazza_san_marco12.jpg,2,2,0,0,2,1,0,2,2,3,2,4,2,3,4
piazza_san_marco7.jpg,4,4,2,2,4,1,2,0,0,3,4,2,4,3,2
piazza_san_marco8.jpg,4,4,2,2,4,1,2,0,0,3,4,2,4,3,2
piazza_san_marco0.jpg,1,1,3,3,1,2,3,3,3,0,1,1,1,0,1
piazza_san_marco13.jpg,0,0,2,2,0,3,2,4,4,1,0,2,0,1,2
piazza_san_marco9.jpg,2,2,4,4,2,3,4,2,2,1,2,0,2,1,0
piazza_san_marco3.jpg,0,0,2,2,0,3,2,4,4,1,0,2,0,1,2
piazza_san_marco2.jpg,1,1,3,3,1,2,3,3,3,0,1,1,1,0,1
piazza_san_marco5.jpg,2,2,4,4,2,3,4,2,2,1,2,0,2,1,0
