,due_torri9.jpg,due_torri13.jpg,due_torri5.jpg,due_torri4.jpg,due_torri7.jpg,due_torri8.jpg,due_torri3.jpg,due_torri12.jpg,due_torri6.jpg,due_torri1.jpg,due_torri10.jpg,due_torri2.jpg,due_torri14.jpg,due_torri11.jpg,due_torri0.jpg
Type,Meta,Meta,Meta,Meta,Meta,Meta,Meta,Meta,Meta,Meta,Meta,Meta,Meta,Meta,Meta
due_torri9.jpg,0,3,3,6,4,4,3,4,5,4,3,5,6,4,3
due_torri13.jpg,3,0,4,6,5,4,4,4,6,4,3,5,5,4,5
due_torri5.jpg,3,4,0,4,5,5,4,3,4,5,4,4,5,5,4
due_torri4.jpg,6,6,4,0,4,6,6,4,3,4,5,4,3,7,5
due_torri7.jpg,4,5,5,4,0,6,6,6,2,5,3,6,5,6,4
due_torri8.jpg,4,4,5,6,6,0,4,4,6,5,6,4,5,6,5
due_torri3.jpg,3,4,4,6,6,4,0,4,6,4,5,5,6,5,5
due_torri12.jpg,4,4,3,4,6,4,4,0,6,4,5,2,4,5,6
due_torri6.jpg,5,6,4,3,2,6,6,6,0,6,4,6,5,7,4
due_torri1.jpg,4,4,5,4,5,5,4,4,6,0,4,4,5,5,5
due_torri10.jpg,3,3,4,5,3,6,5,5,4,4,0,6,5,5,4
due_torri2.jpg,5,5,4,4,6,4,5,2,6,4,6,0,5,6,6
due_torri14.jpg,6,5,5,3,5,5,6,4,5,5,5,5,0,7,6
due_torri11.jpg,4,4,5,7,6,6,5,5,7,5,5,6,7,0,6
due_torri0.jpg,3,5,4,5,4,5,5,6,4,5,4,6,6,6,0
Type,R-Meta,R-Meta,R-Meta,R-Meta,R-Meta,R-Meta,R-Meta,R-Meta,R-Meta,R-Meta,R-Meta,R-Meta,R-Meta,R-Meta,R-Meta
due_torri9.jpg,0,2,4,8,5,6,4,4,8,4,4,6,8,2,6
due_torri13.jpg,2,0,2,6,5,6,4,2,8,4,2,4,6,2,6
due_torri5.jpg,4,2,0,4,7,6,4,2,6,6,4,4,6,4,6
due_torri4.jpg,8,6,4,0,5,8,8,6,4,6,4,6,2,8,6
due_torri7.jpg,5,5,7,5,0,7,7,7,3,5,3,7,5,5,5
due_torri8.jpg,6,6,6,8,7,0,6,4,8,6,8,4,8,4,8
due_torri3.jpg,4,4,4,8,7,6,0,4,8,4,6,6,8,4,8
due_torri12.jpg,4,2,2,6,7,4,4,0,8,6,4,2,6,4,8
due_torri6.jpg,8,8,6,4,3,8,8,8,0,8,6,8,6,8,6
due_torri1.jpg,4,4,6,6,5,6,4,6,8,0,6,6,6,4,6
due_torri10.jpg,4,2,4,4,3,8,6,4,6,6,0,6,4,4,6
due_torri2.jpg,6,4,4,6,7,4,6,2,8,6,6,0,6,6,8
due_torri14.jpg,8,6,6,2,5,8,8,6,6,6,4,6,0,8,8
due_torri11.jpg,2,2,4,8,5,4,4,4,8,4,4,6,8,0,6
due_torri0.jpg,6,6,6,6,5,8,8,8,6,6,6,8,8,6,0
Type,Content,Content,Content,Content,Content,Content,Content,Content,Content,Content,Content,Content,Content,Content,Content
due_torri9.jpg,0,13,13,13,13,13,12,12,12,12,12,13,12,13,13
due_torri13.jpg,13,0,13,13,13,13,13,13,13,13,13,13,12,12,12
due_torri5.jpg,13,13,0,12,13,11,13,13,12,12,13,12,13,13,11
due_torri4.jpg,13,13,12,0,13,12,12,12,13,13,13,12,13,12,12
due_torri7.jpg,13,13,13,13,0,13,11,13,13,12,13,11,11,12,13
due_torri8.jpg,13,13,11,12,13,0,13,13,12,12,11,13,13,12,12
due_torri3.jpg,12,13,13,12,11,13,0,11,12,13,12,13,13,13,13
due_torri12.jpg,12,13,13,12,13,13,11,0,13,11,12,13,13,13,13
due_torri6.jpg,12,13,12,13,13,12,12,13,0,12,12,13,13,12,12
due_torri1.jpg,12,13,12,13,12,12,13,11,12,0,13,13,13,12,13
due_torri10.jpg,12,13,13,13,13,11,12,12,12,13,0,13,12,13,13
due_torri2.jpg,13,13,12,12,11,13,13,13,13,13,13,0,12,11,12
due_torri14.jpg,12,12,13,13,11,13,13,13,13,13,12,12,0,12,13
due_torri11.jpg,13,12,13,12,12,12,13,13,12,12,13,11,12,0,12
due_torri0.jpg,13,12,11,12,13,12,13,13,12,13,13,12,13,12,0
Type,R-Content,R-Content,R-Content,R-Content,R-Content,R-Content,R-Content,R-Content,R-Content,R-Content,R-Content,R-Content,R-Content,R-Content,R-Content
due_torri9.jpg,0,12,13,10,8,12,9,10,10,9,10,12,10,12,10
due_torri13.jpg,12,0,9,10,10,12,9,10,8,11,8,12,12,14,6
due_torri5.jpg,13,9,0,7,7,9,10,11,9,10,9,5,9,11,7
due_torri4.jpg,10,10,7,0,8,8,11,10,8,9,8,12,8,8,8
due_torri7.jpg,8,10,7,8,0,12,9,10,10,7,10,8,8,6,8
due_torri8.jpg,12,12,9,8,12,0,9,8,12,9,10,10,12,12,8
due_torri3.jpg,9,9,10,11,9,9,0,7,11,12,11,7,13,9,9
due_torri12.jpg,10,10,11,10,10,8,7,0,12,9,10,10,12,12,10
due_torri6.jpg,10,8,9,8,10,12,11,12,0,11,6,12,10,14,8
due_torri1.jpg,9,11,10,9,7,9,12,9,11,0,7,11,11,11,9
due_torri10.jpg,10,8,9,8,10,10,11,10,6,7,0,12,8,14,8
due_torri2.jpg,12,12,5,12,8,10,7,10,12,11,12,0,12,8,8
due_torri14.jpg,10,12,9,8,8,12,13,12,10,11,8,12,0,10,12
due_torri11.jpg,12,14,11,8,6,12,9,12,14,11,14,8,10,0,10
due_torri0.jpg,10,6,7,8,8,8,9,10,8,9,8,8,12,10,0
Type,Final-R,Final-R,Final-R,Final-R,Final-R,Final-R,Final-R,Final-R,Final-R,Final-R,Final-R,Final-R,Final-R,Final-R,Final-R
due_torri9.jpg,0,11,14,13,9,11,9,10,12,8,9,12,13,10,13
due_torri13.jpg,11,0,7,12,14,12,8,9,9,11,8,11,12,11,8
due_torri5.jpg,14,7,0,9,13,11,9,10,12,12,11,8,11,10,11
due_torri4.jpg,13,12,9,0,12,12,12,13,11,11,10,15,8,13,12
due_torri7.jpg,9,14,13,12,0,14,14,17,11,9,12,11,8,7,12
due_torri8.jpg,11,12,11,12,14,0,14,11,17,9,12,11,12,13,12
due_torri3.jpg,9,8,9,12,14,14,0,5,13,15,12,11,14,11,12
due_torri12.jpg,10,9,10,13,17,11,5,0,16,14,11,10,15,14,13
due_torri6.jpg,12,9,12,11,11,17,13,16,0,14,7,18,13,14,11
due_torri1.jpg,8,11,12,11,9,9,15,14,14,0,11,12,13,10,11
due_torri10.jpg,9,8,11,10,12,12,12,11,7,11,0,13,10,13,12
due_torri2.jpg,12,11,8,15,11,11,11,10,18,12,13,0,13,10,13
due_torri14.jpg,13,12,11,8,8,12,14,15,13,13,10,13,0,11,14
due_torri11.jpg,10,11,10,13,7,13,11,14,14,10,13,10,11,0,11
due_torri0.jpg,13,8,11,12,12,12,12,13,11,11,12,13,14,11,0
