Img-Name,Meta,R-Meta,Content,R-Content,Final-R
arena_verona12.jpg,AAA4MKLJSYZSFJHB,"[0, 1, 1, 1, 1, 0, 0, 0]",EEAZHP2IYA7ZPELI,"[1, 1, 1, 0, 0, 1, 0, 0]","[0, 1, 1, 1, 1, 0, 0, 0]"
arena_verona13.jpg,AAA4MJT5SIZSFJHB,"[0, 1, 1, 1, 1, 1, 0, 0]",EEA7QA25YYYITV3N,"[0, 1, 0, 0, 0, 1, 1, 1]","[0, 1, 1, 1, 1, 1, 0, 0]"
arena_verona9.jpg,AAA5PP75SIZSFJHB,"[1, 1, 1, 1, 0, 1, 0, 0]",EEA4RM3FGLH4DMB5,"[0, 0, 0, 0, 1, 1, 1, 0]","[1, 1, 1, 1, 0, 1, 0, 0]"
arena_verona1.jpg,AAA7M775SYZSFJHB,"[0, 1, 1, 1, 0, 1, 0, 1]",EEAZHP2IYA7ZPELI,"[1, 1, 1, 0, 0, 1, 0, 0]","[0, 1, 1, 1, 0, 1, 0, 1]"
arena_verona6.jpg,AAA6O375SYZSFJHB,"[0, 1, 1, 1, 0, 1, 1, 0]",EEA4HZHMSM4RSJT4,"[0, 0, 1, 0, 1, 1, 0, 0]","[0, 1, 1, 1, 0, 1, 1, 0]"
arena_verona3.jpg,AAA7O3752YZSFJHB,"[0, 1, 1, 1, 0, 1, 0, 1]",EEAZG7COSI4Y6ZUY,"[0, 1, 1, 0, 0, 1, 0, 1]","[0, 1, 1, 1, 0, 1, 0, 1]"
arena_verona2.jpg,AAA74375SYZSFJHB,"[0, 1, 1, 1, 0, 1, 0, 1]",EEAZOPOI5KLJLSKC,"[1, 1, 1, 1, 0, 1, 0, 0]","[0, 1, 1, 1, 0, 1, 0, 1]"
arena_verona4.jpg,AAA7N7PNSYZSFJHB,"[0, 1, 1, 1, 0, 0, 1, 1]",EEA4URITXTF4CLE7,"[0, 0, 1, 0, 1, 1, 0, 1]","[0, 1, 1, 1, 0, 0, 1, 1]"
arena_verona14.jpg,AAA7MP75SQZSFJHB,"[1, 1, 1, 1, 0, 1, 0, 1]",EEA4HX3U6XBKQKES,"[1, 0, 0, 1, 1, 1, 0, 0]","[1, 1, 1, 1, 0, 1, 0, 1]"
arena_verona5.jpg,AAA5O335SYZSFJHB,"[0, 1, 1, 1, 0, 1, 0, 0]",EEAZWL6E6U5JEZDE,"[0, 0, 1, 0, 1, 1, 0, 0]","[0, 1, 1, 1, 0, 1, 0, 0]"
arena_verona11.jpg,AAA6M575CYZSFJHB,"[0, 1, 1, 1, 0, 1, 1, 0]",EEA5FNAIYW7ZVE6U,"[0, 1, 1, 0, 0, 1, 1, 1]","[0, 1, 1, 1, 0, 1, 1, 0]"
arena_verona0.jpg,AAA77Z35SYZSFJHB,"[0, 1, 1, 1, 0, 1, 0, 1]",EEA5HN2MYAXZVEMV,"[0, 1, 1, 0, 0, 1, 1, 0]","[0, 1, 1, 1, 0, 1, 0, 1]"
arena_verona8.jpg,AAA7MP75SIZSFJHB,"[1, 1, 1, 1, 0, 1, 0, 1]",EEA5RDXIGUR7XXEA,"[1, 1, 0, 0, 1, 1, 0, 1]","[1, 1, 1, 1, 0, 1, 0, 1]"
arena_verona7.jpg,AAA7O37V2YZSFJHB,"[0, 1, 1, 1, 0, 0, 1, 1]",EEA6FQJ7B3AHYUVX,"[1, 1, 0, 1, 0, 1, 1, 1]","[0, 1, 1, 1, 0, 0, 1, 1]"
arena_verona10.jpg,AAA7OLX5SQZSFJHB,"[0, 1, 1, 1, 1, 1, 0, 1]",EEAZYBTDNFVZNFHW,"[0, 0, 1, 0, 1, 1, 1, 1]","[0, 1, 1, 1, 1, 1, 0, 1]"
