,hamburger2.jpg,hamburger0.jpg,hamburger11.jpg,hamburger14.jpg,hamburger1.jpg,hamburger10.jpg,hamburger9.jpg,hamburger8.jpg,hamburger6.jpg,hamburger3.jpg,hamburger5.jpg,hamburger4.jpg,hamburger13.jpg,hamburger7.jpg,hamburger12.jpg
Type,Meta,Meta,Meta,Meta,Meta,Meta,Meta,Meta,Meta,Meta,Meta,Meta,Meta,Meta,Meta
hamburger2.jpg,0,3,2,4,5,5,4,4,5,4,4,3,1,4,5
hamburger0.jpg,3,0,3,4,3,4,4,6,3,4,5,3,3,4,4
hamburger11.jpg,2,3,0,4,5,5,5,5,5,5,5,4,2,5,5
hamburger14.jpg,4,4,4,0,6,4,5,6,5,5,2,3,4,5,3
hamburger1.jpg,5,3,5,6,0,4,4,4,3,4,5,5,5,4,4
hamburger10.jpg,5,4,5,4,4,0,3,5,1,2,4,4,5,3,3
hamburger9.jpg,4,4,5,5,4,3,0,3,3,3,3,2,5,2,4
hamburger8.jpg,4,6,5,6,4,5,3,0,5,5,4,4,5,3,5
hamburger6.jpg,5,3,5,5,3,1,3,5,0,2,4,4,5,3,2
hamburger3.jpg,4,4,5,5,4,2,3,5,2,0,4,4,4,3,3
hamburger5.jpg,4,5,5,2,5,4,3,4,4,4,0,3,5,3,2
hamburger4.jpg,3,3,4,3,5,4,2,4,4,4,3,0,4,3,5
hamburger13.jpg,1,3,2,4,5,5,5,5,5,4,5,4,0,5,5
hamburger7.jpg,4,4,5,5,4,3,2,3,3,3,3,3,5,0,4
hamburger12.jpg,5,4,5,3,4,3,4,5,2,3,2,5,5,4,0
Type,R-Meta,R-Meta,R-Meta,R-Meta,R-Meta,R-Meta,R-Meta,R-Meta,R-Meta,R-Meta,R-Meta,R-Meta,R-Meta,R-Meta,R-Meta
hamburger2.jpg,0,2,0,4,2,4,4,2,4,4,4,4,0,4,4
hamburger0.jpg,2,0,2,4,0,2,2,4,2,2,4,2,2,2,4
hamburger11.jpg,0,2,0,4,2,4,4,2,4,4,4,4,0,4,4
hamburger14.jpg,4,4,4,0,4,4,4,4,4,4,0,2,4,4,2
hamburger1.jpg,2,0,2,4,0,2,2,4,2,2,4,2,2,2,4
hamburger10.jpg,4,2,4,4,2,0,2,4,0,0,4,2,4,2,2
hamburger9.jpg,4,2,4,4,2,2,0,4,2,2,4,2,4,2,4
hamburger8.jpg,2,4,2,4,4,4,4,0,4,4,4,4,2,2,4
hamburger6.jpg,4,2,4,4,2,0,2,4,0,0,4,2,4,2,2
hamburger3.jpg,4,2,4,4,2,0,2,4,0,0,4,2,4,2,2
hamburger5.jpg,4,4,4,0,4,4,4,4,4,4,0,2,4,4,2
hamburger4.jpg,4,2,4,2,2,2,2,4,2,2,2,0,4,2,4
hamburger13.jpg,0,2,0,4,2,4,4,2,4,4,4,4,0,4,4
hamburger7.jpg,4,2,4,4,2,2,2,2,2,2,4,2,4,0,4
hamburger12.jpg,4,4,4,2,4,2,4,4,2,2,2,4,4,4,0
Type,Content,Content,Content,Content,Content,Content,Content,Content,Content,Content,Content,Content,Content,Content,Content
hamburger2.jpg,0,13,13,12,13,13,12,13,13,12,12,13,10,12,13
hamburger0.jpg,13,0,13,13,13,13,13,12,13,11,13,13,13,13,11
hamburger11.jpg,13,13,0,13,12,13,13,13,13,12,12,13,12,13,12
hamburger14.jpg,12,13,13,0,13,13,12,13,13,13,13,13,13,13,13
hamburger1.jpg,13,13,12,13,0,13,13,13,12,12,11,13,13,12,13
hamburger10.jpg,13,13,13,13,13,0,13,13,10,13,13,12,13,11,13
hamburger9.jpg,12,13,13,12,13,13,0,13,13,13,13,13,13,12,11
hamburger8.jpg,13,12,13,13,13,13,13,0,12,13,13,13,13,13,13
hamburger6.jpg,13,13,13,13,12,10,13,12,0,12,12,13,13,12,12
hamburger3.jpg,12,11,12,13,12,13,13,13,12,0,11,13,12,13,13
hamburger5.jpg,12,13,12,13,11,13,13,13,12,11,0,13,13,10,13
hamburger4.jpg,13,13,13,13,13,12,13,13,13,13,13,0,13,13,13
hamburger13.jpg,10,13,12,13,13,13,13,13,13,12,13,13,0,12,13
hamburger7.jpg,12,13,13,13,12,11,12,13,12,13,10,13,12,0,13
hamburger12.jpg,13,11,12,13,13,13,11,13,12,13,13,13,13,13,0
Type,R-Content,R-Content,R-Content,R-Content,R-Content,R-Content,R-Content,R-Content,R-Content,R-Content,R-Content,R-Content,R-Content,R-Content,R-Content
hamburger2.jpg,0,8,7,8,8,4,6,8,5,8,8,6,4,6,8
hamburger0.jpg,8,0,7,8,6,8,6,8,7,6,6,6,8,6,6
hamburger11.jpg,7,7,0,7,5,7,7,7,6,5,5,7,7,7,5
hamburger14.jpg,8,8,7,0,8,6,8,8,7,8,8,8,6,6,8
hamburger1.jpg,8,6,5,8,0,8,8,8,7,4,4,8,8,8,8
hamburger10.jpg,4,8,7,6,8,0,8,8,5,8,8,6,4,6,8
hamburger9.jpg,6,6,7,8,8,8,0,6,5,8,8,6,8,6,4
hamburger8.jpg,8,8,7,8,8,8,6,0,5,8,6,8,6,8,4
hamburger6.jpg,5,7,6,7,7,5,5,5,0,7,7,7,5,7,5
hamburger3.jpg,8,6,5,8,4,8,8,8,7,0,6,6,8,8,8
hamburger5.jpg,8,6,5,8,4,8,8,6,7,6,0,8,6,6,8
hamburger4.jpg,6,6,7,8,8,6,6,8,7,6,8,0,6,8,6
hamburger13.jpg,4,8,7,6,8,4,8,6,5,8,6,6,0,8,8
hamburger7.jpg,6,6,7,6,8,6,6,8,7,8,6,8,8,0,8
hamburger12.jpg,8,6,5,8,8,8,4,4,5,8,8,6,8,8,0
Type,Final-R,Final-R,Final-R,Final-R,Final-R,Final-R,Final-R,Final-R,Final-R,Final-R,Final-R,Final-R,Final-R,Final-R,Final-R
hamburger2.jpg,0,7,6,9,7,4,8,7,6,9,11,6,4,5,10
hamburger0.jpg,7,0,9,10,6,9,7,12,9,8,10,7,9,6,9
hamburger11.jpg,6,9,0,9,7,8,10,9,10,9,9,8,6,9,8
hamburger14.jpg,9,10,9,0,10,9,7,10,9,10,6,7,7,8,7
hamburger1.jpg,7,6,7,10,0,9,9,12,9,6,8,9,9,8,11
hamburger10.jpg,4,9,8,9,9,0,8,5,4,7,11,6,6,5,8
hamburger9.jpg,8,7,10,7,9,8,0,9,6,9,11,6,10,7,6
hamburger8.jpg,7,12,9,10,12,5,9,0,5,10,10,9,5,8,7
hamburger6.jpg,6,9,10,9,9,4,6,5,0,7,11,8,8,5,6
hamburger3.jpg,9,8,9,10,6,7,9,10,7,0,10,7,11,8,9
hamburger5.jpg,11,10,9,6,8,11,11,10,11,10,0,9,9,8,9
hamburger4.jpg,6,7,8,7,9,6,6,9,8,7,9,0,8,7,8
hamburger13.jpg,4,9,6,7,9,6,10,5,8,11,9,8,0,7,10
hamburger7.jpg,5,6,9,8,8,5,7,8,5,8,8,7,7,0,9
hamburger12.jpg,10,9,8,7,11,8,6,7,6,9,9,8,10,9,0
