,basilica_santa_croce12.jpg,basilica_santa_croce9.jpg,basilica_santa_croce5.jpg,basilica_santa_croce0.jpg,basilica_santa_croce8.jpg,basilica_santa_croce4.jpg,basilica_santa_croce13.jpg,basilica_santa_croce7.jpg,basilica_santa_croce1.jpg,basilica_santa_croce10.jpg,basilica_santa_croce11.jpg,basilica_santa_croce6.jpg,basilica_santa_croce3.jpg,basilica_santa_croce2.jpg,basilica_santa_croce14.jpg
Type,Meta,Meta,Meta,Meta,Meta,Meta,Meta,Meta,Meta,Meta,Meta,Meta,Meta,Meta,Meta
basilica_santa_croce12.jpg,0,7,5,5,5,6,7,6,4,5,5,5,6,5,3
basilica_santa_croce9.jpg,7,0,4,4,4,4,3,2,5,6,5,5,3,4,6
basilica_santa_croce5.jpg,5,4,0,5,5,5,4,5,6,4,5,5,4,5,5
basilica_santa_croce0.jpg,5,4,5,0,5,6,6,5,4,6,6,2,4,4,5
basilica_santa_croce8.jpg,5,4,5,5,0,5,5,4,3,4,5,6,3,4,6
basilica_santa_croce4.jpg,6,4,5,6,5,0,2,3,5,4,4,5,3,4,4
basilica_santa_croce13.jpg,7,3,4,6,5,2,0,4,5,4,3,5,3,5,4
basilica_santa_croce7.jpg,6,2,5,5,4,3,4,0,6,5,6,6,4,5,6
basilica_santa_croce1.jpg,4,5,6,4,3,5,5,6,0,5,3,4,2,3,4
basilica_santa_croce10.jpg,5,6,4,6,4,4,4,5,5,0,3,5,5,7,3
basilica_santa_croce11.jpg,5,5,5,6,5,4,3,6,3,3,0,5,5,5,2
basilica_santa_croce6.jpg,5,5,5,2,6,5,5,6,4,5,5,0,4,4,4
basilica_santa_croce3.jpg,6,3,4,4,3,3,3,4,2,5,5,4,0,3,6
basilica_santa_croce2.jpg,5,4,5,4,4,4,5,5,3,7,5,4,3,0,6
basilica_santa_croce14.jpg,3,6,5,5,6,4,4,6,4,3,2,4,6,6,0
Type,R-Meta,R-Meta,R-Meta,R-Meta,R-Meta,R-Meta,R-Meta,R-Meta,R-Meta,R-Meta,R-Meta,R-Meta,R-Meta,R-Meta,R-Meta
basilica_santa_croce12.jpg,0,4,4,4,4,2,4,1,4,4,4,4,4,4,2
basilica_santa_croce9.jpg,4,0,2,2,2,4,2,3,2,4,4,2,2,2,4
basilica_santa_croce5.jpg,4,2,0,2,4,4,2,3,4,2,2,2,2,4,4
basilica_santa_croce0.jpg,4,2,2,0,2,4,4,3,2,2,2,0,0,2,4
basilica_santa_croce8.jpg,4,2,4,2,0,4,4,3,2,2,4,2,2,2,4
basilica_santa_croce4.jpg,2,4,4,4,4,0,4,1,4,4,4,4,4,2,2
basilica_santa_croce13.jpg,4,2,2,4,4,4,0,3,4,4,4,4,4,4,4
basilica_santa_croce7.jpg,1,3,3,3,3,1,3,0,3,3,3,3,3,3,1
basilica_santa_croce1.jpg,4,2,4,2,2,4,4,3,0,4,4,2,2,2,4
basilica_santa_croce10.jpg,4,4,2,2,2,4,4,3,4,0,2,2,2,4,4
basilica_santa_croce11.jpg,4,4,2,2,4,4,4,3,4,2,0,2,2,4,2
basilica_santa_croce6.jpg,4,2,2,0,2,4,4,3,2,2,2,0,0,2,4
basilica_santa_croce3.jpg,4,2,2,0,2,4,4,3,2,2,2,0,0,2,4
basilica_santa_croce2.jpg,4,2,4,2,2,2,4,3,2,4,4,2,2,0,4
basilica_santa_croce14.jpg,2,4,4,4,4,2,4,1,4,4,2,4,4,4,0
Type,Content,Content,Content,Content,Content,Content,Content,Content,Content,Content,Content,Content,Content,Content,Content
basilica_santa_croce12.jpg,0,13,12,11,12,12,13,12,13,11,12,13,13,12,9
basilica_santa_croce9.jpg,13,0,12,12,12,11,13,12,11,13,13,9,12,13,13
basilica_santa_croce5.jpg,12,12,0,12,12,12,12,13,12,12,12,11,13,11,11
basilica_santa_croce0.jpg,11,12,12,0,13,12,11,13,12,11,11,13,13,12,11
basilica_santa_croce8.jpg,12,12,12,13,0,13,13,12,13,12,13,13,13,13,13
basilica_santa_croce4.jpg,12,11,12,12,13,0,13,13,13,11,12,13,11,13,11
basilica_santa_croce13.jpg,13,13,12,11,13,13,0,12,12,13,13,12,13,12,13
basilica_santa_croce7.jpg,12,12,13,13,12,13,12,0,13,13,13,13,13,13,13
basilica_santa_croce1.jpg,13,11,12,12,13,13,12,13,0,13,13,11,13,11,13
basilica_santa_croce10.jpg,11,13,12,11,12,11,13,13,13,0,12,13,12,12,10
basilica_santa_croce11.jpg,12,13,12,11,13,12,13,13,13,12,0,13,13,11,11
basilica_santa_croce6.jpg,13,9,11,13,13,13,12,13,11,13,13,0,12,13,11
basilica_santa_croce3.jpg,13,12,13,13,13,11,13,13,13,12,13,12,0,13,13
basilica_santa_croce2.jpg,12,13,11,12,13,13,12,13,11,12,11,13,13,0,12
basilica_santa_croce14.jpg,9,13,11,11,13,11,13,13,13,10,11,11,13,12,0
Type,R-Content,R-Content,R-Content,R-Content,R-Content,R-Content,R-Content,R-Content,R-Content,R-Content,R-Content,R-Content,R-Content,R-Content,R-Content
basilica_santa_croce12.jpg,0,7,5,3,7,7,7,7,5,5,5,5,7,5,2
basilica_santa_croce9.jpg,7,0,8,8,8,8,8,8,6,8,8,4,8,8,7
basilica_santa_croce5.jpg,5,8,0,6,8,8,8,8,8,6,6,6,8,6,5
basilica_santa_croce0.jpg,3,8,6,0,8,8,8,6,6,6,4,6,8,6,5
basilica_santa_croce8.jpg,7,8,8,8,0,8,8,6,8,8,8,8,8,8,7
basilica_santa_croce4.jpg,7,8,8,8,8,0,8,8,8,6,8,8,8,8,7
basilica_santa_croce13.jpg,7,8,8,8,8,8,0,6,8,8,8,8,8,8,7
basilica_santa_croce7.jpg,7,8,8,6,6,8,6,0,8,8,6,8,8,8,7
basilica_santa_croce1.jpg,5,6,8,6,8,8,8,8,0,8,8,6,8,8,5
basilica_santa_croce10.jpg,5,8,6,6,8,6,8,8,8,0,6,6,8,6,5
basilica_santa_croce11.jpg,5,8,6,4,8,8,8,6,8,6,0,6,8,6,5
basilica_santa_croce6.jpg,5,4,6,6,8,8,8,8,6,6,6,0,8,6,5
basilica_santa_croce3.jpg,7,8,8,8,8,8,8,8,8,8,8,8,0,8,7
basilica_santa_croce2.jpg,5,8,6,6,8,8,8,8,8,6,6,6,8,0,5
basilica_santa_croce14.jpg,2,7,5,5,7,7,7,7,5,5,5,5,7,5,0
Type,Final-R,Final-R,Final-R,Final-R,Final-R,Final-R,Final-R,Final-R,Final-R,Final-R,Final-R,Final-R,Final-R,Final-R,Final-R
basilica_santa_croce12.jpg,0,7,5,3,7,7,7,7,5,5,5,5,7,5,2
basilica_santa_croce9.jpg,7,0,8,8,8,8,8,8,6,8,8,4,8,8,7
basilica_santa_croce5.jpg,5,8,0,6,8,8,8,8,8,6,6,6,8,6,5
basilica_santa_croce0.jpg,3,8,6,0,8,8,8,6,6,6,4,6,8,6,5
basilica_santa_croce8.jpg,7,8,8,8,0,8,8,6,8,8,8,8,8,8,7
basilica_santa_croce4.jpg,7,8,8,8,8,0,8,8,8,6,8,8,8,8,7
basilica_santa_croce13.jpg,7,8,8,8,8,8,0,6,8,8,8,8,8,8,7
basilica_santa_croce7.jpg,7,8,8,6,6,8,6,0,8,8,6,8,8,8,7
basilica_santa_croce1.jpg,5,6,8,6,8,8,8,8,0,8,8,6,8,8,5
basilica_santa_croce10.jpg,5,8,6,6,8,6,8,8,8,0,6,6,8,6,5
basilica_santa_croce11.jpg,5,8,6,4,8,8,8,6,8,6,0,6,8,6,5
basilica_santa_croce6.jpg,5,4,6,6,8,8,8,8,6,6,6,0,8,6,5
basilica_santa_croce3.jpg,7,8,8,8,8,8,8,8,8,8,8,8,0,8,7
basilica_santa_croce2.jpg,5,8,6,6,8,8,8,8,8,6,6,6,8,0,5
basilica_santa_croce14.jpg,2,7,5,5,7,7,7,7,5,5,5,5,7,5,0
