,san_luca11.jpg,san_luca14.jpg,san_luca2.jpg,san_luca1.jpg,san_luca12.jpg,san_luca3.jpg,san_luca5.jpg,san_luca13.jpg,san_luca0.jpg,san_luca8.jpg,san_luca10.jpg,san_luca9.jpg,san_luca7.jpg,san_luca6.jpg,san_luca4.jpg
Type,Meta,Meta,Meta,Meta,Meta,Meta,Meta,Meta,Meta,Meta,Meta,Meta,Meta,Meta,Meta
san_luca11.jpg,0,6,7,4,6,5,6,5,5,4,6,4,6,7,7
san_luca14.jpg,6,0,5,6,4,5,7,6,6,4,6,6,6,6,6
san_luca2.jpg,7,5,0,7,7,6,6,7,7,7,6,7,6,5,6
san_luca1.jpg,4,6,7,0,6,6,6,6,5,4,7,6,6,6,5
san_luca12.jpg,6,4,7,6,0,6,7,5,6,5,6,6,5,7,7
san_luca3.jpg,5,5,6,6,6,0,6,6,5,6,5,4,6,6,7
san_luca5.jpg,6,7,6,6,7,6,0,5,5,5,5,5,6,6,5
san_luca13.jpg,5,6,7,6,5,6,5,0,5,5,3,5,6,6,6
san_luca0.jpg,5,6,7,5,6,5,5,5,0,6,7,3,5,6,6
san_luca8.jpg,4,4,7,4,5,6,5,5,6,0,6,4,6,7,4
san_luca10.jpg,6,6,6,7,6,5,5,3,7,6,0,6,6,5,6
san_luca9.jpg,4,6,7,6,6,4,5,5,3,4,6,0,6,7,6
san_luca7.jpg,6,6,6,6,5,6,6,6,5,6,6,6,0,4,4
san_luca6.jpg,7,6,5,6,7,6,6,6,6,7,5,7,4,0,4
san_luca4.jpg,7,6,6,5,7,7,5,6,6,4,6,6,4,4,0
Type,R-Meta,R-Meta,R-Meta,R-Meta,R-Meta,R-Meta,R-Meta,R-Meta,R-Meta,R-Meta,R-Meta,R-Meta,R-Meta,R-Meta,R-Meta
san_luca11.jpg,0,2,3,1,1,2,1,2,2,0,2,1,3,3,3
san_luca14.jpg,2,0,3,3,1,2,1,2,2,2,2,1,3,3,3
san_luca2.jpg,3,3,0,2,2,3,2,3,1,3,3,2,2,2,2
san_luca1.jpg,1,3,2,0,2,1,2,3,1,1,3,2,2,2,2
san_luca12.jpg,1,1,2,2,0,3,0,1,1,1,1,0,2,2,2
san_luca3.jpg,2,2,3,1,3,0,3,4,2,2,4,3,3,3,3
san_luca5.jpg,1,1,2,2,0,3,0,1,1,1,1,0,2,2,2
san_luca13.jpg,2,2,3,3,1,4,1,0,2,2,0,1,1,1,1
san_luca0.jpg,2,2,1,1,1,2,1,2,0,2,2,1,1,1,1
san_luca8.jpg,0,2,3,1,1,2,1,2,2,0,2,1,3,3,3
san_luca10.jpg,2,2,3,3,1,4,1,0,2,2,0,1,1,1,1
san_luca9.jpg,1,1,2,2,0,3,0,1,1,1,1,0,2,2,2
san_luca7.jpg,3,3,2,2,2,3,2,1,1,3,1,2,0,0,0
san_luca6.jpg,3,3,2,2,2,3,2,1,1,3,1,2,0,0,0
san_luca4.jpg,3,3,2,2,2,3,2,1,1,3,1,2,0,0,0
Type,Content,Content,Content,Content,Content,Content,Content,Content,Content,Content,Content,Content,Content,Content,Content
san_luca11.jpg,0,13,12,12,12,12,11,12,12,13,13,12,12,13,12
san_luca14.jpg,13,0,9,12,12,13,12,13,13,13,13,13,13,13,12
san_luca2.jpg,12,9,0,12,12,13,12,13,13,12,12,13,13,12,13
san_luca1.jpg,12,12,12,0,13,12,12,13,10,12,12,13,13,13,11
san_luca12.jpg,12,12,12,13,0,13,13,13,13,12,12,13,12,12,13
san_luca3.jpg,12,13,13,12,13,0,13,12,11,13,13,13,13,13,13
san_luca5.jpg,11,12,12,12,13,13,0,13,13,13,12,12,13,11,12
san_luca13.jpg,12,13,13,13,13,12,13,0,9,13,13,13,13,13,10
san_luca0.jpg,12,13,13,10,13,11,13,9,0,13,13,12,13,13,12
san_luca8.jpg,13,13,12,12,12,13,13,13,13,0,13,12,12,13,12
san_luca10.jpg,13,13,12,12,12,13,12,13,13,13,0,11,13,12,12
san_luca9.jpg,12,13,13,13,13,13,12,13,12,12,11,0,11,13,13
san_luca7.jpg,12,13,13,13,12,13,13,13,13,12,13,11,0,13,12
san_luca6.jpg,13,13,12,13,12,13,11,13,13,13,12,13,13,0,13
san_luca4.jpg,12,12,13,11,13,13,12,10,12,12,12,13,12,13,0
Type,R-Content,R-Content,R-Content,R-Content,R-Content,R-Content,R-Content,R-Content,R-Content,R-Content,R-Content,R-Content,R-Content,R-Content,R-Content
san_luca11.jpg,0,5,5,1,4,5,3,4,4,2,4,4,5,4,4
san_luca14.jpg,5,0,4,6,5,4,6,5,5,3,5,1,2,5,3
san_luca2.jpg,5,4,0,4,5,6,6,5,5,3,3,3,4,5,5
san_luca1.jpg,1,6,4,0,5,6,2,3,3,3,5,5,6,5,5
san_luca12.jpg,4,5,5,5,0,1,3,4,2,6,2,6,5,2,6
san_luca3.jpg,5,4,6,6,1,0,4,5,3,7,3,5,4,3,5
san_luca5.jpg,3,6,6,2,3,4,0,1,1,5,5,7,6,3,5
san_luca13.jpg,4,5,5,3,4,5,1,0,2,4,6,6,5,2,4
san_luca0.jpg,4,5,5,3,2,3,1,2,0,6,4,6,5,4,6
san_luca8.jpg,2,3,3,3,6,7,5,4,6,0,4,2,3,4,2
san_luca10.jpg,4,5,3,5,2,3,5,6,4,4,0,4,3,4,4
san_luca9.jpg,4,1,3,5,6,5,7,6,6,2,4,0,1,6,2
san_luca7.jpg,5,2,4,6,5,4,6,5,5,3,3,1,0,5,1
san_luca6.jpg,4,5,5,5,2,3,3,2,4,4,4,6,5,0,4
san_luca4.jpg,4,3,5,5,6,5,5,4,6,2,4,2,1,4,0
Type,Final-R,Final-R,Final-R,Final-R,Final-R,Final-R,Final-R,Final-R,Final-R,Final-R,Final-R,Final-R,Final-R,Final-R,Final-R
san_luca11.jpg,0,2,3,1,1,2,1,2,2,0,2,1,3,3,3
san_luca14.jpg,2,0,3,3,1,2,1,2,2,2,2,1,3,3,3
san_luca2.jpg,3,3,0,2,2,3,2,3,1,3,3,2,2,2,2
san_luca1.jpg,1,3,2,0,2,1,2,3,1,1,3,2,2,2,2
san_luca12.jpg,1,1,2,2,0,3,0,1,1,1,1,0,2,2,2
san_luca3.jpg,2,2,3,1,3,0,3,4,2,2,4,3,3,3,3
san_luca5.jpg,1,1,2,2,0,3,0,1,1,1,1,0,2,2,2
san_luca13.jpg,2,2,3,3,1,4,1,0,2,2,0,1,1,1,1
san_luca0.jpg,2,2,1,1,1,2,1,2,0,2,2,1,1,1,1
san_luca8.jpg,0,2,3,1,1,2,1,2,2,0,2,1,3,3,3
san_luca10.jpg,2,2,3,3,1,4,1,0,2,2,0,1,1,1,1
san_luca9.jpg,1,1,2,2,0,3,0,1,1,1,1,0,2,2,2
san_luca7.jpg,3,3,2,2,2,3,2,1,1,3,1,2,0,0,0
san_luca6.jpg,3,3,2,2,2,3,2,1,1,3,1,2,0,0,0
san_luca4.jpg,3,3,2,2,2,3,2,1,1,3,1,2,0,0,0
