Img-Name,Meta,R-Meta,Content,R-Content,Final-R
arco_pace0.jpg,AAA2Y5RYKWJTHXGT,"[0, 1, 1, 0, 1, 0, 0, 0]",EEA6D5MOBLALOP2I,"[0, 1, 0, 0, 1, 0, 1, 1]","[0, 1, 0, 0, 1, 0, 1, 1]"
arco_pace12.jpg,AAA347TZ6WJTHXGT,"[0, 0, 1, 1, 1, 0, 0, 0]",EEA7BNY6B62UVWAU,"[0, 0, 0, 0, 0, 1, 1, 1]","[0, 0, 0, 0, 0, 1, 1, 1]"
arco_pace11.jpg,AAA745TZPWJTHXGT,"[0, 0, 1, 0, 1, 0, 0, 1]",EEA7BFEPRPLD7SCC,"[1, 0, 0, 1, 1, 0, 0, 1]","[1, 0, 0, 1, 1, 0, 0, 1]"
arco_pace6.jpg,AAA2Y5D4LWJTHXGT,"[0, 0, 1, 0, 1, 0, 0, 0]",EEA25P4V2TVGAYJI,"[0, 1, 1, 0, 0, 0, 1, 1]","[0, 1, 1, 0, 0, 0, 1, 1]"
arco_pace13.jpg,AAA655RZ5WJTHXGT,"[0, 0, 1, 0, 1, 0, 1, 0]",EEA6BYQOHF3Y52JD,"[0, 1, 0, 0, 1, 0, 1, 1]","[0, 1, 0, 0, 1, 0, 1, 1]"
arco_pace5.jpg,AAA7Y5RY6SJTHXGT,"[0, 1, 0, 0, 1, 0, 0, 1]",EEAZG2CHH7QBH2MW,"[1, 0, 1, 0, 0, 0, 0, 1]","[1, 0, 1, 0, 0, 0, 0, 1]"
arco_pace4.jpg,AAA3Y7BYPWJTHXGT,"[0, 1, 0, 1, 1, 0, 0, 0]",EEA6XIQR3QXFDWZS,"[0, 0, 1, 1, 0, 0, 1, 0]","[0, 0, 1, 1, 0, 0, 1, 0]"
arco_pace9.jpg,AAA255BZSCJTHXGT,"[0, 0, 1, 0, 1, 0, 0, 0]",EEA4HQSMBWH3E2OP,"[1, 0, 0, 1, 1, 1, 0, 0]","[1, 0, 0, 1, 1, 1, 0, 0]"
arco_pace10.jpg,AAA745TZ7WJTHXGT,"[0, 0, 1, 0, 1, 0, 0, 1]",EEAYNOA7IOYX5OED,"[1, 1, 0, 0, 1, 0, 0, 1]","[1, 1, 0, 0, 1, 0, 0, 1]"
arco_pace1.jpg,AAA24VBY6WJTHXGT,"[0, 1, 1, 0, 1, 0, 0, 0]",EEA6D7A6IG2E7IPE,"[0, 0, 0, 0, 0, 1, 1, 0]","[0, 0, 0, 0, 0, 1, 1, 0]"
arco_pace14.jpg,AAA347DZ7WJTHXGT,"[0, 0, 1, 1, 1, 0, 0, 0]",EEA7VJSBTBZJS7UJ,"[0, 0, 1, 0, 0, 0, 0, 1]","[0, 0, 1, 0, 0, 0, 0, 1]"
arco_pace7.jpg,AAA34URZKWJTHXGT,"[0, 0, 1, 1, 1, 0, 0, 0]",EEA63K6DSERIZOWS,"[0, 1, 0, 1, 1, 0, 1, 0]","[0, 1, 0, 1, 1, 0, 1, 0]"
arco_pace3.jpg,AAA2Y5BV2CJTHXGT,"[0, 0, 1, 0, 1, 0, 1, 0]",EEA7JIYLLWQTMTGV,"[0, 0, 0, 0, 1, 0, 1, 1]","[0, 0, 0, 0, 1, 0, 1, 1]"
arco_pace2.jpg,AAA245BYSGJTHXGT,"[0, 1, 1, 0, 1, 0, 0, 0]",EEA6ZZWGZQZQUOJO,"[0, 1, 0, 0, 0, 0, 1, 1]","[0, 1, 0, 0, 0, 0, 1, 1]"
arco_pace8.jpg,AAA2Y7RYWSJTHXGT,"[0, 1, 1, 0, 1, 0, 0, 0]",EEA6DPAWZQ6VHHEF,"[0, 0, 0, 0, 0, 0, 1, 1]","[0, 0, 0, 0, 0, 0, 1, 1]"
