,lavorare_preferisco_mare7.jpg,lavorare_preferisco_mare6.jpg,lavorare_preferisco_mare4.jpg,lavorare_preferisco_mare1.jpg,lavorare_preferisco_mare11.jpg,lavorare_preferisco_mare10.jpg,lavorare_preferisco_mare9.jpg,lavorare_preferisco_mare13.jpg,lavorare_preferisco_mare12.jpg,lavorare_preferisco_mare3.jpg,lavorare_preferisco_mare5.jpg,lavorare_preferisco_mare8.jpg,lavorare_preferisco_mare0.jpg,lavorare_preferisco_mare2.jpg,lavorare_preferisco_mare14.jpg
Type,SHA256,SHA256,SHA256,SHA256,SHA256,SHA256,SHA256,SHA256,SHA256,SHA256,SHA256,SHA256,SHA256,SHA256,SHA256
lavorare_preferisco_mare7.jpg,0,63,59,57,59,61,60,62,59,60,59,59,59,62,56
lavorare_preferisco_mare6.jpg,63,0,59,61,63,59,60,61,58,62,57,61,57,62,61
lavorare_preferisco_mare4.jpg,59,59,0,57,60,60,63,60,60,58,60,57,63,62,62
lavorare_preferisco_mare1.jpg,57,61,57,0,60,59,61,61,60,58,59,61,61,61,59
lavorare_preferisco_mare11.jpg,59,63,60,60,0,61,60,60,59,61,60,61,59,63,61
lavorare_preferisco_mare10.jpg,61,59,60,59,61,0,59,62,58,60,59,59,60,63,60
lavorare_preferisco_mare9.jpg,60,60,63,61,60,59,0,61,61,62,60,61,60,62,64
lavorare_preferisco_mare13.jpg,62,61,60,61,60,62,61,0,60,61,61,62,57,58,58
lavorare_preferisco_mare12.jpg,59,58,60,60,59,58,61,60,0,62,57,57,58,61,61
lavorare_preferisco_mare3.jpg,60,62,58,58,61,60,62,61,62,0,59,58,61,60,60
lavorare_preferisco_mare5.jpg,59,57,60,59,60,59,60,61,57,59,0,60,59,63,59
lavorare_preferisco_mare8.jpg,59,61,57,61,61,59,61,62,57,58,60,0,61,59,60
lavorare_preferisco_mare0.jpg,59,57,63,61,59,60,60,57,58,61,59,61,0,57,60
lavorare_preferisco_mare2.jpg,62,62,62,61,63,63,62,58,61,60,63,59,57,0,57
lavorare_preferisco_mare14.jpg,56,61,62,59,61,60,64,58,61,60,59,60,60,57,0
Type,Final-R,Final-R,Final-R,Final-R,Final-R,Final-R,Final-R,Final-R,Final-R,Final-R,Final-R,Final-R,Final-R,Final-R,Final-R
lavorare_preferisco_mare7.jpg,0,16,16,15,13,15,16,16,14,16,15,15,16,16,13
lavorare_preferisco_mare6.jpg,16,0,14,15,13,15,14,16,10,14,13,15,16,16,13
lavorare_preferisco_mare4.jpg,16,14,0,15,15,15,16,16,14,14,15,15,16,16,13
lavorare_preferisco_mare1.jpg,15,15,15,0,14,14,13,13,13,13,14,14,15,15,14
lavorare_preferisco_mare11.jpg,13,13,15,14,0,12,15,15,13,15,14,12,15,15,14
lavorare_preferisco_mare10.jpg,15,15,15,14,12,0,15,13,11,15,14,14,15,15,14
lavorare_preferisco_mare9.jpg,16,14,16,13,15,15,0,16,14,14,15,15,16,16,13
lavorare_preferisco_mare13.jpg,16,16,16,13,15,13,16,0,12,14,15,15,16,14,15
lavorare_preferisco_mare12.jpg,14,10,14,13,13,11,14,12,0,14,13,13,14,14,11
lavorare_preferisco_mare3.jpg,16,14,14,13,15,15,14,14,14,0,15,15,16,14,15
lavorare_preferisco_mare5.jpg,15,13,15,14,14,14,15,15,13,15,0,14,13,11,14
lavorare_preferisco_mare8.jpg,15,15,15,14,12,14,15,15,13,15,14,0,13,15,14
lavorare_preferisco_mare0.jpg,16,16,16,15,15,15,16,16,14,16,13,13,0,16,15
lavorare_preferisco_mare2.jpg,16,16,16,15,15,15,16,14,14,14,11,15,16,0,15
lavorare_preferisco_mare14.jpg,13,13,13,14,14,14,13,15,11,15,14,14,15,15,0
