,ponte_vecchio4.jpg,ponte_vecchio8.jpg,ponte_vecchio2.jpg,ponte_vecchio6.jpg,ponte_vecchio0.jpg,ponte_vecchio13.jpg,ponte_vecchio11.jpg,ponte_vecchio14.jpg,ponte_vecchio1.jpg,ponte_vecchio3.jpg,ponte_vecchio7.jpg,ponte_vecchio9.jpg,ponte_vecchio12.jpg,ponte_vecchio10.jpg,ponte_vecchio5.jpg
Type,Meta,Meta,Meta,Meta,Meta,Meta,Meta,Meta,Meta,Meta,Meta,Meta,Meta,Meta,Meta
ponte_vecchio4.jpg,0,2,4,4,5,4,5,3,3,4,2,4,5,5,4
ponte_vecchio8.jpg,2,0,4,5,5,4,6,5,4,4,3,4,5,5,4
ponte_vecchio2.jpg,4,4,0,5,3,4,6,4,4,5,4,5,4,4,3
ponte_vecchio6.jpg,4,5,5,0,4,5,7,3,4,4,4,4,5,4,5
ponte_vecchio0.jpg,5,5,3,4,0,5,7,3,5,6,5,4,4,3,3
ponte_vecchio13.jpg,4,4,4,5,5,0,5,5,3,4,4,5,4,3,3
ponte_vecchio11.jpg,5,6,6,7,7,5,0,6,6,4,6,6,6,7,5
ponte_vecchio14.jpg,3,5,4,3,3,5,6,0,3,5,4,4,5,4,5
ponte_vecchio1.jpg,3,4,4,4,5,3,6,3,0,4,3,5,4,4,4
ponte_vecchio3.jpg,4,4,5,4,6,4,4,5,4,0,4,6,6,6,5
ponte_vecchio7.jpg,2,3,4,4,5,4,6,4,3,4,0,4,5,5,4
ponte_vecchio9.jpg,4,4,5,4,4,5,6,4,5,6,4,0,5,3,4
ponte_vecchio12.jpg,5,5,4,5,4,4,6,5,4,6,5,5,0,3,4
ponte_vecchio10.jpg,5,5,4,4,3,3,7,4,4,6,5,3,3,0,3
ponte_vecchio5.jpg,4,4,3,5,3,3,5,5,4,5,4,4,4,3,0
Type,R-Meta,R-Meta,R-Meta,R-Meta,R-Meta,R-Meta,R-Meta,R-Meta,R-Meta,R-Meta,R-Meta,R-Meta,R-Meta,R-Meta,R-Meta
ponte_vecchio4.jpg,0,2,2,0,2,2,4,0,0,2,0,2,2,2,2
ponte_vecchio8.jpg,2,0,2,2,2,2,4,2,2,4,2,2,2,2,2
ponte_vecchio2.jpg,2,2,0,2,2,2,4,2,2,4,2,2,2,2,2
ponte_vecchio6.jpg,0,2,2,0,2,2,4,0,0,2,0,2,2,2,2
ponte_vecchio0.jpg,2,2,2,2,0,2,4,2,2,4,2,2,2,2,2
ponte_vecchio13.jpg,2,2,2,2,2,0,4,2,2,4,2,2,2,0,0
ponte_vecchio11.jpg,4,4,4,4,4,4,0,4,4,2,4,4,2,4,4
ponte_vecchio14.jpg,0,2,2,0,2,2,4,0,0,2,0,2,2,2,2
ponte_vecchio1.jpg,0,2,2,0,2,2,4,0,0,2,0,2,2,2,2
ponte_vecchio3.jpg,2,4,4,2,4,4,2,2,2,0,2,4,4,4,4
ponte_vecchio7.jpg,0,2,2,0,2,2,4,0,0,2,0,2,2,2,2
ponte_vecchio9.jpg,2,2,2,2,2,2,4,2,2,4,2,0,2,2,2
ponte_vecchio12.jpg,2,2,2,2,2,2,2,2,2,4,2,2,0,2,2
ponte_vecchio10.jpg,2,2,2,2,2,0,4,2,2,4,2,2,2,0,0
ponte_vecchio5.jpg,2,2,2,2,2,0,4,2,2,4,2,2,2,0,0
Type,Content,Content,Content,Content,Content,Content,Content,Content,Content,Content,Content,Content,Content,Content,Content
ponte_vecchio4.jpg,0,13,11,12,12,11,13,12,12,13,12,10,12,12,13
ponte_vecchio8.jpg,13,0,13,12,11,13,13,11,12,13,13,10,13,12,12
ponte_vecchio2.jpg,11,13,0,11,12,11,13,12,12,11,13,11,13,12,13
ponte_vecchio6.jpg,12,12,11,0,10,11,12,13,12,12,12,12,13,11,13
ponte_vecchio0.jpg,12,11,12,10,0,11,13,12,12,12,13,11,13,12,12
ponte_vecchio13.jpg,11,13,11,11,11,0,12,13,10,13,11,12,12,11,13
ponte_vecchio11.jpg,13,13,13,12,13,12,0,13,12,11,13,12,13,12,13
ponte_vecchio14.jpg,12,11,12,13,12,13,13,0,12,13,13,11,13,12,12
ponte_vecchio1.jpg,12,12,12,12,12,10,12,12,0,13,11,12,13,13,12
ponte_vecchio3.jpg,13,13,11,12,12,13,11,13,13,0,13,12,13,12,13
ponte_vecchio7.jpg,12,13,13,12,13,11,13,13,11,13,0,13,11,12,13
ponte_vecchio9.jpg,10,10,11,12,11,12,12,11,12,12,13,0,13,13,12
ponte_vecchio12.jpg,12,13,13,13,13,12,13,13,13,13,11,13,0,12,11
ponte_vecchio10.jpg,12,12,12,11,12,11,12,12,13,12,12,13,12,0,13
ponte_vecchio5.jpg,13,12,13,13,12,13,13,12,12,13,13,12,11,13,0
Type,R-Content,R-Content,R-Content,R-Content,R-Content,R-Content,R-Content,R-Content,R-Content,R-Content,R-Content,R-Content,R-Content,R-Content,R-Content
ponte_vecchio4.jpg,0,8,7,8,8,6,6,6,6,6,4,5,5,6,6
ponte_vecchio8.jpg,8,0,5,6,6,8,8,6,6,6,6,5,7,6,6
ponte_vecchio2.jpg,7,5,0,1,5,5,5,5,7,5,5,6,6,7,7
ponte_vecchio6.jpg,8,6,1,0,6,6,6,6,8,6,4,7,7,6,8
ponte_vecchio0.jpg,8,6,5,6,0,8,6,6,6,6,6,5,7,8,6
ponte_vecchio13.jpg,6,8,5,6,8,0,6,4,4,6,4,7,5,6,8
ponte_vecchio11.jpg,6,8,5,6,6,6,0,8,6,8,6,5,7,8,8
ponte_vecchio14.jpg,6,6,5,6,6,4,8,0,2,6,4,5,5,6,6
ponte_vecchio1.jpg,6,6,7,8,6,4,6,2,0,6,4,5,5,6,6
ponte_vecchio3.jpg,6,6,5,6,6,6,8,6,6,0,4,7,5,6,6
ponte_vecchio7.jpg,4,6,5,4,6,4,6,4,4,4,0,5,3,2,6
ponte_vecchio9.jpg,5,5,6,7,5,7,5,5,5,7,5,0,6,7,3
ponte_vecchio12.jpg,5,7,6,7,7,5,7,5,5,5,3,6,0,5,7
ponte_vecchio10.jpg,6,6,7,6,8,6,8,6,6,6,2,7,5,0,8
ponte_vecchio5.jpg,6,6,7,8,6,8,8,6,6,6,6,3,7,8,0
Type,Final-R,Final-R,Final-R,Final-R,Final-R,Final-R,Final-R,Final-R,Final-R,Final-R,Final-R,Final-R,Final-R,Final-R,Final-R
ponte_vecchio4.jpg,0,2,2,0,2,2,4,0,0,2,0,2,2,2,2
ponte_vecchio8.jpg,2,0,2,2,2,2,4,2,2,4,2,2,2,2,2
ponte_vecchio2.jpg,2,2,0,2,2,2,4,2,2,4,2,2,2,2,2
ponte_vecchio6.jpg,0,2,2,0,2,2,4,0,0,2,0,2,2,2,2
ponte_vecchio0.jpg,2,2,2,2,0,2,4,2,2,4,2,2,2,2,2
ponte_vecchio13.jpg,2,2,2,2,2,0,4,2,2,4,2,2,2,0,0
ponte_vecchio11.jpg,4,4,4,4,4,4,0,4,4,2,4,4,2,4,4
ponte_vecchio14.jpg,0,2,2,0,2,2,4,0,0,2,0,2,2,2,2
ponte_vecchio1.jpg,0,2,2,0,2,2,4,0,0,2,0,2,2,2,2
ponte_vecchio3.jpg,2,4,4,2,4,4,2,2,2,0,2,4,4,4,4
ponte_vecchio7.jpg,0,2,2,0,2,2,4,0,0,2,0,2,2,2,2
ponte_vecchio9.jpg,2,2,2,2,2,2,4,2,2,4,2,0,2,2,2
ponte_vecchio12.jpg,2,2,2,2,2,2,2,2,2,4,2,2,0,2,2
ponte_vecchio10.jpg,2,2,2,2,2,0,4,2,2,4,2,2,2,0,0
ponte_vecchio5.jpg,2,2,2,2,2,0,4,2,2,4,2,2,2,0,0
