,san_luca11.jpg,san_luca14.jpg,san_luca2.jpg,san_luca1.jpg,san_luca12.jpg,san_luca3.jpg,san_luca5.jpg,san_luca13.jpg,san_luca0.jpg,san_luca8.jpg,san_luca10.jpg,san_luca9.jpg,san_luca7.jpg,san_luca6.jpg,san_luca4.jpg
Type,SHA256,SHA256,SHA256,SHA256,SHA256,SHA256,SHA256,SHA256,SHA256,SHA256,SHA256,SHA256,SHA256,SHA256,SHA256
san_luca11.jpg,0,61,58,59,58,61,59,59,61,60,55,62,62,57,58
san_luca14.jpg,61,0,61,61,58,60,58,60,55,62,58,61,61,60,60
san_luca2.jpg,58,61,0,63,64,60,58,58,60,58,62,63,64,59,62
san_luca1.jpg,59,61,63,0,60,60,61,58,63,62,60,61,59,58,59
san_luca12.jpg,58,58,64,60,0,59,64,60,59,57,61,63,62,58,60
san_luca3.jpg,61,60,60,60,59,0,55,61,58,63,60,61,62,57,61
san_luca5.jpg,59,58,58,61,64,55,0,63,63,61,61,60,63,61,60
san_luca13.jpg,59,60,58,58,60,61,63,0,60,59,60,59,61,60,60
san_luca0.jpg,61,55,60,63,59,58,63,60,0,54,56,58,59,63,63
san_luca8.jpg,60,62,58,62,57,63,61,59,54,0,60,62,62,61,60
san_luca10.jpg,55,58,62,60,61,60,61,60,56,60,0,60,60,60,59
san_luca9.jpg,62,61,63,61,63,61,60,59,58,62,60,0,61,61,58
san_luca7.jpg,62,61,64,59,62,62,63,61,59,62,60,61,0,61,62
san_luca6.jpg,57,60,59,58,58,57,61,60,63,61,60,61,61,0,58
san_luca4.jpg,58,60,62,59,60,61,60,60,63,60,59,58,62,58,0
Type,Final-R,Final-R,Final-R,Final-R,Final-R,Final-R,Final-R,Final-R,Final-R,Final-R,Final-R,Final-R,Final-R,Final-R,Final-R
san_luca11.jpg,0,16,14,16,15,16,16,12,14,12,12,16,16,16,16
san_luca14.jpg,16,0,16,16,13,16,14,14,14,16,16,14,16,14,16
san_luca2.jpg,14,16,0,14,11,16,14,16,12,16,16,14,16,16,14
san_luca1.jpg,16,16,14,0,15,14,16,16,12,14,14,16,12,16,16
san_luca12.jpg,15,13,11,15,0,13,13,15,13,13,15,15,15,15,11
san_luca3.jpg,16,16,16,14,13,0,16,16,16,14,16,16,16,16,16
san_luca5.jpg,16,14,14,16,13,16,0,14,16,12,12,16,14,16,14
san_luca13.jpg,12,14,16,16,15,16,14,0,16,12,12,14,12,14,16
san_luca0.jpg,14,14,12,12,13,16,16,16,0,14,16,16,16,14,14
san_luca8.jpg,12,16,16,14,13,14,12,12,14,0,12,16,14,16,16
san_luca10.jpg,12,16,16,14,15,16,12,12,16,12,0,14,14,16,16
san_luca9.jpg,16,14,14,16,15,16,16,14,16,16,14,0,16,14,16
san_luca7.jpg,16,16,16,12,15,16,14,12,16,14,14,16,0,10,14
san_luca6.jpg,16,14,16,16,15,16,16,14,14,16,16,14,10,0,14
san_luca4.jpg,16,16,14,16,11,16,14,16,14,16,16,16,14,14,0
