Img-Name,Meta,R-Meta,Content,R-Content,Final-R
due_torri1.jpg,AAA576VEPIJBFX33,"[0, 0, 1, 1, 0, 1, 0, 0]",EEA4BFD3RRZ4WHHK,"[0, 0, 0, 1, 1, 0, 0, 0]","[0, 0, 1, 1, 0, 1, 0, 0]"
due_torri14.jpg,AAAV36VN7YJBFX33,"[0, 0, 1, 1, 0, 0, 1, 0]",EEAZRBEX63UOKIR5,"[1, 0, 1, 0, 0, 1, 0, 1]","[0, 0, 1, 1, 0, 0, 1, 0]"
due_torri5.jpg,AAAV22VM3IJBFX33,"[0, 0, 1, 1, 0, 1, 1, 0]",EEA6YVFBDZD4RVFP,"[1, 0, 1, 0, 1, 0, 1, 0]","[0, 0, 1, 1, 0, 1, 1, 0]"
due_torri2.jpg,AAAVWKVIPIJBFX33,"[0, 1, 1, 1, 0, 0, 1, 0]",EEAZQYAC34OV3J2P,"[1, 0, 1, 1, 0, 0, 1, 0]","[0, 1, 1, 1, 0, 0, 1, 0]"
due_torri12.jpg,AAAV32VIPIJBFX33,"[0, 1, 1, 1, 0, 0, 1, 0]",EEAYCWJM7YZGNWHF,"[0, 1, 0, 0, 0, 1, 1, 1]","[0, 1, 1, 1, 0, 0, 1, 0]"
due_torri4.jpg,AAAVT6VMPYJBFX33,"[0, 0, 1, 1, 0, 1, 1, 0]",EEA6ZHJHLOJQ6E2B,"[1, 1, 1, 0, 0, 0, 1, 0]","[0, 0, 1, 1, 0, 1, 1, 0]"
due_torri0.jpg,AAA5SGVM3QJBFX33,"[0, 0, 1, 1, 0, 1, 0, 0]",EEA644GUYUFTRJPJ,"[0, 0, 1, 0, 1, 1, 1, 0]","[0, 0, 1, 1, 0, 1, 0, 0]"
due_torri9.jpg,AAA5S2VF3IJBFX33,"[0, 0, 1, 1, 0, 1, 1, 0]",EEA2MKC3CY7OVDTU,"[0, 0, 1, 1, 0, 1, 0, 1]","[0, 0, 1, 1, 0, 1, 1, 0]"
due_torri7.jpg,AAA5TSVA3YJBFX33,"[0, 1, 1, 1, 0, 1, 0, 0]",EEAZ5O2E24UNFNIK,"[0, 0, 1, 1, 0, 1, 1, 0]","[0, 1, 1, 1, 0, 1, 0, 0]"
due_torri11.jpg,AAA5H254LIJBFX33,"[0, 0, 1, 1, 1, 1, 0, 0]",EEAZ3LSNROBC5JKH,"[1, 0, 1, 1, 0, 0, 1, 0]","[0, 0, 1, 1, 1, 1, 0, 0]"
due_torri6.jpg,AAAXTSVM3YJBFX33,"[1, 0, 1, 1, 0, 1, 0, 0]",EEA4FQSBVU75I2B7,"[0, 0, 1, 0, 1, 1, 0, 1]","[1, 0, 1, 1, 0, 1, 0, 0]"
due_torri10.jpg,AAA572VV3YJBFX33,"[0, 0, 1, 1, 0, 1, 1, 0]",EEA3XQH4SBVUPITF,"[0, 0, 0, 1, 1, 1, 1, 0]","[0, 0, 1, 1, 0, 1, 1, 0]"
due_torri13.jpg,AAA5X2VV7IJBFX33,"[0, 0, 1, 1, 0, 1, 1, 0]",EEA7N4TIXMBAKUV6,"[0, 1, 0, 0, 0, 0, 1, 1]","[0, 0, 1, 1, 0, 1, 1, 0]"
due_torri3.jpg,AAAWS2VEKIJBFX33,"[0, 0, 1, 1, 0, 1, 0, 1]",EEAYSU7MVV5NFETC,"[0, 1, 0, 1, 0, 1, 1, 0]","[0, 0, 1, 1, 0, 1, 0, 1]"
due_torri8.jpg,AAA4SOVI7IJBFX33,"[0, 1, 1, 1, 1, 0, 0, 0]",EEA6XFLBSTMCXRLY,"[0, 1, 1, 1, 0, 0, 1, 0]","[0, 1, 1, 1, 1, 0, 0, 0]"
