,nettuno9.jpg,nettuno3.jpg,nettuno2.jpg,nettuno11.jpg,nettuno0.jpg,nettuno5.jpg,nettuno4.jpg,nettuno12.jpg,nettuno6.jpg,nettuno10.jpg,nettuno7.jpg,nettuno8.jpg,nettuno1.jpg,nettuno13.jpg,nettuno14.jpg
Type,Meta,Meta,Meta,Meta,Meta,Meta,Meta,Meta,Meta,Meta,Meta,Meta,Meta,Meta,Meta
nettuno9.jpg,0,5,3,7,4,5,3,4,3,2,6,3,6,5,4
nettuno3.jpg,5,0,3,5,6,5,4,6,3,6,5,3,5,6,6
nettuno2.jpg,3,3,0,6,5,6,3,4,4,4,5,2,5,4,5
nettuno11.jpg,7,5,6,0,6,5,6,6,7,7,5,6,4,6,5
nettuno0.jpg,4,6,5,6,0,3,5,6,4,3,4,5,6,5,4
nettuno5.jpg,5,5,6,5,3,0,5,7,5,4,4,6,6,6,5
nettuno4.jpg,3,4,3,6,5,5,0,4,4,5,5,3,5,5,5
nettuno12.jpg,4,6,4,6,6,7,4,0,6,5,6,4,6,2,6
nettuno6.jpg,3,3,4,7,4,5,4,6,0,4,6,3,6,6,4
nettuno10.jpg,2,6,4,7,3,4,5,5,4,0,5,4,6,3,3
nettuno7.jpg,6,5,5,5,4,4,5,6,6,5,0,5,5,5,6
nettuno8.jpg,3,3,2,6,5,6,3,4,3,4,5,0,5,4,5
nettuno1.jpg,6,5,5,4,6,6,5,6,6,6,5,5,0,6,4
nettuno13.jpg,5,6,4,6,5,6,5,2,6,3,5,4,6,0,5
nettuno14.jpg,4,6,5,5,4,5,5,6,4,3,6,5,4,5,0
Type,R-Meta,R-Meta,R-Meta,R-Meta,R-Meta,R-Meta,R-Meta,R-Meta,R-Meta,R-Meta,R-Meta,R-Meta,R-Meta,R-Meta,R-Meta
nettuno9.jpg,0,6,4,8,2,5,4,4,2,2,8,4,6,6,4
nettuno3.jpg,6,0,2,4,6,3,4,8,6,8,4,4,4,6,8
nettuno2.jpg,4,2,0,6,4,5,2,6,4,6,6,2,4,6,6
nettuno11.jpg,8,4,6,0,6,3,6,6,8,8,2,6,6,4,6
nettuno0.jpg,2,6,4,6,0,3,2,4,4,2,6,4,4,6,4
nettuno5.jpg,5,3,5,3,3,0,5,7,5,5,3,5,3,5,5
nettuno4.jpg,4,4,2,6,2,5,0,4,6,4,6,4,4,6,6
nettuno12.jpg,4,8,6,6,4,7,4,0,6,4,6,6,8,4,6
nettuno6.jpg,2,6,4,8,4,5,6,6,0,4,8,4,6,6,4
nettuno10.jpg,2,8,6,8,2,5,4,4,4,0,8,6,4,4,2
nettuno7.jpg,8,4,6,2,6,3,6,6,8,8,0,6,6,4,8
nettuno8.jpg,4,4,2,6,4,5,4,6,4,6,6,0,6,6,6
nettuno1.jpg,6,4,4,6,4,3,4,8,6,4,6,6,0,6,4
nettuno13.jpg,6,6,6,4,6,5,6,4,6,4,4,6,6,0,4
nettuno14.jpg,4,8,6,6,4,5,6,6,4,2,8,6,4,4,0
Type,Content,Content,Content,Content,Content,Content,Content,Content,Content,Content,Content,Content,Content,Content,Content
nettuno9.jpg,0,12,12,13,13,13,12,13,13,13,13,12,13,12,12
nettuno3.jpg,12,0,12,13,11,11,11,13,13,13,13,12,12,11,13
nettuno2.jpg,12,12,0,13,12,13,12,12,13,13,13,13,10,13,13
nettuno11.jpg,13,13,13,0,12,13,12,13,12,13,13,13,13,13,13
nettuno0.jpg,13,11,12,12,0,10,12,12,13,13,13,12,11,11,12
nettuno5.jpg,13,11,13,13,10,0,13,13,13,12,12,11,13,11,13
nettuno4.jpg,12,11,12,12,12,13,0,13,13,13,13,13,11,13,12
nettuno12.jpg,13,13,12,13,12,13,13,0,13,13,11,13,13,12,13
nettuno6.jpg,13,13,13,12,13,13,13,13,0,13,12,12,13,7,13
nettuno10.jpg,13,13,13,13,13,12,13,13,13,0,13,13,13,13,10
nettuno7.jpg,13,13,13,13,13,12,13,11,12,13,0,12,13,12,12
nettuno8.jpg,12,12,13,13,12,11,13,13,12,13,12,0,13,12,12
nettuno1.jpg,13,12,10,13,11,13,11,13,13,13,13,13,0,12,13
nettuno13.jpg,12,11,13,13,11,11,13,12,7,13,12,12,12,0,13
nettuno14.jpg,12,13,13,13,12,13,12,13,13,10,12,12,13,13,0
Type,R-Content,R-Content,R-Content,R-Content,R-Content,R-Content,R-Content,R-Content,R-Content,R-Content,R-Content,R-Content,R-Content,R-Content,R-Content
nettuno9.jpg,0,10,8,14,13,14,10,12,13,14,11,10,13,12,12
nettuno3.jpg,10,0,12,12,11,12,10,12,9,14,13,10,13,8,12
nettuno2.jpg,8,12,0,10,9,12,10,10,9,12,9,12,9,12,10
nettuno11.jpg,14,12,10,0,9,14,12,12,11,10,11,14,13,12,12
nettuno0.jpg,13,11,9,9,0,11,13,11,12,11,12,9,12,11,13
nettuno5.jpg,14,12,12,14,11,0,12,14,13,12,9,10,11,12,12
nettuno4.jpg,10,10,10,12,13,12,0,14,11,14,13,10,11,12,12
nettuno12.jpg,12,12,10,12,11,14,14,0,13,12,13,14,13,12,14
nettuno6.jpg,13,9,9,11,12,13,11,13,0,13,12,13,10,9,13
nettuno10.jpg,14,14,12,10,11,12,14,12,13,0,11,14,11,12,14
nettuno7.jpg,11,13,9,11,12,9,13,13,12,11,0,9,10,9,11
nettuno8.jpg,10,10,12,14,9,10,10,14,13,14,9,0,11,12,14
nettuno1.jpg,13,13,9,13,12,11,11,13,10,11,10,11,0,13,13
nettuno13.jpg,12,8,12,12,11,12,12,12,9,12,9,12,13,0,14
nettuno14.jpg,12,12,10,12,13,12,12,14,13,14,11,14,13,14,0
Type,Final-R,Final-R,Final-R,Final-R,Final-R,Final-R,Final-R,Final-R,Final-R,Final-R,Final-R,Final-R,Final-R,Final-R,Final-R
nettuno9.jpg,0,10,8,14,13,14,10,12,13,14,11,10,13,12,12
nettuno3.jpg,10,0,12,12,11,12,10,12,9,14,13,10,13,8,12
nettuno2.jpg,8,12,0,10,9,12,10,10,9,12,9,12,9,12,10
nettuno11.jpg,14,12,10,0,9,14,12,12,11,10,11,14,13,12,12
nettuno0.jpg,13,11,9,9,0,11,13,11,12,11,12,9,12,11,13
nettuno5.jpg,14,12,12,14,11,0,12,14,13,12,9,10,11,12,12
nettuno4.jpg,10,10,10,12,13,12,0,14,11,14,13,10,11,12,12
nettuno12.jpg,12,12,10,12,11,14,14,0,13,12,13,14,13,12,14
nettuno6.jpg,13,9,9,11,12,13,11,13,0,13,12,13,10,9,13
nettuno10.jpg,14,14,12,10,11,12,14,12,13,0,11,14,11,12,14
nettuno7.jpg,11,13,9,11,12,9,13,13,12,11,0,9,10,9,11
nettuno8.jpg,10,10,12,14,9,10,10,14,13,14,9,0,11,12,14
nettuno1.jpg,13,13,9,13,12,11,11,13,10,11,10,11,0,13,13
nettuno13.jpg,12,8,12,12,11,12,12,12,9,12,9,12,13,0,14
nettuno14.jpg,12,12,10,12,13,12,12,14,13,14,11,14,13,14,0
