,pietà_mic12.jpg,pietà_mic11.jpg,pietà_mic13.jpg,pietà_mic10.jpg,pietà_mic2.jpg,pietà_mic6.jpg,pietà_mic3.jpg,pietà_mic5.jpg,pietà_mic7.jpg,pietà_mic1.jpg,pietà_mic14.jpg,pietà_mic8.jpg,pietà_mic9.jpg,pietà_mic0.jpg,pietà_mic4.jpg
Type,SHA256,SHA256,SHA256,SHA256,SHA256,SHA256,SHA256,SHA256,SHA256,SHA256,SHA256,SHA256,SHA256,SHA256,SHA256
pietà_mic12.jpg,0,55,63,60,59,62,62,58,60,59,61,60,59,62,60
pietà_mic11.jpg,55,0,62,59,60,60,63,60,59,60,61,60,57,61,61
pietà_mic13.jpg,63,62,0,61,60,59,62,59,58,62,59,61,60,62,61
pietà_mic10.jpg,60,59,61,0,58,62,61,60,64,61,60,60,60,59,61
pietà_mic2.jpg,59,60,60,58,0,63,60,57,58,60,60,60,61,60,61
pietà_mic6.jpg,62,60,59,62,63,0,63,63,61,62,57,62,57,59,59
pietà_mic3.jpg,62,63,62,61,60,63,0,64,63,58,61,61,62,58,57
pietà_mic5.jpg,58,60,59,60,57,63,64,0,62,59,62,62,60,58,62
pietà_mic7.jpg,60,59,58,64,58,61,63,62,0,58,62,59,60,64,59
pietà_mic1.jpg,59,60,62,61,60,62,58,59,58,0,63,59,61,61,59
pietà_mic14.jpg,61,61,59,60,60,57,61,62,62,63,0,63,62,60,62
pietà_mic8.jpg,60,60,61,60,60,62,61,62,59,59,63,0,62,62,60
pietà_mic9.jpg,59,57,60,60,61,57,62,60,60,61,62,62,0,59,59
pietà_mic0.jpg,62,61,62,59,60,59,58,58,64,61,60,62,59,0,56
pietà_mic4.jpg,60,61,61,61,61,59,57,62,59,59,62,60,59,56,0
Type,Final-R,Final-R,Final-R,Final-R,Final-R,Final-R,Final-R,Final-R,Final-R,Final-R,Final-R,Final-R,Final-R,Final-R,Final-R
pietà_mic12.jpg,0,27,28,30,31,29,29,27,30,25,27,31,30,29,30
pietà_mic11.jpg,27,0,29,31,30,26,28,26,29,30,26,28,31,32,31
pietà_mic13.jpg,28,29,0,28,27,29,31,31,30,29,27,25,30,31,26
pietà_mic10.jpg,30,31,28,0,29,29,31,31,28,29,27,29,24,29,26
pietà_mic2.jpg,31,30,27,29,0,32,30,30,25,30,28,30,29,30,31
pietà_mic6.jpg,29,26,29,29,32,0,30,30,29,30,30,26,29,30,31
pietà_mic3.jpg,29,28,31,31,30,30,0,26,31,30,30,30,29,30,27
pietà_mic5.jpg,27,26,31,31,30,30,26,0,31,30,30,32,31,30,29
pietà_mic7.jpg,30,29,30,28,25,29,31,31,0,29,25,27,26,23,30
pietà_mic1.jpg,25,30,29,29,30,30,30,30,29,0,26,32,29,30,31
pietà_mic14.jpg,27,26,27,27,28,30,30,30,25,26,0,28,27,22,29
pietà_mic8.jpg,31,28,25,29,30,26,30,32,27,32,28,0,29,30,29
pietà_mic9.jpg,30,31,30,24,29,29,29,31,26,29,27,29,0,27,28
pietà_mic0.jpg,29,32,31,29,30,30,30,30,23,30,22,30,27,0,29
pietà_mic4.jpg,30,31,26,26,31,31,27,29,30,31,29,29,28,29,0
