,duomo_milano2.jpg,duomo_milano10.jpg,duomo_milano9.jpg,duomo_milano6.jpg,duomo_milano7.jpg,duomo_milano8.jpg,duomo_milano4.jpg,duomo_milano13.jpg,duomo_milano3.jpg,duomo_milano12.jpg,duomo_milano5.jpg,duomo_milano1.jpg,duomo_milano14.jpg,duomo_milano11.jpg,duomo_milano0.jpg
Type,Meta,Meta,Meta,Meta,Meta,Meta,Meta,Meta,Meta,Meta,Meta,Meta,Meta,Meta,Meta
duomo_milano2.jpg,0,5,5,6,6,4,6,3,4,4,6,5,5,5,5
duomo_milano10.jpg,5,0,3,4,4,2,5,4,7,3,6,5,6,5,5
duomo_milano9.jpg,5,3,0,5,6,4,7,4,6,6,4,7,4,7,6
duomo_milano6.jpg,6,4,5,0,6,4,7,4,6,6,5,7,6,6,5
duomo_milano7.jpg,6,4,6,6,0,3,5,5,6,4,7,5,7,4,6
duomo_milano8.jpg,4,2,4,4,3,0,5,2,6,3,7,5,7,4,6
duomo_milano4.jpg,6,5,7,7,5,5,0,6,6,3,7,3,7,5,6
duomo_milano13.jpg,3,4,4,4,5,2,6,0,5,3,6,6,5,4,7
duomo_milano3.jpg,4,7,6,6,6,6,6,5,0,5,7,6,6,4,6
duomo_milano12.jpg,4,3,6,6,4,3,3,3,5,0,7,4,6,3,6
duomo_milano5.jpg,6,6,4,5,7,7,7,6,7,7,0,5,2,6,5
duomo_milano1.jpg,5,5,7,7,5,5,3,6,6,4,5,0,5,4,5
duomo_milano14.jpg,5,6,4,6,7,7,7,5,6,6,2,5,0,5,4
duomo_milano11.jpg,5,5,7,6,4,4,5,4,4,3,6,4,5,0,6
duomo_milano0.jpg,5,5,6,5,6,6,6,7,6,6,5,5,4,6,0
Type,R-Meta,R-Meta,R-Meta,R-Meta,R-Meta,R-Meta,R-Meta,R-Meta,R-Meta,R-Meta,R-Meta,R-Meta,R-Meta,R-Meta,R-Meta
duomo_milano2.jpg,0,1,1,0,3,1,2,1,2,2,2,3,3,3,3
duomo_milano10.jpg,1,0,2,1,2,0,1,2,3,1,3,2,4,2,2
duomo_milano9.jpg,1,2,0,1,4,2,3,0,3,3,1,4,2,4,4
duomo_milano6.jpg,0,1,1,0,3,1,2,1,2,2,2,3,3,3,3
duomo_milano7.jpg,3,2,4,3,0,2,1,4,3,1,3,2,4,2,2
duomo_milano8.jpg,1,0,2,1,2,0,1,2,3,1,3,2,4,2,2
duomo_milano4.jpg,2,1,3,2,1,1,0,3,2,0,2,1,3,1,1
duomo_milano13.jpg,1,2,0,1,4,2,3,0,3,3,1,4,2,4,4
duomo_milano3.jpg,2,3,3,2,3,3,2,3,0,2,2,3,3,1,3
duomo_milano12.jpg,2,1,3,2,1,1,0,3,2,0,2,1,3,1,1
duomo_milano5.jpg,2,3,1,2,3,3,2,1,2,2,0,3,1,3,3
duomo_milano1.jpg,3,2,4,3,2,2,1,4,3,1,3,0,4,2,2
duomo_milano14.jpg,3,4,2,3,4,4,3,2,3,3,1,4,0,4,2
duomo_milano11.jpg,3,2,4,3,2,2,1,4,1,1,3,2,4,0,2
duomo_milano0.jpg,3,2,4,3,2,2,1,4,3,1,3,2,2,2,0
Type,Content,Content,Content,Content,Content,Content,Content,Content,Content,Content,Content,Content,Content,Content,Content
duomo_milano2.jpg,0,13,11,13,11,13,11,13,13,11,13,13,12,13,13
duomo_milano10.jpg,13,0,13,13,12,13,13,11,13,12,13,12,13,11,13
duomo_milano9.jpg,11,13,0,13,12,12,13,13,13,11,12,12,11,13,13
duomo_milano6.jpg,13,13,13,0,13,13,12,13,12,13,12,13,12,11,12
duomo_milano7.jpg,11,12,12,13,0,13,13,13,12,13,12,13,13,12,13
duomo_milano8.jpg,13,13,12,13,13,0,12,13,13,11,13,13,11,13,13
duomo_milano4.jpg,11,13,13,12,13,12,0,12,12,13,13,12,11,13,13
duomo_milano13.jpg,13,11,13,13,13,13,12,0,12,12,13,11,12,12,13
duomo_milano3.jpg,13,13,13,12,12,13,12,12,0,13,11,12,13,13,13
duomo_milano12.jpg,11,12,11,13,13,11,13,12,13,0,12,13,11,13,13
duomo_milano5.jpg,13,13,12,12,12,13,13,13,11,12,0,12,12,13,12
duomo_milano1.jpg,13,12,12,13,13,13,12,11,12,13,12,0,12,13,13
duomo_milano14.jpg,12,13,11,12,13,11,11,12,13,11,12,12,0,12,13
duomo_milano11.jpg,13,11,13,11,12,13,13,12,13,13,13,13,12,0,13
duomo_milano0.jpg,13,13,13,12,13,13,13,13,13,13,12,13,13,13,0
Type,R-Content,R-Content,R-Content,R-Content,R-Content,R-Content,R-Content,R-Content,R-Content,R-Content,R-Content,R-Content,R-Content,R-Content,R-Content
duomo_milano2.jpg,0,6,4,6,2,8,4,4,7,5,5,7,7,3,7
duomo_milano10.jpg,6,0,6,6,6,8,6,8,5,7,5,3,7,5,5
duomo_milano9.jpg,4,6,0,6,4,6,6,6,7,3,5,7,5,5,3
duomo_milano6.jpg,6,6,6,0,6,6,6,4,5,5,5,3,3,3,7
duomo_milano7.jpg,2,6,4,6,0,8,6,6,7,5,5,7,7,3,7
duomo_milano8.jpg,8,8,6,6,8,0,8,4,5,5,5,5,3,7,3
duomo_milano4.jpg,4,6,6,6,6,8,0,6,3,7,7,5,7,7,7
duomo_milano13.jpg,4,8,6,4,6,4,6,0,5,5,3,5,5,5,7
duomo_milano3.jpg,7,5,7,5,7,5,3,5,0,6,4,4,6,6,6
duomo_milano12.jpg,5,7,3,5,5,5,7,5,6,0,4,6,4,4,4
duomo_milano5.jpg,5,5,5,5,5,5,7,3,4,4,0,4,6,4,6
duomo_milano1.jpg,7,3,7,3,7,5,5,5,4,6,4,0,4,6,6
duomo_milano14.jpg,7,7,5,3,7,3,7,5,6,4,6,4,0,4,4
duomo_milano11.jpg,3,5,5,3,3,7,7,5,6,4,4,6,4,0,6
duomo_milano0.jpg,7,5,3,7,7,3,7,7,6,4,6,6,4,6,0
Type,Final-R,Final-R,Final-R,Final-R,Final-R,Final-R,Final-R,Final-R,Final-R,Final-R,Final-R,Final-R,Final-R,Final-R,Final-R
duomo_milano2.jpg,0,6,4,6,2,8,4,4,7,5,5,7,7,3,7
duomo_milano10.jpg,6,0,6,6,6,8,6,8,5,7,5,3,7,5,5
duomo_milano9.jpg,4,6,0,6,4,6,6,6,7,3,5,7,5,5,3
duomo_milano6.jpg,6,6,6,0,6,6,6,4,5,5,5,3,3,3,7
duomo_milano7.jpg,2,6,4,6,0,8,6,6,7,5,5,7,7,3,7
duomo_milano8.jpg,8,8,6,6,8,0,8,4,5,5,5,5,3,7,3
duomo_milano4.jpg,4,6,6,6,6,8,0,6,3,7,7,5,7,7,7
duomo_milano13.jpg,4,8,6,4,6,4,6,0,5,5,3,5,5,5,7
duomo_milano3.jpg,7,5,7,5,7,5,3,5,0,6,4,4,6,6,6
duomo_milano12.jpg,5,7,3,5,5,5,7,5,6,0,4,6,4,4,4
duomo_milano5.jpg,5,5,5,5,5,5,7,3,4,4,0,4,6,4,6
duomo_milano1.jpg,7,3,7,3,7,5,5,5,4,6,4,0,4,6,6
duomo_milano14.jpg,7,7,5,3,7,3,7,5,6,4,6,4,0,4,4
duomo_milano11.jpg,3,5,5,3,3,7,7,5,6,4,4,6,4,0,6
duomo_milano0.jpg,7,5,3,7,7,3,7,7,6,4,6,6,4,6,0
