,monalisa14.jpg,monalisa12.jpg,monalisa2.jpg,monalisa5.jpg,monalisa7.jpg,monalisa13.jpg,monalisa8.jpg,monalisa10.jpg,monalisa11.jpg,monalisa3.jpg,monalisa0.jpg,monalisa9.jpg,monalisa4.jpg,monalisa6.jpg,monalisa1.jpg
Type,SHA256,SHA256,SHA256,SHA256,SHA256,SHA256,SHA256,SHA256,SHA256,SHA256,SHA256,SHA256,SHA256,SHA256,SHA256
monalisa14.jpg,0,56,56,61,60,61,62,62,63,62,60,56,58,56,63
monalisa12.jpg,56,0,61,58,63,61,60,61,59,59,59,62,57,58,63
monalisa2.jpg,56,61,0,63,61,62,59,59,62,62,61,61,58,59,63
monalisa5.jpg,61,58,63,0,59,59,61,60,59,59,60,61,62,60,61
monalisa7.jpg,60,63,61,59,0,60,62,58,58,59,59,62,59,63,60
monalisa13.jpg,61,61,62,59,60,0,62,59,59,61,61,63,62,59,64
monalisa8.jpg,62,60,59,61,62,62,0,60,63,60,57,60,59,64,64
monalisa10.jpg,62,61,59,60,58,59,60,0,61,61,62,61,56,61,59
monalisa11.jpg,63,59,62,59,58,59,63,61,0,63,59,62,58,61,58
monalisa3.jpg,62,59,62,59,59,61,60,61,63,0,60,60,61,63,61
monalisa0.jpg,60,59,61,60,59,61,57,62,59,60,0,59,57,62,58
monalisa9.jpg,56,62,61,61,62,63,60,61,62,60,59,0,58,60,58
monalisa4.jpg,58,57,58,62,59,62,59,56,58,61,57,58,0,62,58
monalisa6.jpg,56,58,59,60,63,59,64,61,61,63,62,60,62,0,59
monalisa1.jpg,63,63,63,61,60,64,64,59,58,61,58,58,58,59,0
Type,Final-R,Final-R,Final-R,Final-R,Final-R,Final-R,Final-R,Final-R,Final-R,Final-R,Final-R,Final-R,Final-R,Final-R,Final-R
monalisa14.jpg,0,29,29,29,31,31,28,31,31,29,31,29,31,29,31
monalisa12.jpg,29,0,30,28,30,30,27,30,32,28,32,28,30,28,30
monalisa2.jpg,29,30,0,28,28,30,29,32,30,28,30,30,28,32,32
monalisa5.jpg,29,28,28,0,30,32,31,28,30,30,32,26,32,28,26
monalisa7.jpg,31,30,28,30,0,32,29,30,32,30,28,30,26,30,30
monalisa13.jpg,31,30,30,32,32,0,29,32,30,30,28,32,30,30,32
monalisa8.jpg,28,27,29,31,29,29,0,27,29,27,31,29,27,29,31
monalisa10.jpg,31,30,32,28,30,32,27,0,30,30,32,32,32,32,28
monalisa11.jpg,31,32,30,30,32,30,29,30,0,30,28,30,30,32,32
monalisa3.jpg,29,28,28,30,30,30,27,30,30,0,30,30,30,28,26
monalisa0.jpg,31,32,30,32,28,28,31,32,28,30,0,26,32,28,30
monalisa9.jpg,29,28,30,26,30,32,29,32,30,30,26,0,30,30,26
monalisa4.jpg,31,30,28,32,26,30,27,32,30,30,32,30,0,32,28
monalisa6.jpg,29,28,32,28,30,30,29,32,32,28,28,30,32,0,30
monalisa1.jpg,31,30,32,26,30,32,31,28,32,26,30,26,28,30,0
