,hamburger2.jpg,hamburger0.jpg,hamburger11.jpg,hamburger14.jpg,hamburger1.jpg,hamburger10.jpg,hamburger9.jpg,hamburger8.jpg,hamburger6.jpg,hamburger3.jpg,hamburger5.jpg,hamburger4.jpg,hamburger13.jpg,hamburger7.jpg,hamburger12.jpg
Type,Meta,Meta,Meta,Meta,Meta,Meta,Meta,Meta,Meta,Meta,Meta,Meta,Meta,Meta,Meta
hamburger2.jpg,0,3,2,4,5,5,4,4,5,4,4,3,1,4,5
hamburger0.jpg,3,0,3,4,3,4,4,6,3,4,5,3,3,4,4
hamburger11.jpg,2,3,0,4,5,5,5,5,5,5,5,4,2,5,5
hamburger14.jpg,4,4,4,0,6,4,5,6,5,5,2,3,4,5,3
hamburger1.jpg,5,3,5,6,0,4,4,4,3,4,5,5,5,4,4
hamburger10.jpg,5,4,5,4,4,0,3,5,1,2,4,4,5,3,3
hamburger9.jpg,4,4,5,5,4,3,0,3,3,3,3,2,5,2,4
hamburger8.jpg,4,6,5,6,4,5,3,0,5,5,4,4,5,3,5
hamburger6.jpg,5,3,5,5,3,1,3,5,0,2,4,4,5,3,2
hamburger3.jpg,4,4,5,5,4,2,3,5,2,0,4,4,4,3,3
hamburger5.jpg,4,5,5,2,5,4,3,4,4,4,0,3,5,3,2
hamburger4.jpg,3,3,4,3,5,4,2,4,4,4,3,0,4,3,5
hamburger13.jpg,1,3,2,4,5,5,5,5,5,4,5,4,0,5,5
hamburger7.jpg,4,4,5,5,4,3,2,3,3,3,3,3,5,0,4
hamburger12.jpg,5,4,5,3,4,3,4,5,2,3,2,5,5,4,0
Type,R-Meta,R-Meta,R-Meta,R-Meta,R-Meta,R-Meta,R-Meta,R-Meta,R-Meta,R-Meta,R-Meta,R-Meta,R-Meta,R-Meta,R-Meta
hamburger2.jpg,0,1,0,3,1,1,2,2,1,1,3,2,0,2,3
hamburger0.jpg,1,0,1,2,0,0,1,3,0,0,2,1,1,1,2
hamburger11.jpg,0,1,0,3,1,1,2,2,1,1,3,2,0,2,3
hamburger14.jpg,3,2,3,0,2,2,3,3,2,2,0,1,3,3,0
hamburger1.jpg,1,0,1,2,0,0,1,3,0,0,2,1,1,1,2
hamburger10.jpg,1,0,1,2,0,0,1,3,0,0,2,1,1,1,2
hamburger9.jpg,2,1,2,3,1,1,0,4,1,1,3,2,2,2,3
hamburger8.jpg,2,3,2,3,3,3,4,0,3,3,3,4,2,2,3
hamburger6.jpg,1,0,1,2,0,0,1,3,0,0,2,1,1,1,2
hamburger3.jpg,1,0,1,2,0,0,1,3,0,0,2,1,1,1,2
hamburger5.jpg,3,2,3,0,2,2,3,3,2,2,0,1,3,3,0
hamburger4.jpg,2,1,2,1,1,1,2,4,1,1,1,0,2,2,1
hamburger13.jpg,0,1,0,3,1,1,2,2,1,1,3,2,0,2,3
hamburger7.jpg,2,1,2,3,1,1,2,2,1,1,3,2,2,0,3
hamburger12.jpg,3,2,3,0,2,2,3,3,2,2,0,1,3,3,0
Type,Content,Content,Content,Content,Content,Content,Content,Content,Content,Content,Content,Content,Content,Content,Content
hamburger2.jpg,0,13,13,12,13,13,12,13,13,12,12,13,10,12,13
hamburger0.jpg,13,0,13,13,13,13,13,12,13,11,13,13,13,13,11
hamburger11.jpg,13,13,0,13,12,13,13,13,13,12,12,13,12,13,12
hamburger14.jpg,12,13,13,0,13,13,12,13,13,13,13,13,13,13,13
hamburger1.jpg,13,13,12,13,0,13,13,13,12,12,11,13,13,12,13
hamburger10.jpg,13,13,13,13,13,0,13,13,10,13,13,12,13,11,13
hamburger9.jpg,12,13,13,12,13,13,0,13,13,13,13,13,13,12,11
hamburger8.jpg,13,12,13,13,13,13,13,0,12,13,13,13,13,13,13
hamburger6.jpg,13,13,13,13,12,10,13,12,0,12,12,13,13,12,12
hamburger3.jpg,12,11,12,13,12,13,13,13,12,0,11,13,12,13,13
hamburger5.jpg,12,13,12,13,11,13,13,13,12,11,0,13,13,10,13
hamburger4.jpg,13,13,13,13,13,12,13,13,13,13,13,0,13,13,13
hamburger13.jpg,10,13,12,13,13,13,13,13,13,12,13,13,0,12,13
hamburger7.jpg,12,13,13,13,12,11,12,13,12,13,10,13,12,0,13
hamburger12.jpg,13,11,12,13,13,13,11,13,12,13,13,13,13,13,0
Type,R-Content,R-Content,R-Content,R-Content,R-Content,R-Content,R-Content,R-Content,R-Content,R-Content,R-Content,R-Content,R-Content,R-Content,R-Content
hamburger2.jpg,0,5,4,6,5,2,3,6,2,4,6,3,2,4,2
hamburger0.jpg,5,0,5,3,4,3,4,3,5,3,3,2,3,5,5
hamburger11.jpg,4,5,0,4,3,4,5,6,4,4,2,5,6,0,4
hamburger14.jpg,6,3,4,0,5,4,3,2,4,4,2,5,4,4,4
hamburger1.jpg,5,4,3,5,0,3,8,5,7,1,3,2,5,3,7
hamburger10.jpg,2,3,4,4,3,0,5,6,4,2,4,1,2,4,4
hamburger9.jpg,3,4,5,3,8,5,0,3,1,7,5,6,3,5,1
hamburger8.jpg,6,3,6,2,5,6,3,0,4,4,4,5,4,6,4
hamburger6.jpg,2,5,4,4,7,4,1,4,0,6,6,5,4,4,0
hamburger3.jpg,4,3,4,4,1,2,7,4,6,0,4,1,4,4,6
hamburger5.jpg,6,3,2,2,3,4,5,4,6,4,0,5,4,2,6
hamburger4.jpg,3,2,5,5,2,1,6,5,5,1,5,0,3,5,5
hamburger13.jpg,2,3,6,4,5,2,3,4,4,4,4,3,0,6,4
hamburger7.jpg,4,5,0,4,3,4,5,6,4,4,2,5,6,0,4
hamburger12.jpg,2,5,4,4,7,4,1,4,0,6,6,5,4,4,0
Type,Final-R,Final-R,Final-R,Final-R,Final-R,Final-R,Final-R,Final-R,Final-R,Final-R,Final-R,Final-R,Final-R,Final-R,Final-R
hamburger2.jpg,0,3,2,5,3,0,2,3,1,2,6,1,1,2,2
hamburger0.jpg,3,0,5,2,4,3,1,2,2,3,3,2,2,3,1
hamburger11.jpg,2,5,0,5,1,2,4,5,3,2,4,3,3,2,4
hamburger14.jpg,5,2,5,0,4,5,3,2,4,3,1,4,4,5,3
hamburger1.jpg,3,4,1,4,0,3,5,4,4,1,3,2,4,3,3
hamburger10.jpg,0,3,2,5,3,0,2,3,1,2,6,1,1,2,2
hamburger9.jpg,2,1,4,3,5,2,0,3,1,4,4,3,1,2,2
hamburger8.jpg,3,2,5,2,4,3,3,0,4,3,3,2,2,5,3
hamburger6.jpg,1,2,3,4,4,1,1,4,0,3,5,2,2,1,1
hamburger3.jpg,2,3,2,3,1,2,4,3,3,0,4,1,3,4,2
hamburger5.jpg,6,3,4,1,3,6,4,3,5,4,0,5,5,4,4
hamburger4.jpg,1,2,3,4,2,1,3,2,2,1,5,0,2,3,1
hamburger13.jpg,1,2,3,4,4,1,1,2,2,3,5,2,0,3,3
hamburger7.jpg,2,3,2,5,3,2,2,5,1,4,4,3,3,0,2
hamburger12.jpg,2,1,4,3,3,2,2,3,1,2,4,1,3,2,0
