,reggia_caserta2.jpg,reggia_caserta9.jpg,reggia_caserta5.jpg,reggia_caserta1.jpg,reggia_caserta6.jpg,reggia_caserta13.jpg,reggia_caserta12.jpg,reggia_caserta0.jpg,reggia_caserta8.jpg,reggia_caserta14.jpg,reggia_caserta10.jpg,reggia_caserta7.jpg,reggia_caserta3.jpg,reggia_caserta4.jpg,reggia_caserta11.jpg
Type,Meta,Meta,Meta,Meta,Meta,Meta,Meta,Meta,Meta,Meta,Meta,Meta,Meta,Meta,Meta
reggia_caserta2.jpg,0,3,4,5,2,4,6,3,6,5,5,5,3,4,5
reggia_caserta9.jpg,3,0,2,3,2,3,3,4,5,4,5,4,4,1,3
reggia_caserta5.jpg,4,2,0,3,4,3,4,4,5,6,5,5,4,3,4
reggia_caserta1.jpg,5,3,3,0,4,5,4,5,3,4,4,3,5,3,2
reggia_caserta6.jpg,2,2,4,4,0,4,5,3,4,4,6,3,2,3,4
reggia_caserta13.jpg,4,3,3,5,4,0,5,5,6,5,5,5,5,4,4
reggia_caserta12.jpg,6,3,4,4,5,5,0,5,4,3,3,5,5,2,4
reggia_caserta0.jpg,3,4,4,5,3,5,5,0,6,4,5,5,1,3,5
reggia_caserta8.jpg,6,5,5,3,4,6,4,6,0,4,5,4,5,5,5
reggia_caserta14.jpg,5,4,6,4,4,5,3,4,4,0,3,4,4,3,4
reggia_caserta10.jpg,5,5,5,4,6,5,3,5,5,3,0,5,5,4,3
reggia_caserta7.jpg,5,4,5,3,3,5,5,5,4,4,5,0,4,4,3
reggia_caserta3.jpg,3,4,4,5,2,5,5,1,5,4,5,4,0,3,5
reggia_caserta4.jpg,4,1,3,3,3,4,2,3,5,3,4,4,3,0,3
reggia_caserta11.jpg,5,3,4,2,4,4,4,5,5,4,3,3,5,3,0
Type,Content,Content,Content,Content,Content,Content,Content,Content,Content,Content,Content,Content,Content,Content,Content
reggia_caserta2.jpg,0,13,12,13,13,13,13,13,10,12,11,13,13,11,12
reggia_caserta9.jpg,13,0,12,13,12,11,12,11,11,12,12,13,12,12,12
reggia_caserta5.jpg,12,12,0,12,12,13,13,13,12,12,13,13,11,13,13
reggia_caserta1.jpg,13,13,12,0,11,12,13,12,12,11,13,13,11,13,11
reggia_caserta6.jpg,13,12,12,11,0,12,12,12,13,10,12,13,13,12,12
reggia_caserta13.jpg,13,11,13,12,12,0,12,10,13,12,12,13,13,12,13
reggia_caserta12.jpg,13,12,13,13,12,12,0,11,13,10,13,9,13,13,12
reggia_caserta0.jpg,13,11,13,12,12,10,11,0,11,12,12,13,12,12,13
reggia_caserta8.jpg,10,11,12,12,13,13,13,11,0,12,11,13,13,11,13
reggia_caserta14.jpg,12,12,12,11,10,12,10,12,12,0,13,11,13,13,13
reggia_caserta10.jpg,11,12,13,13,12,12,13,12,11,13,0,13,13,0,13
reggia_caserta7.jpg,13,13,13,13,13,13,9,13,13,11,13,0,13,13,12
reggia_caserta3.jpg,13,12,11,11,13,13,13,12,13,13,13,13,0,13,13
reggia_caserta4.jpg,11,12,13,13,12,12,13,12,11,13,0,13,13,0,13
reggia_caserta11.jpg,12,12,13,11,12,13,12,13,13,13,13,12,13,13,0
Type,Final-R,Final-R,Final-R,Final-R,Final-R,Final-R,Final-R,Final-R,Final-R,Final-R,Final-R,Final-R,Final-R,Final-R,Final-R
reggia_caserta2.jpg,0,27,27,32,27,28,32,24,29,32,30,33,25,27,31
reggia_caserta9.jpg,27,0,24,29,26,25,29,27,28,31,27,32,28,22,26
reggia_caserta5.jpg,27,24,0,27,28,23,29,27,24,33,29,30,24,28,30
reggia_caserta1.jpg,32,29,27,0,27,30,26,26,23,26,30,25,27,27,25
reggia_caserta6.jpg,27,26,28,27,0,29,27,25,30,21,33,26,22,26,32
reggia_caserta13.jpg,28,25,23,30,29,0,32,24,31,32,30,33,29,29,31
reggia_caserta12.jpg,32,29,29,26,27,32,0,30,25,22,28,27,33,27,27
reggia_caserta0.jpg,24,27,27,26,25,24,30,0,29,26,32,31,23,27,31
reggia_caserta8.jpg,29,28,24,23,30,31,25,29,0,29,31,30,30,30,34
reggia_caserta14.jpg,32,31,33,26,21,32,22,26,29,0,30,27,31,29,33
reggia_caserta10.jpg,30,27,29,30,33,30,28,32,31,30,0,33,33,7,31
reggia_caserta7.jpg,33,32,30,25,26,33,27,31,30,27,33,0,30,30,26
reggia_caserta3.jpg,25,28,24,27,22,29,33,23,30,31,33,30,0,28,32
reggia_caserta4.jpg,27,22,28,27,26,29,27,27,30,29,7,30,28,0,30
reggia_caserta11.jpg,31,26,30,25,32,31,27,31,34,33,31,26,32,30,0
