,basilica_san_marco8.jpg,basilica_san_marco4.jpg,basilica_san_marco1.jpg,basilica_san_marco6.jpg,basilica_san_marco14.jpg,basilica_san_marco7.jpg,basilica_san_marco2.jpg,basilica_san_marco10.jpg,basilica_san_marco11.jpg,basilica_san_marco0.jpg,basilica_san_marco3.jpg,basilica_san_marco13.jpg,basilica_san_marco12.jpg,basilica_san_marco9.jpg,basilica_san_marco5.jpg
Type,SHA256,SHA256,SHA256,SHA256,SHA256,SHA256,SHA256,SHA256,SHA256,SHA256,SHA256,SHA256,SHA256,SHA256,SHA256
basilica_san_marco8.jpg,0,61,63,61,57,60,62,57,60,61,60,60,60,60,59
basilica_san_marco4.jpg,61,0,62,60,60,60,64,59,57,63,56,59,57,59,60
basilica_san_marco1.jpg,63,62,0,60,62,60,64,60,58,63,59,62,62,58,60
basilica_san_marco6.jpg,61,60,60,0,60,57,62,59,61,58,57,62,63,61,62
basilica_san_marco14.jpg,57,60,62,60,0,59,58,61,58,55,60,62,62,58,62
basilica_san_marco7.jpg,60,60,60,57,59,0,57,61,61,58,60,62,59,64,61
basilica_san_marco2.jpg,62,64,64,62,58,57,0,61,63,58,60,60,61,62,58
basilica_san_marco10.jpg,57,59,60,59,61,61,61,0,60,61,60,59,59,61,60
basilica_san_marco11.jpg,60,57,58,61,58,61,63,60,0,59,63,60,63,57,60
basilica_san_marco0.jpg,61,63,63,58,55,58,58,61,59,0,61,59,60,62,59
basilica_san_marco3.jpg,60,56,59,57,60,60,60,60,63,61,0,60,56,62,60
basilica_san_marco13.jpg,60,59,62,62,62,62,60,59,60,59,60,0,61,63,58
basilica_san_marco12.jpg,60,57,62,63,62,59,61,59,63,60,56,61,0,59,59
basilica_san_marco9.jpg,60,59,58,61,58,64,62,61,57,62,62,63,59,0,59
basilica_san_marco5.jpg,59,60,60,62,62,61,58,60,60,59,60,58,59,59,0
Type,Final-R,Final-R,Final-R,Final-R,Final-R,Final-R,Final-R,Final-R,Final-R,Final-R,Final-R,Final-R,Final-R,Final-R,Final-R
basilica_san_marco8.jpg,0,16,15,15,12,16,14,13,13,14,16,14,11,16,10
basilica_san_marco4.jpg,16,0,15,15,16,16,16,15,15,16,16,16,15,12,16
basilica_san_marco1.jpg,15,15,0,12,15,13,15,12,10,11,9,15,12,13,15
basilica_san_marco6.jpg,15,15,12,0,15,15,15,14,14,15,15,15,14,15,15
basilica_san_marco14.jpg,12,16,15,15,0,16,14,15,15,14,16,14,15,16,12
basilica_san_marco7.jpg,16,16,13,15,16,0,14,13,11,16,16,14,15,16,16
basilica_san_marco2.jpg,14,16,15,15,14,14,0,15,13,14,14,16,11,14,14
basilica_san_marco10.jpg,13,15,12,14,15,13,15,0,14,13,15,15,12,15,15
basilica_san_marco11.jpg,13,15,10,14,15,11,13,14,0,11,15,13,10,15,15
basilica_san_marco0.jpg,14,16,11,15,14,16,14,13,11,0,14,14,11,16,14
basilica_san_marco3.jpg,16,16,9,15,16,16,14,15,15,14,0,16,15,14,16
basilica_san_marco13.jpg,14,16,15,15,14,14,16,15,13,14,16,0,15,16,14
basilica_san_marco12.jpg,11,15,12,14,15,15,11,12,10,11,15,15,0,15,13
basilica_san_marco9.jpg,16,12,13,15,16,16,14,15,15,16,14,16,15,0,16
basilica_san_marco5.jpg,10,16,15,15,12,16,14,15,15,14,16,14,13,16,0
