,ultima_cena3.jpg,ultima_cena13.jpg,ultima_cena11.jpg,ultima_cena2.jpg,ultima_cena6.jpg,ultima_cena0.jpg,ultima_cena10.jpg,ultima_cena7.jpg,ultima_cena4.jpg,ultima_cena1.jpg,ultima_cena14.jpg,ultima_cena8.jpg,ultima_cena9.jpg,ultima_cena12.jpg,ultima_cena5.jpg
Type,SHA256,SHA256,SHA256,SHA256,SHA256,SHA256,SHA256,SHA256,SHA256,SHA256,SHA256,SHA256,SHA256,SHA256,SHA256
ultima_cena3.jpg,0,59,63,58,61,60,60,59,60,60,58,62,59,60,59
ultima_cena13.jpg,59,0,60,58,61,60,62,61,62,57,63,62,61,61,63
ultima_cena11.jpg,63,60,0,60,58,60,64,61,57,59,60,61,58,58,60
ultima_cena2.jpg,58,58,60,0,62,60,59,62,62,60,60,63,61,58,61
ultima_cena6.jpg,61,61,58,62,0,63,63,61,60,61,61,60,62,61,58
ultima_cena0.jpg,60,60,60,60,63,0,63,60,58,61,64,60,63,62,62
ultima_cena10.jpg,60,62,64,59,63,63,0,63,60,60,61,63,62,60,59
ultima_cena7.jpg,59,61,61,62,61,60,63,0,61,62,58,60,57,63,60
ultima_cena4.jpg,60,62,57,62,60,58,60,61,0,62,60,57,63,60,63
ultima_cena1.jpg,60,57,59,60,61,61,60,62,62,0,61,61,52,58,61
ultima_cena14.jpg,58,63,60,60,61,64,61,58,60,61,0,63,61,59,59
ultima_cena8.jpg,62,62,61,63,60,60,63,60,57,61,63,0,56,58,60
ultima_cena9.jpg,59,61,58,61,62,63,62,57,63,52,61,56,0,59,58
ultima_cena12.jpg,60,61,58,58,61,62,60,63,60,58,59,58,59,0,58
ultima_cena5.jpg,59,63,60,61,58,62,59,60,63,61,59,60,58,58,0
Type,Final-R,Final-R,Final-R,Final-R,Final-R,Final-R,Final-R,Final-R,Final-R,Final-R,Final-R,Final-R,Final-R,Final-R,Final-R
ultima_cena3.jpg,0,7,7,7,7,6,4,5,6,7,7,7,6,5,7
ultima_cena13.jpg,7,0,8,8,8,7,7,8,5,8,6,8,7,8,8
ultima_cena11.jpg,7,8,0,8,6,7,5,6,7,6,8,8,7,8,6
ultima_cena2.jpg,7,8,8,0,8,7,7,8,7,8,6,6,7,8,8
ultima_cena6.jpg,7,8,6,8,0,7,7,8,7,6,8,8,7,8,8
ultima_cena0.jpg,6,7,7,7,7,0,6,7,6,7,7,5,6,7,7
ultima_cena10.jpg,4,7,5,7,7,6,0,7,6,7,7,7,6,7,7
ultima_cena7.jpg,5,8,6,8,8,7,7,0,7,4,8,8,7,6,8
ultima_cena4.jpg,6,5,7,7,7,6,6,7,0,7,7,7,6,5,7
ultima_cena1.jpg,7,8,6,8,6,7,7,4,7,0,8,8,7,8,8
ultima_cena14.jpg,7,6,8,6,8,7,7,8,7,8,0,8,7,8,8
ultima_cena8.jpg,7,8,8,6,8,5,7,8,7,8,8,0,7,8,8
ultima_cena9.jpg,6,7,7,7,7,6,6,7,6,7,7,7,0,5,7
ultima_cena12.jpg,5,8,8,8,8,7,7,6,5,8,8,8,5,0,8
ultima_cena5.jpg,7,8,6,8,8,7,7,8,7,8,8,8,7,8,0
