,obelisco_wash_dc9.jpg,obelisco_wash_dc10.jpg,obelisco_wash_dc12.jpg,obelisco_wash_dc13.jpg,obelisco_wash_dc8.jpg,obelisco_wash_dc6.jpg,obelisco_wash_dc11.jpg,obelisco_wash_dc5.jpg,obelisco_wash_dc0.jpg,obelisco_wash_dc14.jpg,obelisco_wash_dc4.jpg,obelisco_wash_dc3.jpg,obelisco_wash_dc2.jpg,obelisco_wash_dc1.jpg,obelisco_wash_dc7.jpg
Type,SHA256,SHA256,SHA256,SHA256,SHA256,SHA256,SHA256,SHA256,SHA256,SHA256,SHA256,SHA256,SHA256,SHA256,SHA256
obelisco_wash_dc9.jpg,0,62,63,60,58,64,61,62,61,58,63,58,63,60,60
obelisco_wash_dc10.jpg,62,0,59,58,61,61,59,58,61,58,62,60,59,63,63
obelisco_wash_dc12.jpg,63,59,0,59,61,59,61,60,62,61,56,61,58,53,60
obelisco_wash_dc13.jpg,60,58,59,0,64,62,61,63,61,61,60,60,61,59,58
obelisco_wash_dc8.jpg,58,61,61,64,0,60,62,62,60,61,58,59,58,60,59
obelisco_wash_dc6.jpg,64,61,59,62,60,0,63,62,60,61,58,59,58,63,62
obelisco_wash_dc11.jpg,61,59,61,61,62,63,0,56,62,61,64,61,59,61,58
obelisco_wash_dc5.jpg,62,58,60,63,62,62,56,0,59,60,59,58,60,60,61
obelisco_wash_dc0.jpg,61,61,62,61,60,60,62,59,0,59,55,62,62,62,62
obelisco_wash_dc14.jpg,58,58,61,61,61,61,61,60,59,0,61,64,61,58,63
obelisco_wash_dc4.jpg,63,62,56,60,58,58,64,59,55,61,0,62,55,61,57
obelisco_wash_dc3.jpg,58,60,61,60,59,59,61,58,62,64,62,0,60,62,62
obelisco_wash_dc2.jpg,63,59,58,61,58,58,59,60,62,61,55,60,0,60,60
obelisco_wash_dc1.jpg,60,63,53,59,60,63,61,60,62,58,61,62,60,0,60
obelisco_wash_dc7.jpg,60,63,60,58,59,62,58,61,62,63,57,62,60,60,0
Type,Final-R,Final-R,Final-R,Final-R,Final-R,Final-R,Final-R,Final-R,Final-R,Final-R,Final-R,Final-R,Final-R,Final-R,Final-R
obelisco_wash_dc9.jpg,0,27,32,32,30,29,32,29,28,26,30,26,25,30,31
obelisco_wash_dc10.jpg,27,0,27,31,31,30,31,30,25,27,31,25,26,31,26
obelisco_wash_dc12.jpg,32,27,0,32,32,29,28,31,30,32,26,28,29,30,23
obelisco_wash_dc13.jpg,32,31,32,0,32,31,32,31,32,30,32,26,31,30,31
obelisco_wash_dc8.jpg,30,31,32,32,0,29,30,29,30,32,28,30,29,32,31
obelisco_wash_dc6.jpg,29,30,29,31,29,0,31,30,31,31,27,27,30,27,30
obelisco_wash_dc11.jpg,32,31,28,32,30,31,0,31,30,30,30,28,31,30,27
obelisco_wash_dc5.jpg,29,30,31,31,29,30,31,0,29,29,31,27,24,27,30
obelisco_wash_dc0.jpg,28,25,30,32,30,31,30,29,0,32,32,30,29,30,27
obelisco_wash_dc14.jpg,26,27,32,30,32,31,30,29,32,0,28,28,29,30,31
obelisco_wash_dc4.jpg,30,31,26,32,28,27,30,31,32,28,0,30,27,32,31
obelisco_wash_dc3.jpg,26,25,28,26,30,27,28,27,30,28,30,0,25,28,27
obelisco_wash_dc2.jpg,25,26,29,31,29,30,31,24,29,29,27,25,0,29,30
obelisco_wash_dc1.jpg,30,31,30,30,32,27,30,27,30,30,32,28,29,0,27
obelisco_wash_dc7.jpg,31,26,23,31,31,30,27,30,27,31,31,27,30,27,0
