,ponte_vecchio4.jpg,ponte_vecchio8.jpg,ponte_vecchio2.jpg,ponte_vecchio6.jpg,ponte_vecchio0.jpg,ponte_vecchio13.jpg,ponte_vecchio11.jpg,ponte_vecchio14.jpg,ponte_vecchio1.jpg,ponte_vecchio3.jpg,ponte_vecchio7.jpg,ponte_vecchio9.jpg,ponte_vecchio12.jpg,ponte_vecchio10.jpg,ponte_vecchio5.jpg
Type,Meta,Meta,Meta,Meta,Meta,Meta,Meta,Meta,Meta,Meta,Meta,Meta,Meta,Meta,Meta
ponte_vecchio4.jpg,0,2,4,4,5,4,5,3,3,4,2,4,5,5,4
ponte_vecchio8.jpg,2,0,4,5,5,4,6,5,4,4,3,4,5,5,4
ponte_vecchio2.jpg,4,4,0,5,3,4,6,4,4,5,4,5,4,4,3
ponte_vecchio6.jpg,4,5,5,0,4,5,7,3,4,4,4,4,5,4,5
ponte_vecchio0.jpg,5,5,3,4,0,5,7,3,5,6,5,4,4,3,3
ponte_vecchio13.jpg,4,4,4,5,5,0,5,5,3,4,4,5,4,3,3
ponte_vecchio11.jpg,5,6,6,7,7,5,0,6,6,4,6,6,6,7,5
ponte_vecchio14.jpg,3,5,4,3,3,5,6,0,3,5,4,4,5,4,5
ponte_vecchio1.jpg,3,4,4,4,5,3,6,3,0,4,3,5,4,4,4
ponte_vecchio3.jpg,4,4,5,4,6,4,4,5,4,0,4,6,6,6,5
ponte_vecchio7.jpg,2,3,4,4,5,4,6,4,3,4,0,4,5,5,4
ponte_vecchio9.jpg,4,4,5,4,4,5,6,4,5,6,4,0,5,3,4
ponte_vecchio12.jpg,5,5,4,5,4,4,6,5,4,6,5,5,0,3,4
ponte_vecchio10.jpg,5,5,4,4,3,3,7,4,4,6,5,3,3,0,3
ponte_vecchio5.jpg,4,4,3,5,3,3,5,5,4,5,4,4,4,3,0
Type,R-Meta,R-Meta,R-Meta,R-Meta,R-Meta,R-Meta,R-Meta,R-Meta,R-Meta,R-Meta,R-Meta,R-Meta,R-Meta,R-Meta,R-Meta
ponte_vecchio4.jpg,0,2,3,2,5,0,3,2,2,4,2,5,5,3,1
ponte_vecchio8.jpg,2,0,3,2,5,2,5,4,2,2,2,5,5,5,3
ponte_vecchio2.jpg,3,3,0,3,6,3,6,5,3,5,3,6,6,6,4
ponte_vecchio6.jpg,2,2,3,0,3,2,5,2,2,4,2,3,5,3,3
ponte_vecchio0.jpg,5,5,6,3,0,5,8,3,5,7,5,2,6,4,4
ponte_vecchio13.jpg,0,2,3,2,5,0,3,2,2,4,2,5,5,3,1
ponte_vecchio11.jpg,3,5,6,5,8,3,0,5,5,3,5,6,6,4,4
ponte_vecchio14.jpg,2,4,5,2,3,2,5,0,4,6,4,3,5,1,3
ponte_vecchio1.jpg,2,2,3,2,5,2,5,4,0,4,2,5,5,5,3
ponte_vecchio3.jpg,4,2,5,4,7,4,3,6,4,0,4,5,7,5,5
ponte_vecchio7.jpg,2,2,3,2,5,2,5,4,2,4,0,5,5,5,3
ponte_vecchio9.jpg,5,5,6,3,2,5,6,3,5,5,5,0,6,2,4
ponte_vecchio12.jpg,5,5,6,5,6,5,6,5,5,7,5,6,0,6,6
ponte_vecchio10.jpg,3,5,6,3,4,3,4,1,5,5,5,2,6,0,4
ponte_vecchio5.jpg,1,3,4,3,4,1,4,3,3,5,3,4,6,4,0
Type,Content,Content,Content,Content,Content,Content,Content,Content,Content,Content,Content,Content,Content,Content,Content
ponte_vecchio4.jpg,0,13,11,12,12,11,13,12,12,13,12,10,12,12,13
ponte_vecchio8.jpg,13,0,13,12,11,13,13,11,12,13,13,10,13,12,12
ponte_vecchio2.jpg,11,13,0,11,12,11,13,12,12,11,13,11,13,12,13
ponte_vecchio6.jpg,12,12,11,0,10,11,12,13,12,12,12,12,13,11,13
ponte_vecchio0.jpg,12,11,12,10,0,11,13,12,12,12,13,11,13,12,12
ponte_vecchio13.jpg,11,13,11,11,11,0,12,13,10,13,11,12,12,11,13
ponte_vecchio11.jpg,13,13,13,12,13,12,0,13,12,11,13,12,13,12,13
ponte_vecchio14.jpg,12,11,12,13,12,13,13,0,12,13,13,11,13,12,12
ponte_vecchio1.jpg,12,12,12,12,12,10,12,12,0,13,11,12,13,13,12
ponte_vecchio3.jpg,13,13,11,12,12,13,11,13,13,0,13,12,13,12,13
ponte_vecchio7.jpg,12,13,13,12,13,11,13,13,11,13,0,13,11,12,13
ponte_vecchio9.jpg,10,10,11,12,11,12,12,11,12,12,13,0,13,13,12
ponte_vecchio12.jpg,12,13,13,13,13,12,13,13,13,13,11,13,0,12,11
ponte_vecchio10.jpg,12,12,12,11,12,11,12,12,13,12,12,13,12,0,13
ponte_vecchio5.jpg,13,12,13,13,12,13,13,12,12,13,13,12,11,13,0
Type,R-Content,R-Content,R-Content,R-Content,R-Content,R-Content,R-Content,R-Content,R-Content,R-Content,R-Content,R-Content,R-Content,R-Content,R-Content
ponte_vecchio4.jpg,0,11,6,11,9,9,8,9,6,9,8,6,9,10,9
ponte_vecchio8.jpg,11,0,9,10,10,12,13,6,11,10,11,9,10,9,12
ponte_vecchio2.jpg,6,9,0,7,11,9,8,9,10,9,10,8,11,10,9
ponte_vecchio6.jpg,11,10,7,0,6,8,9,10,11,12,7,11,12,7,10
ponte_vecchio0.jpg,9,10,11,6,0,12,9,10,9,10,9,7,10,9,10
ponte_vecchio13.jpg,9,12,9,8,12,0,9,10,5,14,7,11,10,9,10
ponte_vecchio11.jpg,8,13,8,9,9,9,0,11,8,13,10,8,11,10,13
ponte_vecchio14.jpg,9,6,9,10,10,10,11,0,9,10,9,7,6,11,8
ponte_vecchio1.jpg,6,11,10,11,9,5,8,9,0,11,8,8,9,10,7
ponte_vecchio3.jpg,9,10,9,12,10,14,13,10,11,0,11,9,10,13,10
ponte_vecchio7.jpg,8,11,10,7,9,7,10,9,8,11,0,8,9,4,9
ponte_vecchio9.jpg,6,9,8,11,7,11,8,7,8,9,8,0,7,10,7
ponte_vecchio12.jpg,9,10,11,12,10,10,11,6,9,10,9,7,0,11,10
ponte_vecchio10.jpg,10,9,10,7,9,9,10,11,10,13,4,10,11,0,11
ponte_vecchio5.jpg,9,12,9,10,10,10,13,8,7,10,9,7,10,11,0
Type,Final-R,Final-R,Final-R,Final-R,Final-R,Final-R,Final-R,Final-R,Final-R,Final-R,Final-R,Final-R,Final-R,Final-R,Final-R
ponte_vecchio4.jpg,0,11,6,11,9,9,8,9,6,9,8,6,9,10,9
ponte_vecchio8.jpg,11,0,9,10,10,12,13,6,11,10,11,9,10,9,12
ponte_vecchio2.jpg,6,9,0,7,11,9,8,9,10,9,10,8,11,10,9
ponte_vecchio6.jpg,11,10,7,0,6,8,9,10,11,12,7,11,12,7,10
ponte_vecchio0.jpg,9,10,11,6,0,12,9,10,9,10,9,7,10,9,10
ponte_vecchio13.jpg,9,12,9,8,12,0,9,10,5,14,7,11,10,9,10
ponte_vecchio11.jpg,8,13,8,9,9,9,0,11,8,13,10,8,11,10,13
ponte_vecchio14.jpg,9,6,9,10,10,10,11,0,9,10,9,7,6,11,8
ponte_vecchio1.jpg,6,11,10,11,9,5,8,9,0,11,8,8,9,10,7
ponte_vecchio3.jpg,9,10,9,12,10,14,13,10,11,0,11,9,10,13,10
ponte_vecchio7.jpg,8,11,10,7,9,7,10,9,8,11,0,8,9,4,9
ponte_vecchio9.jpg,6,9,8,11,7,11,8,7,8,9,8,0,7,10,7
ponte_vecchio12.jpg,9,10,11,12,10,10,11,6,9,10,9,7,0,11,10
ponte_vecchio10.jpg,10,9,10,7,9,9,10,11,10,13,4,10,11,0,11
ponte_vecchio5.jpg,9,12,9,10,10,10,13,8,7,10,9,7,10,11,0
