,statua_libertà14.jpg,statua_libertà13.jpg,statua_libertà7.jpg,statua_libertà2.jpg,statua_libertà10.jpg,statua_libertà0.jpg,statua_libertà5.jpg,statua_libertà6.jpg,statua_libertà11.jpg,statua_libertà8.jpg,statua_libertà9.jpg,statua_libertà1.jpg,statua_libertà12.jpg,statua_libertà4.jpg,statua_libertà3.jpg
Type,SHA256,SHA256,SHA256,SHA256,SHA256,SHA256,SHA256,SHA256,SHA256,SHA256,SHA256,SHA256,SHA256,SHA256,SHA256
statua_libertà14.jpg,0,59,62,63,58,60,61,60,59,61,59,60,60,59,62
statua_libertà13.jpg,59,0,62,61,59,57,59,62,53,60,56,57,58,61,61
statua_libertà7.jpg,62,62,0,58,57,60,59,55,60,64,62,57,63,62,56
statua_libertà2.jpg,63,61,58,0,58,59,61,61,61,61,60,59,64,61,57
statua_libertà10.jpg,58,59,57,58,0,62,61,60,62,59,62,58,62,61,61
statua_libertà0.jpg,60,57,60,59,62,0,62,59,58,61,60,61,57,63,57
statua_libertà5.jpg,61,59,59,61,61,62,0,58,59,61,62,62,59,57,60
statua_libertà6.jpg,60,62,55,61,60,59,58,0,59,63,61,60,59,59,59
statua_libertà11.jpg,59,53,60,61,62,58,59,59,0,62,57,58,61,61,64
statua_libertà8.jpg,61,60,64,61,59,61,61,63,62,0,56,58,60,59,62
statua_libertà9.jpg,59,56,62,60,62,60,62,61,57,56,0,61,62,61,60
statua_libertà1.jpg,60,57,57,59,58,61,62,60,58,58,61,0,61,62,62
statua_libertà12.jpg,60,58,63,64,62,57,59,59,61,60,62,61,0,59,61
statua_libertà4.jpg,59,61,62,61,61,63,57,59,61,59,61,62,59,0,60
statua_libertà3.jpg,62,61,56,57,61,57,60,59,64,62,60,62,61,60,0
Type,Final-R,Final-R,Final-R,Final-R,Final-R,Final-R,Final-R,Final-R,Final-R,Final-R,Final-R,Final-R,Final-R,Final-R,Final-R
statua_libertà14.jpg,0,2,5,6,7,3,5,4,1,5,2,4,5,7,4
statua_libertà13.jpg,2,0,5,4,5,3,3,6,3,3,4,6,3,5,4
statua_libertà7.jpg,5,5,0,3,4,2,4,1,4,6,5,3,4,4,5
statua_libertà2.jpg,6,4,3,0,3,3,3,4,5,3,6,2,3,3,6
statua_libertà10.jpg,7,5,4,3,0,4,4,5,8,2,5,5,4,0,3
statua_libertà0.jpg,3,3,2,3,4,0,4,3,4,4,3,3,4,4,5
statua_libertà5.jpg,5,3,4,3,4,4,0,5,4,4,5,5,0,4,3
statua_libertà6.jpg,4,6,1,4,5,3,5,0,3,7,4,2,5,5,4
statua_libertà11.jpg,1,3,4,5,8,4,4,3,0,6,3,3,4,8,5
statua_libertà8.jpg,5,3,6,3,2,4,4,7,6,0,3,5,4,2,5
statua_libertà9.jpg,2,4,5,6,5,3,5,4,3,3,0,4,5,5,4
statua_libertà1.jpg,4,6,3,2,5,3,5,2,3,5,4,0,5,5,6
statua_libertà12.jpg,5,3,4,3,4,4,0,5,4,4,5,5,0,4,3
statua_libertà4.jpg,7,5,4,3,0,4,4,5,8,2,5,5,4,0,3
statua_libertà3.jpg,4,4,5,6,3,5,3,4,5,5,4,6,3,3,0
