,lavorare_preferisco_mare7.jpg,lavorare_preferisco_mare6.jpg,lavorare_preferisco_mare4.jpg,lavorare_preferisco_mare1.jpg,lavorare_preferisco_mare11.jpg,lavorare_preferisco_mare10.jpg,lavorare_preferisco_mare9.jpg,lavorare_preferisco_mare13.jpg,lavorare_preferisco_mare12.jpg,lavorare_preferisco_mare3.jpg,lavorare_preferisco_mare5.jpg,lavorare_preferisco_mare8.jpg,lavorare_preferisco_mare0.jpg,lavorare_preferisco_mare2.jpg,lavorare_preferisco_mare14.jpg
Type,SHA256,SHA256,SHA256,SHA256,SHA256,SHA256,SHA256,SHA256,SHA256,SHA256,SHA256,SHA256,SHA256,SHA256,SHA256
lavorare_preferisco_mare7.jpg,0,63,59,57,59,61,60,62,59,60,59,59,59,62,56
lavorare_preferisco_mare6.jpg,63,0,59,61,63,59,60,61,58,62,57,61,57,62,61
lavorare_preferisco_mare4.jpg,59,59,0,57,60,60,63,60,60,58,60,57,63,62,62
lavorare_preferisco_mare1.jpg,57,61,57,0,60,59,61,61,60,58,59,61,61,61,59
lavorare_preferisco_mare11.jpg,59,63,60,60,0,61,60,60,59,61,60,61,59,63,61
lavorare_preferisco_mare10.jpg,61,59,60,59,61,0,59,62,58,60,59,59,60,63,60
lavorare_preferisco_mare9.jpg,60,60,63,61,60,59,0,61,61,62,60,61,60,62,64
lavorare_preferisco_mare13.jpg,62,61,60,61,60,62,61,0,60,61,61,62,57,58,58
lavorare_preferisco_mare12.jpg,59,58,60,60,59,58,61,60,0,62,57,57,58,61,61
lavorare_preferisco_mare3.jpg,60,62,58,58,61,60,62,61,62,0,59,58,61,60,60
lavorare_preferisco_mare5.jpg,59,57,60,59,60,59,60,61,57,59,0,60,59,63,59
lavorare_preferisco_mare8.jpg,59,61,57,61,61,59,61,62,57,58,60,0,61,59,60
lavorare_preferisco_mare0.jpg,59,57,63,61,59,60,60,57,58,61,59,61,0,57,60
lavorare_preferisco_mare2.jpg,62,62,62,61,63,63,62,58,61,60,63,59,57,0,57
lavorare_preferisco_mare14.jpg,56,61,62,59,61,60,64,58,61,60,59,60,60,57,0
Type,Final-R,Final-R,Final-R,Final-R,Final-R,Final-R,Final-R,Final-R,Final-R,Final-R,Final-R,Final-R,Final-R,Final-R,Final-R
lavorare_preferisco_mare7.jpg,0,13,12,11,10,10,13,13,11,12,12,14,11,12,9
lavorare_preferisco_mare6.jpg,13,0,11,10,11,13,12,12,6,13,9,13,14,15,6
lavorare_preferisco_mare4.jpg,12,11,0,11,8,12,13,9,11,12,14,12,11,14,9
lavorare_preferisco_mare1.jpg,11,10,11,0,11,13,10,10,12,9,11,11,8,9,12
lavorare_preferisco_mare11.jpg,10,11,8,11,0,10,11,11,7,14,12,12,11,12,9
lavorare_preferisco_mare10.jpg,10,13,12,13,10,0,11,13,11,12,10,14,13,10,11
lavorare_preferisco_mare9.jpg,13,12,13,10,11,11,0,16,8,11,9,13,14,13,12
lavorare_preferisco_mare13.jpg,13,12,9,10,11,13,16,0,12,11,13,9,10,11,12
lavorare_preferisco_mare12.jpg,11,6,11,12,7,11,8,12,0,11,9,11,14,11,8
lavorare_preferisco_mare3.jpg,12,13,12,9,14,12,11,11,11,0,10,10,9,10,11
lavorare_preferisco_mare5.jpg,12,9,14,11,12,10,9,13,9,10,0,14,11,8,9
lavorare_preferisco_mare8.jpg,14,13,12,11,12,14,13,9,11,10,14,0,9,12,11
lavorare_preferisco_mare0.jpg,11,14,11,8,11,13,14,10,14,9,11,9,0,9,12
lavorare_preferisco_mare2.jpg,12,15,14,9,12,10,13,11,11,10,8,12,9,0,13
lavorare_preferisco_mare14.jpg,9,6,9,12,9,11,12,12,8,11,9,11,12,13,0
