,arco_trionfo1.jpg,arco_trionfo12.jpg,arco_trionfo9.jpg,arco_trionfo8.jpg,arco_trionfo11.jpg,arco_trionfo3.jpg,arco_trionfo6.jpg,arco_trionfo13.jpg,arco_trionfo4.jpg,arco_trionfo10.jpg,arco_trionfo5.jpg,arco_trionfo2.jpg,arco_trionfo7.jpg,arco_trionfo14.jpg,arco_trionfo0.jpg
Type,Meta,Meta,Meta,Meta,Meta,Meta,Meta,Meta,Meta,Meta,Meta,Meta,Meta,Meta,Meta
arco_trionfo1.jpg,0,4,5,5,4,5,7,5,4,3,5,7,5,5,6
arco_trionfo12.jpg,4,0,5,4,5,4,6,6,4,3,5,7,6,5,7
arco_trionfo9.jpg,5,5,0,6,4,6,5,6,4,4,5,6,6,5,5
arco_trionfo8.jpg,5,4,6,0,5,3,4,6,4,4,4,6,5,5,6
arco_trionfo11.jpg,4,5,4,5,0,5,5,5,4,4,4,7,5,4,6
arco_trionfo3.jpg,5,4,6,3,5,0,5,5,4,4,4,7,6,5,5
arco_trionfo6.jpg,7,6,5,4,5,5,0,6,5,6,4,6,6,5,5
arco_trionfo13.jpg,5,6,6,6,5,5,6,0,6,6,6,7,6,6,7
arco_trionfo4.jpg,4,4,4,4,4,4,5,6,0,3,3,6,5,3,5
arco_trionfo10.jpg,3,3,4,4,4,4,6,6,3,0,4,7,4,4,6
arco_trionfo5.jpg,5,5,5,4,4,4,4,6,3,4,0,5,4,3,4
arco_trionfo2.jpg,7,7,6,6,7,7,6,7,6,7,5,0,7,5,4
arco_trionfo7.jpg,5,6,6,5,5,6,6,6,5,4,4,7,0,5,6
arco_trionfo14.jpg,5,5,5,5,4,5,5,6,3,4,3,5,5,0,4
arco_trionfo0.jpg,6,7,5,6,6,5,5,7,5,6,4,4,6,4,0
Type,R-Meta,R-Meta,R-Meta,R-Meta,R-Meta,R-Meta,R-Meta,R-Meta,R-Meta,R-Meta,R-Meta,R-Meta,R-Meta,R-Meta,R-Meta
arco_trionfo1.jpg,0,0,4,0,2,2,4,4,0,0,2,4,2,2,4
arco_trionfo12.jpg,0,0,4,0,2,2,4,4,0,0,2,4,2,2,4
arco_trionfo9.jpg,4,4,0,4,2,4,2,2,4,4,4,2,4,4,2
arco_trionfo8.jpg,0,0,4,0,2,2,4,4,0,0,2,4,2,2,4
arco_trionfo11.jpg,2,2,2,2,0,4,2,2,2,2,2,4,2,2,4
arco_trionfo3.jpg,2,2,4,2,4,0,4,2,2,2,4,4,4,4,4
arco_trionfo6.jpg,4,4,2,4,2,4,0,2,4,4,4,4,4,4,4
arco_trionfo13.jpg,4,4,2,4,2,2,2,0,4,4,4,4,4,4,4
arco_trionfo4.jpg,0,0,4,0,2,2,4,4,0,0,2,4,2,2,4
arco_trionfo10.jpg,0,0,4,0,2,2,4,4,0,0,2,4,2,2,4
arco_trionfo5.jpg,2,2,4,2,2,4,4,4,2,2,0,4,0,2,4
arco_trionfo2.jpg,4,4,2,4,4,4,4,4,4,4,4,0,4,2,0
arco_trionfo7.jpg,2,2,4,2,2,4,4,4,2,2,0,4,0,2,4
arco_trionfo14.jpg,2,2,4,2,2,4,4,4,2,2,2,2,2,0,2
arco_trionfo0.jpg,4,4,2,4,4,4,4,4,4,4,4,0,4,2,0
Type,Content,Content,Content,Content,Content,Content,Content,Content,Content,Content,Content,Content,Content,Content,Content
arco_trionfo1.jpg,0,13,13,13,13,13,12,13,13,13,13,12,12,13,13
arco_trionfo12.jpg,13,0,13,12,13,13,13,13,13,13,13,11,12,13,13
arco_trionfo9.jpg,13,13,0,12,13,13,11,13,12,13,11,10,13,13,12
arco_trionfo8.jpg,13,12,12,0,13,13,13,13,12,12,13,12,12,13,9
arco_trionfo11.jpg,13,13,13,13,0,13,12,10,13,13,13,12,12,12,12
arco_trionfo3.jpg,13,13,13,13,13,0,12,13,12,12,13,13,12,12,12
arco_trionfo6.jpg,12,13,11,13,12,12,0,11,13,12,12,12,11,13,13
arco_trionfo13.jpg,13,13,13,13,10,13,11,0,13,13,13,12,12,12,13
arco_trionfo4.jpg,13,13,12,12,13,12,13,13,0,11,13,13,13,13,12
arco_trionfo10.jpg,13,13,13,12,13,12,12,13,11,0,13,13,13,13,13
arco_trionfo5.jpg,13,13,11,13,13,13,12,13,13,13,0,11,13,13,13
arco_trionfo2.jpg,12,11,10,12,12,13,12,12,13,13,11,0,12,13,12
arco_trionfo7.jpg,12,12,13,12,12,12,11,12,13,13,13,12,0,13,13
arco_trionfo14.jpg,13,13,13,13,12,12,13,12,13,13,13,13,13,0,11
arco_trionfo0.jpg,13,13,12,9,12,12,13,13,12,13,13,12,13,11,0
Type,R-Content,R-Content,R-Content,R-Content,R-Content,R-Content,R-Content,R-Content,R-Content,R-Content,R-Content,R-Content,R-Content,R-Content,R-Content
arco_trionfo1.jpg,0,8,8,8,8,8,8,8,8,6,8,8,8,8,8
arco_trionfo12.jpg,8,0,8,6,6,8,8,8,8,8,8,8,8,8,8
arco_trionfo9.jpg,8,8,0,8,8,6,8,8,8,8,6,6,8,8,8
arco_trionfo8.jpg,8,6,8,0,8,8,8,8,8,6,8,6,8,8,8
arco_trionfo11.jpg,8,6,8,8,0,8,6,6,8,8,8,8,8,6,6
arco_trionfo3.jpg,8,8,6,8,8,0,8,8,8,6,8,8,8,8,8
arco_trionfo6.jpg,8,8,8,8,6,8,0,6,6,8,6,8,8,8,8
arco_trionfo13.jpg,8,8,8,8,6,8,6,0,6,8,8,8,8,8,8
arco_trionfo4.jpg,8,8,8,8,8,8,6,6,0,8,8,8,8,8,8
arco_trionfo10.jpg,6,8,8,6,8,6,8,8,8,0,8,8,8,8,8
arco_trionfo5.jpg,8,8,6,8,8,8,6,8,8,8,0,6,8,8,8
arco_trionfo2.jpg,8,8,6,6,8,8,8,8,8,8,6,0,8,8,8
arco_trionfo7.jpg,8,8,8,8,8,8,8,8,8,8,8,8,0,8,6
arco_trionfo14.jpg,8,8,8,8,6,8,8,8,8,8,8,8,8,0,6
arco_trionfo0.jpg,8,8,8,8,6,8,8,8,8,8,8,8,6,6,0
Type,Final-R,Final-R,Final-R,Final-R,Final-R,Final-R,Final-R,Final-R,Final-R,Final-R,Final-R,Final-R,Final-R,Final-R,Final-R
arco_trionfo1.jpg,0,7,10,7,8,10,10,10,8,6,10,12,10,10,12
arco_trionfo12.jpg,7,0,11,6,7,9,9,11,7,7,9,11,9,9,11
arco_trionfo9.jpg,10,11,0,11,10,10,10,10,12,10,10,8,12,12,10
arco_trionfo8.jpg,7,6,11,0,9,9,11,11,7,5,9,9,9,9,11
arco_trionfo11.jpg,8,7,10,9,0,12,8,8,10,8,10,12,10,8,10
arco_trionfo3.jpg,10,9,10,9,12,0,12,10,10,8,12,12,12,12,12
arco_trionfo6.jpg,10,9,10,11,8,12,0,8,10,10,10,10,12,10,10
arco_trionfo13.jpg,10,11,10,11,8,10,8,0,10,10,10,10,10,10,10
arco_trionfo4.jpg,8,7,12,7,10,10,10,10,0,8,8,12,8,10,12
arco_trionfo10.jpg,6,7,10,5,8,8,10,10,8,0,10,12,10,10,12
arco_trionfo5.jpg,10,9,10,9,10,12,10,10,8,10,0,10,8,10,12
arco_trionfo2.jpg,12,11,8,9,12,12,10,10,12,12,10,0,12,10,8
arco_trionfo7.jpg,10,9,12,9,10,12,12,10,8,10,8,12,0,10,10
arco_trionfo14.jpg,10,9,12,9,8,12,10,10,10,10,10,10,10,0,8
arco_trionfo0.jpg,12,11,10,11,10,12,10,10,12,12,12,8,10,8,0
