,basilica_santa_croce1.jpg,basilica_santa_croce7.jpg,basilica_santa_croce13.jpg,basilica_santa_croce12.jpg,basilica_santa_croce8.jpg,basilica_santa_croce11.jpg,basilica_santa_croce9.jpg,basilica_santa_croce4.jpg,basilica_santa_croce6.jpg,basilica_santa_croce5.jpg,basilica_santa_croce3.jpg,basilica_santa_croce2.jpg,basilica_santa_croce10.jpg,basilica_santa_croce0.jpg,basilica_santa_croce14.jpg
Type,Meta,Meta,Meta,Meta,Meta,Meta,Meta,Meta,Meta,Meta,Meta,Meta,Meta,Meta,Meta
basilica_santa_croce1.jpg,0,6,5,4,3,3,5,5,4,6,2,3,5,4,4
basilica_santa_croce7.jpg,6,0,4,6,4,6,2,3,6,5,4,5,5,5,6
basilica_santa_croce13.jpg,5,4,0,7,5,3,3,2,5,4,3,5,4,6,4
basilica_santa_croce12.jpg,4,6,7,0,5,5,7,6,5,5,6,5,5,5,3
basilica_santa_croce8.jpg,3,4,5,5,0,5,4,5,6,5,3,4,4,5,6
basilica_santa_croce11.jpg,3,6,3,5,5,0,5,4,5,5,5,5,3,6,2
basilica_santa_croce9.jpg,5,2,3,7,4,5,0,4,5,4,3,4,6,4,6
basilica_santa_croce4.jpg,5,3,2,6,5,4,4,0,5,5,3,4,4,6,4
basilica_santa_croce6.jpg,4,6,5,5,6,5,5,5,0,5,4,4,5,2,4
basilica_santa_croce5.jpg,6,5,4,5,5,5,4,5,5,0,4,5,4,5,5
basilica_santa_croce3.jpg,2,4,3,6,3,5,3,3,4,4,0,3,5,4,6
basilica_santa_croce2.jpg,3,5,5,5,4,5,4,4,4,5,3,0,7,4,6
basilica_santa_croce10.jpg,5,5,4,5,4,3,6,4,5,4,5,7,0,6,3
basilica_santa_croce0.jpg,4,5,6,5,5,6,4,6,2,5,4,4,6,0,5
basilica_santa_croce14.jpg,4,6,4,3,6,2,6,4,4,5,6,6,3,5,0
Type,R-Meta,R-Meta,R-Meta,R-Meta,R-Meta,R-Meta,R-Meta,R-Meta,R-Meta,R-Meta,R-Meta,R-Meta,R-Meta,R-Meta,R-Meta
basilica_santa_croce1.jpg,0,2,3,1,2,2,3,3,2,3,0,2,1,1,3
basilica_santa_croce7.jpg,2,0,3,1,0,4,1,3,2,3,2,2,3,1,3
basilica_santa_croce13.jpg,3,3,0,4,3,1,2,2,3,2,3,3,2,4,0
basilica_santa_croce12.jpg,1,1,4,0,1,3,2,4,1,2,1,3,2,0,4
basilica_santa_croce8.jpg,2,0,3,1,0,4,1,3,2,3,2,2,3,1,3
basilica_santa_croce11.jpg,2,4,1,3,4,0,3,3,2,1,2,4,1,3,1
basilica_santa_croce9.jpg,3,1,2,2,1,3,0,4,1,2,3,3,4,2,2
basilica_santa_croce4.jpg,3,3,2,4,3,3,4,0,5,4,3,1,2,4,2
basilica_santa_croce6.jpg,2,2,3,1,2,2,1,5,0,1,2,4,3,1,3
basilica_santa_croce5.jpg,3,3,2,2,3,1,2,4,1,0,3,5,2,2,2
basilica_santa_croce3.jpg,0,2,3,1,2,2,3,3,2,3,0,2,1,1,3
basilica_santa_croce2.jpg,2,2,3,3,2,4,3,1,4,5,2,0,3,3,3
basilica_santa_croce10.jpg,1,3,2,2,3,1,4,2,3,2,1,3,0,2,2
basilica_santa_croce0.jpg,1,1,4,0,1,3,2,4,1,2,1,3,2,0,4
basilica_santa_croce14.jpg,3,3,0,4,3,1,2,2,3,2,3,3,2,4,0
Type,Content,Content,Content,Content,Content,Content,Content,Content,Content,Content,Content,Content,Content,Content,Content
basilica_santa_croce1.jpg,0,13,12,13,13,13,11,13,11,12,13,11,13,12,13
basilica_santa_croce7.jpg,13,0,12,12,12,13,12,13,13,13,13,13,13,13,13
basilica_santa_croce13.jpg,12,12,0,13,13,13,13,13,12,12,13,12,13,11,13
basilica_santa_croce12.jpg,13,12,13,0,12,12,13,12,13,12,13,12,11,11,9
basilica_santa_croce8.jpg,13,12,13,12,0,13,12,13,13,12,13,13,12,13,13
basilica_santa_croce11.jpg,13,13,13,12,13,0,13,12,13,12,13,11,12,11,11
basilica_santa_croce9.jpg,11,12,13,13,12,13,0,11,9,12,12,13,13,12,13
basilica_santa_croce4.jpg,13,13,13,12,13,12,11,0,13,12,11,13,11,12,11
basilica_santa_croce6.jpg,11,13,12,13,13,13,9,13,0,11,12,13,13,13,11
basilica_santa_croce5.jpg,12,13,12,12,12,12,12,12,11,0,13,11,12,12,11
basilica_santa_croce3.jpg,13,13,13,13,13,13,12,11,12,13,0,13,12,13,13
basilica_santa_croce2.jpg,11,13,12,12,13,11,13,13,13,11,13,0,12,12,12
basilica_santa_croce10.jpg,13,13,13,11,12,12,13,11,13,12,12,12,0,11,10
basilica_santa_croce0.jpg,12,13,11,11,13,11,12,12,13,12,13,12,11,0,11
basilica_santa_croce14.jpg,13,13,13,9,13,11,13,11,11,11,13,12,10,11,0
Type,R-Content,R-Content,R-Content,R-Content,R-Content,R-Content,R-Content,R-Content,R-Content,R-Content,R-Content,R-Content,R-Content,R-Content,R-Content
basilica_santa_croce1.jpg,0,2,6,5,5,1,2,2,4,3,5,4,5,4,3
basilica_santa_croce7.jpg,2,0,4,5,5,3,4,0,2,3,3,2,5,4,5
basilica_santa_croce13.jpg,6,4,0,1,3,5,4,4,2,5,1,2,3,2,3
basilica_santa_croce12.jpg,5,5,1,0,2,4,3,5,3,6,2,3,4,1,2
basilica_santa_croce8.jpg,5,5,3,2,0,4,3,5,3,4,4,3,4,3,4
basilica_santa_croce11.jpg,1,3,5,4,4,0,1,3,3,2,4,3,4,3,2
basilica_santa_croce9.jpg,2,4,4,3,3,1,0,4,2,3,5,4,3,4,1
basilica_santa_croce4.jpg,2,0,4,5,5,3,4,0,2,3,3,2,5,4,5
basilica_santa_croce6.jpg,4,2,2,3,3,3,2,2,0,3,3,2,3,4,3
basilica_santa_croce5.jpg,3,3,5,6,4,2,3,3,3,0,4,3,2,5,4
basilica_santa_croce3.jpg,5,3,1,2,4,4,5,3,3,4,0,1,4,1,4
basilica_santa_croce2.jpg,4,2,2,3,3,3,4,2,2,3,1,0,5,2,5
basilica_santa_croce10.jpg,5,5,3,4,4,4,3,5,3,2,4,5,0,5,2
basilica_santa_croce0.jpg,4,4,2,1,3,3,4,4,4,5,1,2,5,0,3
basilica_santa_croce14.jpg,3,5,3,2,4,2,1,5,3,4,4,5,2,3,0
Type,Final-R,Final-R,Final-R,Final-R,Final-R,Final-R,Final-R,Final-R,Final-R,Final-R,Final-R,Final-R,Final-R,Final-R,Final-R
basilica_santa_croce1.jpg,0,2,2,2,2,1,1,3,2,2,2,2,3,1,1
basilica_santa_croce7.jpg,2,0,0,4,2,3,3,1,2,2,2,0,3,3,3
basilica_santa_croce13.jpg,2,0,0,4,2,3,3,1,2,2,2,0,3,3,3
basilica_santa_croce12.jpg,2,4,4,0,2,3,1,5,2,4,2,4,3,1,3
basilica_santa_croce8.jpg,2,2,2,2,0,3,1,3,2,4,4,2,5,3,3
basilica_santa_croce11.jpg,1,3,3,3,3,0,2,2,3,1,3,3,2,2,0
basilica_santa_croce9.jpg,1,3,3,1,1,2,0,4,1,3,3,3,4,2,2
basilica_santa_croce4.jpg,3,1,1,5,3,2,4,0,3,1,3,1,2,4,2
basilica_santa_croce6.jpg,2,2,2,2,2,3,1,3,0,2,2,2,3,3,3
basilica_santa_croce5.jpg,2,2,2,4,4,1,3,1,2,0,2,2,1,3,1
basilica_santa_croce3.jpg,2,2,2,2,4,3,3,3,2,2,0,2,1,1,3
basilica_santa_croce2.jpg,2,0,0,4,2,3,3,1,2,2,2,0,3,3,3
basilica_santa_croce10.jpg,3,3,3,3,5,2,4,2,3,1,1,3,0,2,2
basilica_santa_croce0.jpg,1,3,3,1,3,2,2,4,3,3,1,3,2,0,2
basilica_santa_croce14.jpg,1,3,3,3,3,0,2,2,3,1,3,3,2,2,0
