,taj_mahal10.jpg,taj_mahal7.jpg,taj_mahal9.jpg,taj_mahal2.jpg,taj_mahal0.jpg,taj_mahal8.jpg,taj_mahal12.jpg,taj_mahal1.jpg,taj_mahal11.jpg,taj_mahal5.jpg,taj_mahal13.jpg,taj_mahal14.jpg,taj_mahal6.jpg,taj_mahal4.jpg,taj_mahal3.jpg
Type,Meta,Meta,Meta,Meta,Meta,Meta,Meta,Meta,Meta,Meta,Meta,Meta,Meta,Meta,Meta
taj_mahal10.jpg,0,5,3,5,4,5,6,3,4,5,3,2,5,3,4
taj_mahal7.jpg,5,0,5,5,5,3,5,6,5,7,6,5,4,5,4
taj_mahal9.jpg,3,5,0,5,4,4,6,5,5,5,3,3,6,1,4
taj_mahal2.jpg,5,5,5,0,4,5,5,5,6,5,4,5,5,5,5
taj_mahal0.jpg,4,5,4,4,0,6,7,6,7,5,3,4,5,4,4
taj_mahal8.jpg,5,3,4,5,6,0,4,6,4,6,6,5,4,4,3
taj_mahal12.jpg,6,5,6,5,7,4,0,5,4,6,6,6,6,6,4
taj_mahal1.jpg,3,6,5,5,6,6,5,0,3,6,5,4,6,5,6
taj_mahal11.jpg,4,5,5,6,7,4,4,3,0,6,6,5,5,5,5
taj_mahal5.jpg,5,7,5,5,5,6,6,6,6,0,5,5,6,5,5
taj_mahal13.jpg,3,6,3,4,3,6,6,5,6,5,0,3,5,4,5
taj_mahal14.jpg,2,5,3,5,4,5,6,4,5,5,3,0,6,3,4
taj_mahal6.jpg,5,4,6,5,5,4,6,6,5,6,5,6,0,6,5
taj_mahal4.jpg,3,5,1,5,4,4,6,5,5,5,4,3,6,0,4
taj_mahal3.jpg,4,4,4,5,4,3,4,6,5,5,5,4,5,4,0
Type,R-Meta,R-Meta,R-Meta,R-Meta,R-Meta,R-Meta,R-Meta,R-Meta,R-Meta,R-Meta,R-Meta,R-Meta,R-Meta,R-Meta,R-Meta
taj_mahal10.jpg,0,1,1,1,2,1,3,0,1,2,1,0,2,1,2
taj_mahal7.jpg,1,0,0,2,3,0,2,1,0,1,2,1,1,0,1
taj_mahal9.jpg,1,0,0,2,3,0,2,1,0,1,2,1,1,0,1
taj_mahal2.jpg,1,2,2,0,1,2,2,1,2,3,0,1,1,2,3
taj_mahal0.jpg,2,3,3,1,0,3,3,2,3,4,1,2,2,3,4
taj_mahal8.jpg,1,0,0,2,3,0,2,1,0,1,2,1,1,0,1
taj_mahal12.jpg,3,2,2,2,3,2,0,3,2,3,2,3,1,2,1
taj_mahal1.jpg,0,1,1,1,2,1,3,0,1,2,1,0,2,1,2
taj_mahal11.jpg,1,0,0,2,3,0,2,1,0,1,2,1,1,0,1
taj_mahal5.jpg,2,1,1,3,4,1,3,2,1,0,3,2,2,1,2
taj_mahal13.jpg,1,2,2,0,1,2,2,1,2,3,0,1,1,2,3
taj_mahal14.jpg,0,1,1,1,2,1,3,0,1,2,1,0,2,1,2
taj_mahal6.jpg,2,1,1,1,2,1,1,2,1,2,1,2,0,1,2
taj_mahal4.jpg,1,0,0,2,3,0,2,1,0,1,2,1,1,0,1
taj_mahal3.jpg,2,1,1,3,4,1,1,2,1,2,3,2,2,1,0
Type,Content,Content,Content,Content,Content,Content,Content,Content,Content,Content,Content,Content,Content,Content,Content
taj_mahal10.jpg,0,11,13,10,11,13,12,10,12,12,13,12,13,12,13
taj_mahal7.jpg,11,0,12,11,11,13,12,12,13,13,13,10,12,13,11
taj_mahal9.jpg,13,12,0,12,13,13,13,12,12,13,13,12,13,12,12
taj_mahal2.jpg,10,11,12,0,13,13,12,11,11,12,12,11,12,13,13
taj_mahal0.jpg,11,11,13,13,0,13,12,12,12,13,13,13,13,13,13
taj_mahal8.jpg,13,13,13,13,13,0,12,13,13,13,13,12,12,13,12
taj_mahal12.jpg,12,12,13,12,12,12,0,12,13,13,13,11,12,13,12
taj_mahal1.jpg,10,12,12,11,12,13,12,0,12,13,12,10,13,13,12
taj_mahal11.jpg,12,13,12,11,12,13,13,12,0,13,9,13,13,12,13
taj_mahal5.jpg,12,13,13,12,13,13,13,13,13,0,13,12,13,13,13
taj_mahal13.jpg,13,13,13,12,13,13,13,12,9,13,0,13,13,12,13
taj_mahal14.jpg,12,10,12,11,13,12,11,10,13,12,13,0,12,13,12
taj_mahal6.jpg,13,12,13,12,13,12,12,13,13,13,13,12,0,12,12
taj_mahal4.jpg,12,13,12,13,13,13,13,13,12,13,12,13,12,0,13
taj_mahal3.jpg,13,11,12,13,13,12,12,12,13,13,13,12,12,13,0
Type,R-Content,R-Content,R-Content,R-Content,R-Content,R-Content,R-Content,R-Content,R-Content,R-Content,R-Content,R-Content,R-Content,R-Content,R-Content
taj_mahal10.jpg,0,5,2,3,5,3,3,1,3,4,3,1,1,2,2
taj_mahal7.jpg,5,0,5,4,4,2,4,4,4,3,4,6,4,3,3
taj_mahal9.jpg,2,5,0,3,3,5,1,3,1,4,5,1,3,2,4
taj_mahal2.jpg,3,4,3,0,2,4,4,4,2,1,2,4,2,1,5
taj_mahal0.jpg,5,4,3,2,0,4,2,4,2,1,2,4,4,3,5
taj_mahal8.jpg,3,2,5,4,4,0,4,2,4,3,2,4,2,3,1
taj_mahal12.jpg,3,4,1,4,2,4,0,2,2,3,4,2,4,3,3
taj_mahal1.jpg,1,4,3,4,4,2,2,0,4,3,2,2,2,3,1
taj_mahal11.jpg,3,4,1,2,2,4,2,4,0,3,4,2,2,1,5
taj_mahal5.jpg,4,3,4,1,1,3,3,3,3,0,1,5,3,2,4
taj_mahal13.jpg,3,4,5,2,2,2,4,2,4,1,0,4,2,3,3
taj_mahal14.jpg,1,6,1,4,4,4,2,2,2,5,4,0,2,3,3
taj_mahal6.jpg,1,4,3,2,4,2,4,2,2,3,2,2,0,1,3
taj_mahal4.jpg,2,3,2,1,3,3,3,3,1,2,3,3,1,0,4
taj_mahal3.jpg,2,3,4,5,5,1,3,1,5,4,3,3,3,4,0
Type,Final-R,Final-R,Final-R,Final-R,Final-R,Final-R,Final-R,Final-R,Final-R,Final-R,Final-R,Final-R,Final-R,Final-R,Final-R
taj_mahal10.jpg,0,5,2,3,5,3,3,1,3,4,3,1,1,2,2
taj_mahal7.jpg,5,0,5,4,4,2,4,4,4,3,4,6,4,3,3
taj_mahal9.jpg,2,5,0,3,3,5,1,3,1,4,5,1,3,2,4
taj_mahal2.jpg,3,4,3,0,2,4,4,4,2,1,2,4,2,1,5
taj_mahal0.jpg,5,4,3,2,0,4,2,4,2,1,2,4,4,3,5
taj_mahal8.jpg,3,2,5,4,4,0,4,2,4,3,2,4,2,3,1
taj_mahal12.jpg,3,4,1,4,2,4,0,2,2,3,4,2,4,3,3
taj_mahal1.jpg,1,4,3,4,4,2,2,0,4,3,2,2,2,3,1
taj_mahal11.jpg,3,4,1,2,2,4,2,4,0,3,4,2,2,1,5
taj_mahal5.jpg,4,3,4,1,1,3,3,3,3,0,1,5,3,2,4
taj_mahal13.jpg,3,4,5,2,2,2,4,2,4,1,0,4,2,3,3
taj_mahal14.jpg,1,6,1,4,4,4,2,2,2,5,4,0,2,3,3
taj_mahal6.jpg,1,4,3,2,4,2,4,2,2,3,2,2,0,1,3
taj_mahal4.jpg,2,3,2,1,3,3,3,3,1,2,3,3,1,0,4
taj_mahal3.jpg,2,3,4,5,5,1,3,1,5,4,3,3,3,4,0
