,pantheon8.jpg,pantheon4.jpg,pantheon1.jpg,pantheon12.jpg,pantheon0.jpg,pantheon2.jpg,pantheon9.jpg,pantheon14.jpg,pantheon7.jpg,pantheon13.jpg,pantheon10.jpg,pantheon3.jpg,pantheon11.jpg,pantheon6.jpg,pantheon5.jpg
Type,Meta,Meta,Meta,Meta,Meta,Meta,Meta,Meta,Meta,Meta,Meta,Meta,Meta,Meta,Meta
pantheon8.jpg,0,3,3,4,5,2,4,4,2,5,5,5,5,4,5
pantheon4.jpg,3,0,5,4,6,3,5,5,3,5,5,5,5,3,4
pantheon1.jpg,3,5,0,4,3,4,5,3,3,4,4,4,3,4,6
pantheon12.jpg,4,4,4,0,4,4,6,4,3,5,2,5,4,3,6
pantheon0.jpg,5,6,3,4,0,5,5,4,4,6,4,4,5,5,7
pantheon2.jpg,2,3,4,4,5,0,4,3,2,5,5,5,5,3,5
pantheon9.jpg,4,5,5,6,5,4,0,6,3,6,7,5,6,6,5
pantheon14.jpg,4,5,3,4,4,3,6,0,4,5,3,5,4,3,5
pantheon7.jpg,2,3,3,3,4,2,3,4,0,4,4,4,4,4,5
pantheon13.jpg,5,5,4,5,6,5,6,5,4,0,4,5,2,5,5
pantheon10.jpg,5,5,4,2,4,5,7,3,4,4,0,5,3,4,6
pantheon3.jpg,5,5,4,5,4,5,5,5,4,5,5,0,6,6,4
pantheon11.jpg,5,5,3,4,5,5,6,4,4,2,3,6,0,4,5
pantheon6.jpg,4,3,4,3,5,3,6,3,4,5,4,6,4,0,6
pantheon5.jpg,5,4,6,6,7,5,5,5,5,5,6,4,5,6,0
Type,R-Meta,R-Meta,R-Meta,R-Meta,R-Meta,R-Meta,R-Meta,R-Meta,R-Meta,R-Meta,R-Meta,R-Meta,R-Meta,R-Meta,R-Meta
pantheon8.jpg,0,2,4,4,4,2,2,4,2,4,4,4,4,4,2
pantheon4.jpg,2,0,4,4,4,2,2,4,2,4,4,2,4,4,0
pantheon1.jpg,4,4,0,2,2,4,2,2,2,4,2,4,2,2,4
pantheon12.jpg,4,4,2,0,2,4,4,2,4,4,0,4,2,2,4
pantheon0.jpg,4,4,2,2,0,4,4,2,4,4,2,4,2,2,4
pantheon2.jpg,2,2,4,4,4,0,2,2,2,4,4,4,4,2,2
pantheon9.jpg,2,2,2,4,4,2,0,4,0,4,4,4,4,4,2
pantheon14.jpg,4,4,2,2,2,2,4,0,4,4,2,4,2,0,4
pantheon7.jpg,2,2,2,4,4,2,0,4,0,4,4,4,4,4,2
pantheon13.jpg,4,4,4,4,4,4,4,4,4,0,4,2,2,4,4
pantheon10.jpg,4,4,2,0,2,4,4,2,4,4,0,4,2,2,4
pantheon3.jpg,4,2,4,4,4,4,4,4,4,2,4,0,4,4,2
pantheon11.jpg,4,4,2,2,2,4,4,2,4,2,2,4,0,2,4
pantheon6.jpg,4,4,2,2,2,2,4,0,4,4,2,4,2,0,4
pantheon5.jpg,2,0,4,4,4,2,2,4,2,4,4,2,4,4,0
Type,Content,Content,Content,Content,Content,Content,Content,Content,Content,Content,Content,Content,Content,Content,Content
pantheon8.jpg,0,13,13,10,13,12,10,11,12,12,12,13,12,13,12
pantheon4.jpg,13,0,13,13,11,13,13,13,12,13,13,13,12,11,12
pantheon1.jpg,13,13,0,13,13,13,11,13,13,13,12,12,13,13,13
pantheon12.jpg,10,13,13,0,13,11,11,12,12,12,12,13,12,13,12
pantheon0.jpg,13,11,13,13,0,12,13,13,13,13,13,13,13,9,13
pantheon2.jpg,12,13,13,11,12,0,11,13,13,12,13,13,12,12,13
pantheon9.jpg,10,13,11,11,13,11,0,12,13,12,12,13,13,13,12
pantheon14.jpg,11,13,13,12,13,13,12,0,12,11,12,12,11,13,9
pantheon7.jpg,12,12,13,12,13,13,13,12,0,13,13,13,11,12,13
pantheon13.jpg,12,13,13,12,13,12,12,11,13,0,12,13,12,12,11
pantheon10.jpg,12,13,12,12,13,13,12,12,13,12,0,13,12,13,11
pantheon3.jpg,13,13,12,13,13,13,13,12,13,13,13,0,13,13,12
pantheon11.jpg,12,12,13,12,13,12,13,11,11,12,12,13,0,12,12
pantheon6.jpg,13,11,13,13,9,12,13,13,12,12,13,13,12,0,13
pantheon5.jpg,12,12,13,12,13,13,12,9,13,11,11,12,12,13,0
Type,R-Content,R-Content,R-Content,R-Content,R-Content,R-Content,R-Content,R-Content,R-Content,R-Content,R-Content,R-Content,R-Content,R-Content,R-Content
pantheon8.jpg,0,8,8,5,8,8,4,4,8,6,6,8,6,8,4
pantheon4.jpg,8,0,8,7,6,6,8,8,8,8,8,8,8,6,8
pantheon1.jpg,8,8,0,7,6,8,8,8,8,6,6,6,6,6,8
pantheon12.jpg,5,7,7,0,7,7,5,5,5,5,5,7,7,7,5
pantheon0.jpg,8,6,6,7,0,8,8,8,8,8,8,8,6,2,8
pantheon2.jpg,8,6,8,7,8,0,6,6,8,8,8,8,8,8,8
pantheon9.jpg,4,8,8,5,8,6,0,2,8,6,6,8,8,8,6
pantheon14.jpg,4,8,8,5,8,6,2,0,8,6,6,8,8,8,6
pantheon7.jpg,8,8,8,5,8,8,8,8,0,8,8,8,8,8,6
pantheon13.jpg,6,8,6,5,8,8,6,6,8,0,6,8,8,8,6
pantheon10.jpg,6,8,6,5,8,8,6,6,8,6,0,8,8,8,6
pantheon3.jpg,8,8,6,7,8,8,8,8,8,8,8,0,8,8,8
pantheon11.jpg,6,8,6,7,6,8,8,8,8,8,8,8,0,4,6
pantheon6.jpg,8,6,6,7,2,8,8,8,8,8,8,8,4,0,8
pantheon5.jpg,4,8,8,5,8,8,6,6,6,6,6,8,6,8,0
Type,Final-R,Final-R,Final-R,Final-R,Final-R,Final-R,Final-R,Final-R,Final-R,Final-R,Final-R,Final-R,Final-R,Final-R,Final-R
pantheon8.jpg,0,2,4,4,4,2,2,4,2,4,4,4,4,4,2
pantheon4.jpg,2,0,4,4,4,2,2,4,2,4,4,2,4,4,0
pantheon1.jpg,4,4,0,2,2,4,2,2,2,4,2,4,2,2,4
pantheon12.jpg,4,4,2,0,2,4,4,2,4,4,0,4,2,2,4
pantheon0.jpg,4,4,2,2,0,4,4,2,4,4,2,4,2,2,4
pantheon2.jpg,2,2,4,4,4,0,2,2,2,4,4,4,4,2,2
pantheon9.jpg,2,2,2,4,4,2,0,4,0,4,4,4,4,4,2
pantheon14.jpg,4,4,2,2,2,2,4,0,4,4,2,4,2,0,4
pantheon7.jpg,2,2,2,4,4,2,0,4,0,4,4,4,4,4,2
pantheon13.jpg,4,4,4,4,4,4,4,4,4,0,4,2,2,4,4
pantheon10.jpg,4,4,2,0,2,4,4,2,4,4,0,4,2,2,4
pantheon3.jpg,4,2,4,4,4,4,4,4,4,2,4,0,4,4,2
pantheon11.jpg,4,4,2,2,2,4,4,2,4,2,2,4,0,2,4
pantheon6.jpg,4,4,2,2,2,2,4,0,4,4,2,4,2,0,4
pantheon5.jpg,2,0,4,4,4,2,2,4,2,4,4,2,4,4,0
