,pietà_mic14.jpg,pietà_mic6.jpg,pietà_mic9.jpg,pietà_mic7.jpg,pietà_mic2.jpg,pietà_mic4.jpg,pietà_mic1.jpg,pietà_mic13.jpg,pietà_mic10.jpg,pietà_mic11.jpg,pietà_mic3.jpg,pietà_mic5.jpg,pietà_mic0.jpg,pietà_mic8.jpg,pietà_mic12.jpg
Type,Meta,Meta,Meta,Meta,Meta,Meta,Meta,Meta,Meta,Meta,Meta,Meta,Meta,Meta,Meta
pietà_mic14.jpg,0,5,5,5,5,6,7,7,5,6,7,6,7,7,7
pietà_mic6.jpg,5,0,5,5,6,7,5,5,5,4,5,6,5,4,4
pietà_mic9.jpg,5,5,0,6,6,5,5,3,6,5,6,6,4,4,6
pietà_mic7.jpg,5,5,6,0,3,4,6,5,2,5,6,4,4,5,7
pietà_mic2.jpg,5,6,6,3,0,3,6,5,4,6,6,5,5,6,7
pietà_mic4.jpg,6,7,5,4,3,0,5,4,5,5,5,5,5,6,7
pietà_mic1.jpg,7,5,5,6,6,5,0,3,7,3,4,4,4,3,5
pietà_mic13.jpg,7,5,3,5,5,4,3,0,6,2,4,4,3,3,5
pietà_mic10.jpg,5,5,6,2,4,5,7,6,0,6,6,4,5,6,7
pietà_mic11.jpg,6,4,5,5,6,5,3,2,6,0,4,5,4,4,4
pietà_mic3.jpg,7,5,6,6,6,5,4,4,6,4,0,4,5,4,5
pietà_mic5.jpg,6,6,6,4,5,5,4,4,4,5,4,0,5,3,6
pietà_mic0.jpg,7,5,4,4,5,5,4,3,5,4,5,5,0,4,6
pietà_mic8.jpg,7,4,4,5,6,6,3,3,6,4,4,3,4,0,4
pietà_mic12.jpg,7,4,6,7,7,7,5,5,7,4,5,6,6,4,0
Type,R-Meta,R-Meta,R-Meta,R-Meta,R-Meta,R-Meta,R-Meta,R-Meta,R-Meta,R-Meta,R-Meta,R-Meta,R-Meta,R-Meta,R-Meta
pietà_mic14.jpg,0,8,6,6,8,8,8,6,6,8,7,6,8,8,8
pietà_mic6.jpg,8,0,8,8,8,8,4,6,8,4,5,6,8,2,4
pietà_mic9.jpg,6,8,0,8,8,6,6,4,8,6,3,6,4,6,6
pietà_mic7.jpg,6,8,8,0,2,4,8,8,2,8,7,6,6,8,8
pietà_mic2.jpg,8,8,8,2,0,4,8,8,4,8,7,8,6,8,8
pietà_mic4.jpg,8,8,6,4,4,0,6,6,6,6,7,8,6,8,8
pietà_mic1.jpg,8,4,6,8,8,6,0,4,8,2,5,6,6,4,6
pietà_mic13.jpg,6,6,4,8,8,6,4,0,8,4,3,6,4,6,4
pietà_mic10.jpg,6,8,8,2,4,6,8,8,0,8,7,6,6,8,8
pietà_mic11.jpg,8,4,6,8,8,6,2,4,8,0,5,6,4,4,6
pietà_mic3.jpg,7,5,3,7,7,7,5,3,7,5,0,3,5,3,3
pietà_mic5.jpg,6,6,6,6,8,8,6,6,6,6,3,0,8,4,6
pietà_mic0.jpg,8,8,4,6,6,6,6,4,6,4,5,8,0,8,6
pietà_mic8.jpg,8,2,6,8,8,8,4,6,8,4,3,4,8,0,4
pietà_mic12.jpg,8,4,6,8,8,8,6,4,8,6,3,6,6,4,0
Type,Content,Content,Content,Content,Content,Content,Content,Content,Content,Content,Content,Content,Content,Content,Content
pietà_mic14.jpg,0,13,12,13,12,12,13,11,13,13,13,13,12,12,11
pietà_mic6.jpg,13,0,13,12,13,13,12,12,12,13,9,13,12,11,13
pietà_mic9.jpg,12,13,0,13,12,13,13,12,13,11,13,9,12,12,12
pietà_mic7.jpg,13,12,13,0,13,12,13,12,13,13,12,12,13,11,12
pietà_mic2.jpg,12,13,12,13,0,9,11,11,13,12,12,11,8,13,12
pietà_mic4.jpg,12,13,13,12,9,0,10,10,12,12,11,13,10,13,12
pietà_mic1.jpg,13,12,13,13,11,10,0,13,13,12,12,12,12,10,12
pietà_mic13.jpg,11,12,12,12,11,10,13,0,13,12,13,13,11,13,12
pietà_mic10.jpg,13,12,13,13,13,12,13,13,0,12,13,13,13,12,13
pietà_mic11.jpg,13,13,11,13,12,12,12,12,12,0,13,12,12,13,13
pietà_mic3.jpg,13,9,13,12,12,11,12,13,13,13,0,13,12,12,12
pietà_mic5.jpg,13,13,9,12,11,13,12,13,13,12,13,0,12,11,12
pietà_mic0.jpg,12,12,12,13,8,10,12,11,13,12,12,12,0,13,11
pietà_mic8.jpg,12,11,12,11,13,13,10,13,12,13,12,11,13,0,10
pietà_mic12.jpg,11,13,12,12,12,12,12,12,13,13,12,12,11,10,0
Type,R-Content,R-Content,R-Content,R-Content,R-Content,R-Content,R-Content,R-Content,R-Content,R-Content,R-Content,R-Content,R-Content,R-Content,R-Content
pietà_mic14.jpg,0,11,13,12,7,9,13,9,12,11,13,13,7,11,9
pietà_mic6.jpg,11,0,12,9,10,12,12,12,9,12,10,12,12,10,10
pietà_mic9.jpg,13,12,0,13,14,12,10,10,9,8,12,10,14,12,12
pietà_mic7.jpg,12,9,13,0,11,13,13,13,12,13,11,9,13,11,11
pietà_mic2.jpg,7,10,14,11,0,10,14,12,13,12,12,14,8,12,10
pietà_mic4.jpg,9,12,12,13,10,0,12,10,11,12,12,14,8,12,12
pietà_mic1.jpg,13,12,10,13,14,12,0,10,11,10,12,10,14,10,12
pietà_mic13.jpg,9,12,10,13,12,10,10,0,13,14,12,12,10,14,10
pietà_mic10.jpg,12,9,9,12,13,11,11,13,0,9,13,11,11,11,11
pietà_mic11.jpg,11,12,8,13,12,12,10,14,9,0,14,12,12,8,14
pietà_mic3.jpg,13,10,12,11,12,12,12,12,13,14,0,12,14,14,14
pietà_mic5.jpg,13,12,10,9,14,14,10,12,11,12,12,0,14,8,12
pietà_mic0.jpg,7,12,14,13,8,8,14,10,11,12,14,14,0,12,12
pietà_mic8.jpg,11,10,12,11,12,12,10,14,11,8,14,8,12,0,12
pietà_mic12.jpg,9,10,12,11,10,12,12,10,11,14,14,12,12,12,0
Type,Final-R,Final-R,Final-R,Final-R,Final-R,Final-R,Final-R,Final-R,Final-R,Final-R,Final-R,Final-R,Final-R,Final-R,Final-R
pietà_mic14.jpg,0,11,13,12,7,9,13,9,12,11,13,13,7,11,9
pietà_mic6.jpg,11,0,12,9,10,12,12,12,9,12,10,12,12,10,10
pietà_mic9.jpg,13,12,0,13,14,12,10,10,9,8,12,10,14,12,12
pietà_mic7.jpg,12,9,13,0,11,13,13,13,12,13,11,9,13,11,11
pietà_mic2.jpg,7,10,14,11,0,10,14,12,13,12,12,14,8,12,10
pietà_mic4.jpg,9,12,12,13,10,0,12,10,11,12,12,14,8,12,12
pietà_mic1.jpg,13,12,10,13,14,12,0,10,11,10,12,10,14,10,12
pietà_mic13.jpg,9,12,10,13,12,10,10,0,13,14,12,12,10,14,10
pietà_mic10.jpg,12,9,9,12,13,11,11,13,0,9,13,11,11,11,11
pietà_mic11.jpg,11,12,8,13,12,12,10,14,9,0,14,12,12,8,14
pietà_mic3.jpg,13,10,12,11,12,12,12,12,13,14,0,12,14,14,14
pietà_mic5.jpg,13,12,10,9,14,14,10,12,11,12,12,0,14,8,12
pietà_mic0.jpg,7,12,14,13,8,8,14,10,11,12,14,14,0,12,12
pietà_mic8.jpg,11,10,12,11,12,12,10,14,11,8,14,8,12,0,12
pietà_mic12.jpg,9,10,12,11,10,12,12,10,11,14,14,12,12,12,0
