,hamburger2.jpg,hamburger0.jpg,hamburger11.jpg,hamburger14.jpg,hamburger1.jpg,hamburger10.jpg,hamburger9.jpg,hamburger8.jpg,hamburger6.jpg,hamburger3.jpg,hamburger5.jpg,hamburger4.jpg,hamburger13.jpg,hamburger7.jpg,hamburger12.jpg
Type,SHA256,SHA256,SHA256,SHA256,SHA256,SHA256,SHA256,SHA256,SHA256,SHA256,SHA256,SHA256,SHA256,SHA256,SHA256
hamburger2.jpg,0,61,60,62,60,59,63,57,59,62,59,62,61,61,59
hamburger0.jpg,61,0,59,63,58,61,61,60,59,61,62,57,61,58,56
hamburger11.jpg,60,59,0,56,57,60,61,58,58,59,63,59,59,62,61
hamburger14.jpg,62,63,56,0,59,59,63,62,61,59,61,60,61,62,62
hamburger1.jpg,60,58,57,59,0,58,58,59,61,61,61,63,62,60,55
hamburger10.jpg,59,61,60,59,58,0,60,63,60,62,61,57,62,63,58
hamburger9.jpg,63,61,61,63,58,60,0,61,58,59,60,62,59,59,55
hamburger8.jpg,57,60,58,62,59,63,61,0,62,60,61,60,59,58,60
hamburger6.jpg,59,59,58,61,61,60,58,62,0,57,58,59,55,61,60
hamburger3.jpg,62,61,59,59,61,62,59,60,57,0,63,60,58,61,61
hamburger5.jpg,59,62,63,61,61,61,60,61,58,63,0,61,60,59,58
hamburger4.jpg,62,57,59,60,63,57,62,60,59,60,61,0,56,61,59
hamburger13.jpg,61,61,59,61,62,62,59,59,55,58,60,56,0,61,57
hamburger7.jpg,61,58,62,62,60,63,59,58,61,61,59,61,61,0,61
hamburger12.jpg,59,56,61,62,55,58,55,60,60,61,58,59,57,61,0
Type,Final-R,Final-R,Final-R,Final-R,Final-R,Final-R,Final-R,Final-R,Final-R,Final-R,Final-R,Final-R,Final-R,Final-R,Final-R
hamburger2.jpg,0,7,11,8,9,8,7,5,10,9,9,7,8,8,9
hamburger0.jpg,7,0,8,9,8,7,8,6,7,10,6,8,7,9,8
hamburger11.jpg,11,8,0,5,6,7,6,8,7,6,8,6,5,5,6
hamburger14.jpg,8,9,5,0,9,10,7,7,8,7,7,9,6,6,7
hamburger1.jpg,9,8,6,9,0,5,2,8,7,6,6,6,9,7,2
hamburger10.jpg,8,7,7,10,5,0,5,9,4,7,11,7,8,6,7
hamburger9.jpg,7,8,6,7,2,5,0,6,7,8,8,6,9,5,4
hamburger8.jpg,5,6,8,7,8,9,6,0,9,8,6,8,9,7,8
hamburger6.jpg,10,7,7,8,7,4,7,9,0,9,7,9,6,8,7
hamburger3.jpg,9,10,6,7,6,7,8,8,9,0,6,4,9,3,6
hamburger5.jpg,9,6,8,7,6,11,8,6,7,6,0,8,9,9,4
hamburger4.jpg,7,8,6,9,6,7,6,8,9,4,8,0,5,3,8
hamburger13.jpg,8,7,5,6,9,8,9,9,6,9,9,5,0,8,9
hamburger7.jpg,8,9,5,6,7,6,5,7,8,3,9,3,8,0,9
hamburger12.jpg,9,8,6,7,2,7,4,8,7,6,4,8,9,9,0
