,arco_trionfo11.jpg,arco_trionfo4.jpg,arco_trionfo9.jpg,arco_trionfo12.jpg,arco_trionfo8.jpg,arco_trionfo13.jpg,arco_trionfo2.jpg,arco_trionfo1.jpg,arco_trionfo5.jpg,arco_trionfo3.jpg,arco_trionfo0.jpg,arco_trionfo7.jpg,arco_trionfo10.jpg,arco_trionfo14.jpg,arco_trionfo6.jpg
Type,Meta,Meta,Meta,Meta,Meta,Meta,Meta,Meta,Meta,Meta,Meta,Meta,Meta,Meta,Meta
arco_trionfo11.jpg,0,5,4,3,5,5,5,5,6,5,4,5,6,6,5
arco_trionfo4.jpg,5,0,4,6,1,5,4,3,4,3,3,5,4,4,3
arco_trionfo9.jpg,4,4,0,5,4,6,4,6,4,4,3,5,5,6,2
arco_trionfo12.jpg,3,6,5,0,6,4,5,5,6,5,4,4,6,6,6
arco_trionfo8.jpg,5,1,4,6,0,4,4,4,4,3,4,5,3,4,3
arco_trionfo13.jpg,5,5,6,4,4,0,6,3,5,4,5,4,4,6,6
arco_trionfo2.jpg,5,4,4,5,4,6,0,6,6,5,4,6,4,6,4
arco_trionfo1.jpg,5,3,6,5,4,3,6,0,6,5,5,3,5,5,6
arco_trionfo5.jpg,6,4,4,6,4,5,6,6,0,3,3,6,5,5,4
arco_trionfo3.jpg,5,3,4,5,3,4,5,5,3,0,3,4,4,5,4
arco_trionfo0.jpg,4,3,3,4,4,5,4,5,3,3,0,6,5,6,4
arco_trionfo7.jpg,5,5,5,4,5,4,6,3,6,4,6,0,5,6,5
arco_trionfo10.jpg,6,4,5,6,3,4,4,5,5,4,5,5,0,5,5
arco_trionfo14.jpg,6,4,6,6,4,6,6,5,5,5,6,6,5,0,6
arco_trionfo6.jpg,5,3,2,6,3,6,4,6,4,4,4,5,5,6,0
Type,Content,Content,Content,Content,Content,Content,Content,Content,Content,Content,Content,Content,Content,Content,Content
arco_trionfo11.jpg,0,13,13,13,13,10,12,13,13,13,12,12,13,12,12
arco_trionfo4.jpg,13,0,12,13,12,13,13,13,13,12,12,13,11,13,13
arco_trionfo9.jpg,13,12,0,13,12,13,10,13,11,13,12,13,13,13,11
arco_trionfo12.jpg,13,13,13,0,12,13,11,13,13,13,13,12,13,13,13
arco_trionfo8.jpg,13,12,12,12,0,13,12,13,13,13,9,12,12,13,13
arco_trionfo13.jpg,10,13,13,13,13,0,12,13,13,13,13,12,13,12,11
arco_trionfo2.jpg,12,13,10,11,12,12,0,12,11,13,12,12,13,13,12
arco_trionfo1.jpg,13,13,13,13,13,13,12,0,13,13,13,12,13,13,12
arco_trionfo5.jpg,13,13,11,13,13,13,11,13,0,13,13,13,13,13,12
arco_trionfo3.jpg,13,12,13,13,13,13,13,13,13,0,12,12,12,12,12
arco_trionfo0.jpg,12,12,12,13,9,13,12,13,13,12,0,13,13,11,13
arco_trionfo7.jpg,12,13,13,12,12,12,12,12,13,12,13,0,13,13,11
arco_trionfo10.jpg,13,11,13,13,12,13,13,13,13,12,13,13,0,13,12
arco_trionfo14.jpg,12,13,13,13,13,12,13,13,13,12,11,13,13,0,13
arco_trionfo6.jpg,12,13,11,13,13,11,12,12,12,12,13,11,12,13,0
Type,Final-R,Final-R,Final-R,Final-R,Final-R,Final-R,Final-R,Final-R,Final-R,Final-R,Final-R,Final-R,Final-R,Final-R,Final-R
arco_trionfo11.jpg,0,29,31,26,32,26,29,32,32,35,25,32,36,33,28
arco_trionfo4.jpg,29,0,28,33,25,29,32,27,31,24,24,33,29,28,29
arco_trionfo9.jpg,31,28,0,33,29,35,28,33,23,28,24,33,35,30,21
arco_trionfo12.jpg,26,33,33,0,32,24,23,28,34,33,27,28,32,33,30
arco_trionfo8.jpg,32,25,29,32,0,32,29,30,30,23,19,30,28,25,28
arco_trionfo13.jpg,26,29,35,24,32,0,31,26,34,33,31,32,30,27,32
arco_trionfo2.jpg,29,32,28,23,29,31,0,31,25,32,24,33,29,34,25
arco_trionfo1.jpg,32,27,33,28,30,26,31,0,34,29,27,22,30,31,32
arco_trionfo5.jpg,32,31,23,34,30,34,25,34,0,29,27,32,32,31,22
arco_trionfo3.jpg,35,24,28,33,23,33,32,29,29,0,18,31,29,30,27
arco_trionfo0.jpg,25,24,24,27,19,31,24,27,27,18,0,31,27,28,23
arco_trionfo7.jpg,32,33,33,28,30,32,33,22,32,31,31,0,34,33,28
arco_trionfo10.jpg,36,29,35,32,28,30,29,30,32,29,27,34,0,31,30
arco_trionfo14.jpg,33,28,30,33,25,27,34,31,31,30,28,33,31,0,31
arco_trionfo6.jpg,28,29,21,30,28,32,25,32,22,27,23,28,30,31,0
