,arco_pace0.jpg,arco_pace12.jpg,arco_pace11.jpg,arco_pace6.jpg,arco_pace13.jpg,arco_pace5.jpg,arco_pace4.jpg,arco_pace9.jpg,arco_pace10.jpg,arco_pace1.jpg,arco_pace14.jpg,arco_pace7.jpg,arco_pace3.jpg,arco_pace2.jpg,arco_pace8.jpg
Type,Meta,Meta,Meta,Meta,Meta,Meta,Meta,Meta,Meta,Meta,Meta,Meta,Meta,Meta,Meta
arco_pace0.jpg,0,6,5,3,4,3,4,5,5,4,6,4,4,4,3
arco_pace12.jpg,6,0,3,6,5,6,4,6,3,4,2,3,7,6,6
arco_pace11.jpg,5,3,0,5,4,5,5,5,1,5,4,4,6,5,7
arco_pace6.jpg,3,6,5,0,5,5,5,5,5,5,5,6,4,5,5
arco_pace13.jpg,4,5,4,5,0,5,6,4,4,6,5,4,6,6,6
arco_pace5.jpg,3,6,5,5,5,0,5,6,5,5,7,6,5,5,3
arco_pace4.jpg,4,4,5,5,6,5,0,6,6,4,4,5,5,5,4
arco_pace9.jpg,5,6,5,5,4,6,6,0,5,5,6,6,3,3,6
arco_pace10.jpg,5,3,1,5,4,5,6,5,0,5,3,4,6,5,7
arco_pace1.jpg,4,4,5,5,6,5,4,5,5,0,5,5,5,3,5
arco_pace14.jpg,6,2,4,5,5,7,4,6,3,5,0,3,7,6,6
arco_pace7.jpg,4,3,4,6,4,6,5,6,4,5,3,0,7,6,6
arco_pace3.jpg,4,7,6,4,6,5,5,3,6,5,7,7,0,4,5
arco_pace2.jpg,4,6,5,5,6,5,5,3,5,3,6,6,4,0,5
arco_pace8.jpg,3,6,7,5,6,3,4,6,7,5,6,6,5,5,0
Type,R-Meta,R-Meta,R-Meta,R-Meta,R-Meta,R-Meta,R-Meta,R-Meta,R-Meta,R-Meta,R-Meta,R-Meta,R-Meta,R-Meta,R-Meta
arco_pace0.jpg,0,4,4,2,4,2,2,2,4,0,4,4,2,0,0
arco_pace12.jpg,4,0,2,4,2,4,2,2,2,4,0,0,4,4,4
arco_pace11.jpg,4,2,0,4,2,2,4,2,0,4,2,2,4,4,4
arco_pace6.jpg,2,4,4,0,4,4,4,2,4,2,4,4,2,2,2
arco_pace13.jpg,4,2,2,4,0,4,4,2,2,4,2,2,4,4,4
arco_pace5.jpg,2,4,2,4,4,0,2,4,2,2,4,4,4,2,2
arco_pace4.jpg,2,2,4,4,4,2,0,4,4,2,2,2,4,2,2
arco_pace9.jpg,2,2,2,2,2,4,4,0,2,2,2,2,2,2,2
arco_pace10.jpg,4,2,0,4,2,2,4,2,0,4,2,2,4,4,4
arco_pace1.jpg,0,4,4,2,4,2,2,2,4,0,4,4,2,0,0
arco_pace14.jpg,4,0,2,4,2,4,2,2,2,4,0,0,4,4,4
arco_pace7.jpg,4,0,2,4,2,4,2,2,2,4,0,0,4,4,4
arco_pace3.jpg,2,4,4,2,4,4,4,2,4,2,4,4,0,2,2
arco_pace2.jpg,0,4,4,2,4,2,2,2,4,0,4,4,2,0,0
arco_pace8.jpg,0,4,4,2,4,2,2,2,4,0,4,4,2,0,0
Type,Content,Content,Content,Content,Content,Content,Content,Content,Content,Content,Content,Content,Content,Content,Content
arco_pace0.jpg,0,12,13,12,11,13,12,12,13,11,13,12,13,12,11
arco_pace12.jpg,12,0,11,13,12,13,12,12,13,11,12,13,11,13,13
arco_pace11.jpg,13,11,0,13,12,13,13,13,13,12,12,13,12,13,13
arco_pace6.jpg,12,13,13,0,12,13,13,13,13,13,13,13,13,12,12
arco_pace13.jpg,11,12,12,12,0,11,11,12,11,12,13,12,13,11,12
arco_pace5.jpg,13,13,13,13,11,0,13,12,13,13,13,13,12,13,12
arco_pace4.jpg,12,12,13,13,11,13,0,13,13,12,13,11,12,11,11
arco_pace9.jpg,12,12,13,13,12,12,13,0,13,13,12,13,12,13,13
arco_pace10.jpg,13,13,13,13,11,13,13,13,0,11,13,12,13,12,11
arco_pace1.jpg,11,11,12,13,12,13,12,13,11,0,13,12,13,12,10
arco_pace14.jpg,13,12,12,13,13,13,13,12,13,13,0,13,12,12,13
arco_pace7.jpg,12,13,13,13,12,13,11,13,12,12,13,0,13,11,12
arco_pace3.jpg,13,11,12,13,13,12,12,12,13,13,12,13,0,13,13
arco_pace2.jpg,12,13,13,12,11,13,11,13,12,12,12,11,13,0,10
arco_pace8.jpg,11,13,13,12,12,12,11,13,11,10,13,12,13,10,0
Type,R-Content,R-Content,R-Content,R-Content,R-Content,R-Content,R-Content,R-Content,R-Content,R-Content,R-Content,R-Content,R-Content,R-Content,R-Content
arco_pace0.jpg,0,5,8,6,4,8,6,8,8,4,7,4,6,4,6
arco_pace12.jpg,5,0,5,7,5,7,5,7,5,3,4,5,5,5,5
arco_pace11.jpg,8,5,0,8,6,8,8,6,4,6,5,6,6,8,8
arco_pace6.jpg,6,7,8,0,8,8,8,8,8,6,7,6,6,6,6
arco_pace13.jpg,4,5,6,8,0,8,6,8,4,4,7,4,8,4,6
arco_pace5.jpg,8,7,8,8,8,0,8,8,8,6,5,8,8,8,6
arco_pace4.jpg,6,5,8,8,6,8,0,8,8,4,7,4,8,6,4
arco_pace9.jpg,8,7,6,8,8,8,8,0,8,6,7,8,8,8,8
arco_pace10.jpg,8,5,4,8,4,8,8,8,0,6,5,6,6,8,8
arco_pace1.jpg,4,3,6,6,4,6,4,6,6,0,5,4,6,4,4
arco_pace14.jpg,7,4,5,7,7,5,7,7,5,5,0,7,5,7,7
arco_pace7.jpg,4,5,6,6,4,8,4,8,6,4,7,0,8,6,6
arco_pace3.jpg,6,5,6,6,8,8,8,8,6,6,5,8,0,8,6
arco_pace2.jpg,4,5,8,6,4,8,6,8,8,4,7,6,8,0,6
arco_pace8.jpg,6,5,8,6,6,6,4,8,8,4,7,6,6,6,0
Type,Final-R,Final-R,Final-R,Final-R,Final-R,Final-R,Final-R,Final-R,Final-R,Final-R,Final-R,Final-R,Final-R,Final-R,Final-R
arco_pace0.jpg,0,9,11,7,5,9,7,10,9,4,11,7,7,4,5
arco_pace12.jpg,9,0,6,10,6,6,6,7,6,7,4,4,8,9,8
arco_pace11.jpg,11,6,0,10,6,6,10,7,4,9,6,6,8,11,10
arco_pace6.jpg,7,10,10,0,10,10,10,7,10,7,10,8,6,7,6
arco_pace13.jpg,5,6,6,10,0,6,6,9,4,5,8,4,10,5,6
arco_pace5.jpg,9,6,6,10,6,0,8,9,4,7,4,8,8,9,8
arco_pace4.jpg,7,6,10,10,6,8,0,9,8,5,8,6,10,7,4
arco_pace9.jpg,10,7,7,7,9,9,9,0,9,8,7,7,9,10,9
arco_pace10.jpg,9,6,4,10,4,4,8,9,0,7,6,6,8,9,8
arco_pace1.jpg,4,7,9,7,5,7,5,8,7,0,9,7,7,4,3
arco_pace14.jpg,11,4,6,10,8,4,8,7,6,9,0,6,8,11,10
arco_pace7.jpg,7,4,6,8,4,8,6,7,6,7,6,0,10,9,8
arco_pace3.jpg,7,8,8,6,10,8,10,9,8,7,8,10,0,9,6
arco_pace2.jpg,4,9,11,7,5,9,7,10,9,4,11,9,9,0,5
arco_pace8.jpg,5,8,10,6,6,8,4,9,8,3,10,8,6,5,0
