Img-Name,SHA256,Final-R
ultima_cena3.jpg,24d48ad2d548bb12ccc6f270e0c938e1ee7ce9c859cbe73a93edd77f1f2a9752,"[0, 1, 1, 0, 0, 0, 0, 0]"
ultima_cena13.jpg,389d512841286d53b3b51dadb138d6f1413abd94b3c507424eadc2b969f4a8c6,"[0, 1, 1, 1, 0, 0, 1, 0]"
ultima_cena11.jpg,488371ac86c7a268d49f23b0a70f6bd67623d2eea33f0fc0303f41944051ca11,"[1, 1, 0, 0, 0, 0, 1, 0]"
ultima_cena2.jpg,36f83307a057de8f8b90fca999d067ccd0c0ddcf5deeb7aa2cd5a32c97fba4a2,"[0, 0, 1, 0, 1, 0, 0, 1]"
ultima_cena6.jpg,f324abdb5a2e841d6a0c4ab6a6e52ed6cc8212204f7fbd4e67f8eacb29e3b403,"[0, 0, 0, 1, 0, 1, 1, 0]"
ultima_cena0.jpg,ca05303dcfc57d50a193585e86d65163f546e4e99b6e4990959d68dfa6b53875,"[1, 0, 0, 1, 0, 1, 0, 0]"
ultima_cena10.jpg,914f8882327c283fa020a7859aa8077a018925d53d8c932881b779f73a9a67ff,"[1, 0, 1, 0, 0, 0, 0, 1]"
ultima_cena7.jpg,00142656a6bfb217ec05e343dc52d00787f64383258732521a69b8eea62beb80,"[1, 0, 1, 0, 0, 0, 0, 1]"
ultima_cena4.jpg,4d32af6c491ce630c71c7f1e0bded4d99b6d6288c980a530799163145a391d31,"[1, 1, 0, 0, 0, 0, 0, 0]"
ultima_cena1.jpg,3c265d1684edeb967877070f9e0aa5844d5fe1e3bfbbb917a4a34297989d9dc7,"[0, 0, 0, 0, 1, 0, 1, 1]"
ultima_cena14.jpg,0ec927a665d3f6b6fde9f24ca49194a2bc20031e87d1dd3bbb41798575cb47c2,"[0, 0, 1, 1, 0, 0, 1, 0]"
ultima_cena8.jpg,4d57c4be9e2ce1cc6bf9396ddf1b5023c5ec52ed719d3edf731390e1bb490948,"[1, 0, 0, 1, 1, 0, 0, 1]"
ultima_cena9.jpg,d7ad51c3dee1502febef92044c54a0d48257ace3519bdf670f0396762c5d2b2f,"[0, 0, 0, 0, 1, 0, 0, 1]"
ultima_cena12.jpg,2cc5638e07e1df81b8c1c412078f0970710a421df114b867f39ea0957d7cbad2,"[1, 1, 1, 0, 0, 0, 0, 1]"
ultima_cena5.jpg,a295631433f2b111453ffb7b5c4a9e95024933a7a710bec5611891c3eeca262b,"[0, 1, 0, 1, 0, 1, 0, 0]"
