,duomo_milano2.jpg,duomo_milano10.jpg,duomo_milano9.jpg,duomo_milano6.jpg,duomo_milano7.jpg,duomo_milano8.jpg,duomo_milano4.jpg,duomo_milano13.jpg,duomo_milano3.jpg,duomo_milano12.jpg,duomo_milano5.jpg,duomo_milano1.jpg,duomo_milano14.jpg,duomo_milano11.jpg,duomo_milano0.jpg
Type,SHA256,SHA256,SHA256,SHA256,SHA256,SHA256,SHA256,SHA256,SHA256,SHA256,SHA256,SHA256,SHA256,SHA256,SHA256
duomo_milano2.jpg,0,63,55,61,59,60,61,61,60,61,60,59,62,60,59
duomo_milano10.jpg,63,0,62,62,60,61,61,62,58,59,60,62,60,61,61
duomo_milano9.jpg,55,62,0,61,60,61,59,60,59,57,61,59,62,57,60
duomo_milano6.jpg,61,62,61,0,63,61,57,56,61,62,60,63,58,61,60
duomo_milano7.jpg,59,60,60,63,0,60,59,61,60,54,59,59,61,62,61
duomo_milano8.jpg,60,61,61,61,60,0,61,61,61,61,61,54,63,62,60
duomo_milano4.jpg,61,61,59,57,59,61,0,58,61,59,63,62,61,58,61
duomo_milano13.jpg,61,62,60,56,61,61,58,0,57,60,59,62,56,60,58
duomo_milano3.jpg,60,58,59,61,60,61,61,57,0,59,62,61,56,61,60
duomo_milano12.jpg,61,59,57,62,54,61,59,60,59,0,62,60,63,60,62
duomo_milano5.jpg,60,60,61,60,59,61,63,59,62,62,0,57,58,62,63
duomo_milano1.jpg,59,62,59,63,59,54,62,62,61,60,57,0,60,59,62
duomo_milano14.jpg,62,60,62,58,61,63,61,56,56,63,58,60,0,60,62
duomo_milano11.jpg,60,61,57,61,62,62,58,60,61,60,62,59,60,0,58
duomo_milano0.jpg,59,61,60,60,61,60,61,58,60,62,63,62,62,58,0
Type,Final-R,Final-R,Final-R,Final-R,Final-R,Final-R,Final-R,Final-R,Final-R,Final-R,Final-R,Final-R,Final-R,Final-R,Final-R
duomo_milano2.jpg,0,8,8,6,8,8,7,8,8,8,8,8,8,6,8
duomo_milano10.jpg,8,0,8,8,8,8,7,8,8,8,8,8,8,8,8
duomo_milano9.jpg,8,8,0,8,8,8,7,8,8,6,8,8,8,8,6
duomo_milano6.jpg,6,8,8,0,8,8,7,8,8,8,8,8,8,6,8
duomo_milano7.jpg,8,8,8,8,0,8,7,8,8,8,8,8,8,8,8
duomo_milano8.jpg,8,8,8,8,8,0,7,8,8,8,8,8,8,8,8
duomo_milano4.jpg,7,7,7,7,7,7,0,7,7,7,7,7,7,7,7
duomo_milano13.jpg,8,8,8,8,8,8,7,0,8,8,8,8,8,8,8
duomo_milano3.jpg,8,8,8,8,8,8,7,8,0,8,8,8,6,8,8
duomo_milano12.jpg,8,8,6,8,8,8,7,8,8,0,8,8,8,8,8
duomo_milano5.jpg,8,8,8,8,8,8,7,8,8,8,0,8,8,8,8
duomo_milano1.jpg,8,8,8,8,8,8,7,8,8,8,8,0,8,8,8
duomo_milano14.jpg,8,8,8,8,8,8,7,8,6,8,8,8,0,6,8
duomo_milano11.jpg,6,8,8,6,8,8,7,8,8,8,8,8,6,0,8
duomo_milano0.jpg,8,8,6,8,8,8,7,8,8,8,8,8,8,8,0
