,due_torri1.jpg,due_torri14.jpg,due_torri5.jpg,due_torri2.jpg,due_torri12.jpg,due_torri4.jpg,due_torri0.jpg,due_torri9.jpg,due_torri7.jpg,due_torri11.jpg,due_torri6.jpg,due_torri10.jpg,due_torri13.jpg,due_torri3.jpg,due_torri8.jpg
Type,Meta,Meta,Meta,Meta,Meta,Meta,Meta,Meta,Meta,Meta,Meta,Meta,Meta,Meta,Meta
due_torri1.jpg,0,5,5,4,4,4,5,4,5,5,6,4,4,4,5
due_torri14.jpg,5,0,5,5,4,3,6,6,5,7,5,5,5,6,5
due_torri5.jpg,5,5,0,4,3,4,4,3,5,5,4,4,4,4,5
due_torri2.jpg,4,5,4,0,2,4,6,5,6,6,6,6,5,5,4
due_torri12.jpg,4,4,3,2,0,4,6,4,6,5,6,5,4,4,4
due_torri4.jpg,4,3,4,4,4,0,5,6,4,7,3,5,6,6,6
due_torri0.jpg,5,6,4,6,6,5,0,3,4,6,4,4,5,5,5
due_torri9.jpg,4,6,3,5,4,6,3,0,4,4,5,3,3,3,4
due_torri7.jpg,5,5,5,6,6,4,4,4,0,6,2,3,5,6,6
due_torri11.jpg,5,7,5,6,5,7,6,4,6,0,7,5,4,5,6
due_torri6.jpg,6,5,4,6,6,3,4,5,2,7,0,4,6,6,6
due_torri10.jpg,4,5,4,6,5,5,4,3,3,5,4,0,3,5,6
due_torri13.jpg,4,5,4,5,4,6,5,3,5,4,6,3,0,4,4
due_torri3.jpg,4,6,4,5,4,6,5,3,6,5,6,5,4,0,4
due_torri8.jpg,5,5,5,4,4,6,5,4,6,6,6,6,4,4,0
Type,R-Meta,R-Meta,R-Meta,R-Meta,R-Meta,R-Meta,R-Meta,R-Meta,R-Meta,R-Meta,R-Meta,R-Meta,R-Meta,R-Meta,R-Meta
due_torri1.jpg,0,6,6,5,5,6,6,4,4,4,7,6,4,4,5
due_torri14.jpg,6,0,6,5,5,2,8,8,4,8,5,4,6,8,7
due_torri5.jpg,6,6,0,3,1,4,6,4,6,4,5,4,2,4,5
due_torri2.jpg,5,5,3,0,2,5,7,5,5,5,6,5,3,5,4
due_torri12.jpg,5,5,1,2,0,5,7,3,5,3,6,3,1,3,4
due_torri4.jpg,6,2,4,5,5,0,6,8,4,8,3,4,6,8,7
due_torri0.jpg,6,8,6,7,7,6,0,6,4,6,5,6,6,8,7
due_torri9.jpg,4,8,4,5,3,8,6,0,4,2,7,4,2,4,5
due_torri7.jpg,4,4,6,5,5,4,4,4,0,4,3,2,4,6,5
due_torri11.jpg,4,8,4,5,3,8,6,2,4,0,7,4,2,4,3
due_torri6.jpg,7,5,5,6,6,3,5,7,3,7,0,5,7,7,6
due_torri10.jpg,6,4,4,5,3,4,6,4,2,4,5,0,2,6,7
due_torri13.jpg,4,6,2,3,1,6,6,2,4,2,7,2,0,4,5
due_torri3.jpg,4,8,4,5,3,8,8,4,6,4,7,6,4,0,5
due_torri8.jpg,5,7,5,4,4,7,7,5,5,3,6,7,5,5,0
Type,Content,Content,Content,Content,Content,Content,Content,Content,Content,Content,Content,Content,Content,Content,Content
due_torri1.jpg,0,13,12,13,11,13,13,12,12,12,12,13,13,13,12
due_torri14.jpg,13,0,13,12,13,13,13,12,11,12,13,12,12,13,13
due_torri5.jpg,12,13,0,12,13,12,11,13,13,13,12,13,13,13,11
due_torri2.jpg,13,12,12,0,13,12,12,13,11,11,13,13,13,13,13
due_torri12.jpg,11,13,13,13,0,12,13,12,13,13,13,12,13,11,13
due_torri4.jpg,13,13,12,12,12,0,12,13,13,12,13,13,13,12,12
due_torri0.jpg,13,13,11,12,13,12,0,13,13,12,12,13,12,13,12
due_torri9.jpg,12,12,13,13,12,13,13,0,13,13,12,12,13,12,13
due_torri7.jpg,12,11,13,11,13,13,13,13,0,12,13,13,13,11,13
due_torri11.jpg,12,12,13,11,13,12,12,13,12,0,12,13,12,13,12
due_torri6.jpg,12,13,12,13,13,13,12,12,13,12,0,12,13,12,12
due_torri10.jpg,13,12,13,13,12,13,13,12,13,13,12,0,13,12,11
due_torri13.jpg,13,12,13,13,13,13,12,13,13,12,13,13,0,13,13
due_torri3.jpg,13,13,13,13,11,12,13,12,11,13,12,12,13,0,13
due_torri8.jpg,12,13,11,13,13,12,12,13,13,12,12,11,13,13,0
Type,R-Content,R-Content,R-Content,R-Content,R-Content,R-Content,R-Content,R-Content,R-Content,R-Content,R-Content,R-Content,R-Content,R-Content,R-Content
due_torri1.jpg,0,11,10,11,9,9,9,9,7,11,11,7,11,12,9
due_torri14.jpg,11,0,9,12,12,8,12,10,8,10,10,8,12,13,12
due_torri5.jpg,10,9,0,5,11,7,7,13,7,11,9,9,9,10,9
due_torri2.jpg,11,12,5,0,10,12,8,12,8,8,12,12,12,7,10
due_torri12.jpg,9,12,11,10,0,10,10,10,10,12,12,10,10,7,8
due_torri4.jpg,9,8,7,12,10,0,8,10,8,8,8,8,10,11,8
due_torri0.jpg,9,12,7,8,10,8,0,10,8,10,8,8,6,9,8
due_torri9.jpg,9,10,13,12,10,10,10,0,8,12,10,10,12,9,12
due_torri7.jpg,7,8,7,8,10,8,8,8,0,6,10,10,10,9,12
due_torri11.jpg,11,10,11,8,12,8,10,12,6,0,14,14,14,9,12
due_torri6.jpg,11,10,9,12,12,8,8,10,10,14,0,6,8,11,12
due_torri10.jpg,7,8,9,12,10,8,8,10,10,14,6,0,8,11,10
due_torri13.jpg,11,12,9,12,10,10,6,12,10,14,8,8,0,9,12
due_torri3.jpg,12,13,10,7,7,11,9,9,9,9,11,11,9,0,9
due_torri8.jpg,9,12,9,10,8,8,8,12,12,12,12,10,12,9,0
Type,Final-R,Final-R,Final-R,Final-R,Final-R,Final-R,Final-R,Final-R,Final-R,Final-R,Final-R,Final-R,Final-R,Final-R,Final-R
due_torri1.jpg,0,11,10,11,9,9,9,9,7,11,11,7,11,12,9
due_torri14.jpg,11,0,9,12,12,8,12,10,8,10,10,8,12,13,12
due_torri5.jpg,10,9,0,5,11,7,7,13,7,11,9,9,9,10,9
due_torri2.jpg,11,12,5,0,10,12,8,12,8,8,12,12,12,7,10
due_torri12.jpg,9,12,11,10,0,10,10,10,10,12,12,10,10,7,8
due_torri4.jpg,9,8,7,12,10,0,8,10,8,8,8,8,10,11,8
due_torri0.jpg,9,12,7,8,10,8,0,10,8,10,8,8,6,9,8
due_torri9.jpg,9,10,13,12,10,10,10,0,8,12,10,10,12,9,12
due_torri7.jpg,7,8,7,8,10,8,8,8,0,6,10,10,10,9,12
due_torri11.jpg,11,10,11,8,12,8,10,12,6,0,14,14,14,9,12
due_torri6.jpg,11,10,9,12,12,8,8,10,10,14,0,6,8,11,12
due_torri10.jpg,7,8,9,12,10,8,8,10,10,14,6,0,8,11,10
due_torri13.jpg,11,12,9,12,10,10,6,12,10,14,8,8,0,9,12
due_torri3.jpg,12,13,10,7,7,11,9,9,9,9,11,11,9,0,9
due_torri8.jpg,9,12,9,10,8,8,8,12,12,12,12,10,12,9,0
