,urlo_munch7.jpg,urlo_munch14.jpg,urlo_munch9.jpg,urlo_munch3.jpg,urlo_munch1.jpg,urlo_munch6.jpg,urlo_munch10.jpg,urlo_munch4.jpg,urlo_munch13.jpg,urlo_munch8.jpg,urlo_munch12.jpg,urlo_munch11.jpg,urlo_munch2.jpg,urlo_munch5.jpg,urlo_munch0.jpg
Type,SHA256,SHA256,SHA256,SHA256,SHA256,SHA256,SHA256,SHA256,SHA256,SHA256,SHA256,SHA256,SHA256,SHA256,SHA256
urlo_munch7.jpg,0,63,61,59,61,62,60,61,64,61,60,58,62,61,59
urlo_munch14.jpg,63,0,61,62,60,61,60,62,62,64,59,57,60,59,60
urlo_munch9.jpg,61,61,0,59,60,59,60,56,58,62,61,60,60,62,61
urlo_munch3.jpg,59,62,59,0,63,57,60,58,58,60,62,62,62,60,60
urlo_munch1.jpg,61,60,60,63,0,61,62,61,60,62,60,61,60,61,60
urlo_munch6.jpg,62,61,59,57,61,0,62,58,60,60,55,60,62,62,59
urlo_munch10.jpg,60,60,60,60,62,62,0,61,60,59,60,60,58,60,58
urlo_munch4.jpg,61,62,56,58,61,58,61,0,63,59,58,62,61,60,58
urlo_munch13.jpg,64,62,58,58,60,60,60,63,0,59,61,59,63,63,52
urlo_munch8.jpg,61,64,62,60,62,60,59,59,59,0,59,59,60,59,59
urlo_munch12.jpg,60,59,61,62,60,55,60,58,61,59,0,57,59,56,61
urlo_munch11.jpg,58,57,60,62,61,60,60,62,59,59,57,0,63,56,62
urlo_munch2.jpg,62,60,60,62,60,62,58,61,63,60,59,63,0,61,62
urlo_munch5.jpg,61,59,62,60,61,62,60,60,63,59,56,56,61,0,60
urlo_munch0.jpg,59,60,61,60,60,59,58,58,52,59,61,62,62,60,0
Type,Final-R,Final-R,Final-R,Final-R,Final-R,Final-R,Final-R,Final-R,Final-R,Final-R,Final-R,Final-R,Final-R,Final-R,Final-R
urlo_munch7.jpg,0,6,8,5,8,7,7,8,6,6,7,7,9,7,8
urlo_munch14.jpg,6,0,6,7,6,9,7,6,4,8,9,7,11,9,8
urlo_munch9.jpg,8,6,0,11,6,9,5,6,4,10,9,3,7,9,8
urlo_munch3.jpg,5,7,11,0,9,8,10,9,7,3,10,12,8,8,7
urlo_munch1.jpg,8,6,6,9,0,9,7,8,6,10,11,7,7,7,10
urlo_munch6.jpg,7,9,9,8,9,0,10,9,11,9,6,8,10,10,9
urlo_munch10.jpg,7,7,5,10,7,10,0,7,5,9,10,8,6,8,5
urlo_munch4.jpg,8,6,6,9,8,9,7,0,8,10,7,5,11,7,4
urlo_munch13.jpg,6,4,4,7,6,11,5,8,0,6,9,7,7,7,8
urlo_munch8.jpg,6,8,10,3,10,9,9,10,6,0,7,13,5,9,8
urlo_munch12.jpg,7,9,9,10,11,6,10,7,9,7,0,8,8,8,9
urlo_munch11.jpg,7,7,3,12,7,8,8,5,7,13,8,0,10,6,7
urlo_munch2.jpg,9,11,7,8,7,10,6,11,7,5,8,10,0,6,7
urlo_munch5.jpg,7,9,9,8,7,10,8,7,7,9,8,6,6,0,5
urlo_munch0.jpg,8,8,8,7,10,9,5,4,8,8,9,7,7,5,0
