,piazza_san_marco6.jpg,piazza_san_marco14.jpg,piazza_san_marco1.jpg,piazza_san_marco10.jpg,piazza_san_marco11.jpg,piazza_san_marco4.jpg,piazza_san_marco12.jpg,piazza_san_marco7.jpg,piazza_san_marco8.jpg,piazza_san_marco0.jpg,piazza_san_marco13.jpg,piazza_san_marco9.jpg,piazza_san_marco3.jpg,piazza_san_marco2.jpg,piazza_san_marco5.jpg
Type,SHA256,SHA256,SHA256,SHA256,SHA256,SHA256,SHA256,SHA256,SHA256,SHA256,SHA256,SHA256,SHA256,SHA256,SHA256
piazza_san_marco6.jpg,0,60,57,62,61,61,58,60,61,60,56,60,61,60,58
piazza_san_marco14.jpg,60,0,61,58,62,60,63,58,60,61,61,62,58,58,60
piazza_san_marco1.jpg,57,61,0,63,60,61,61,60,61,57,63,62,64,61,63
piazza_san_marco10.jpg,62,58,63,0,60,57,58,58,62,60,63,61,58,59,61
piazza_san_marco11.jpg,61,62,60,60,0,60,60,56,59,60,59,56,61,60,60
piazza_san_marco4.jpg,61,60,61,57,60,0,61,60,58,59,56,61,61,62,61
piazza_san_marco12.jpg,58,63,61,58,60,61,0,56,54,62,62,57,61,57,59
piazza_san_marco7.jpg,60,58,60,58,56,60,56,0,58,62,61,60,58,59,63
piazza_san_marco8.jpg,61,60,61,62,59,58,54,58,0,59,63,60,60,57,57
piazza_san_marco0.jpg,60,61,57,60,60,59,62,62,59,0,61,61,61,62,59
piazza_san_marco13.jpg,56,61,63,63,59,56,62,61,63,61,0,56,60,61,61
piazza_san_marco9.jpg,60,62,62,61,56,61,57,60,60,61,56,0,61,58,58
piazza_san_marco3.jpg,61,58,64,58,61,61,61,58,60,61,60,61,0,60,61
piazza_san_marco2.jpg,60,58,61,59,60,62,57,59,57,62,61,58,60,0,58
piazza_san_marco5.jpg,58,60,63,61,60,61,59,63,57,59,61,58,61,58,0
Type,Final-R,Final-R,Final-R,Final-R,Final-R,Final-R,Final-R,Final-R,Final-R,Final-R,Final-R,Final-R,Final-R,Final-R,Final-R
piazza_san_marco6.jpg,0,9,8,6,5,3,6,9,10,8,6,5,7,5,10
piazza_san_marco14.jpg,9,0,5,9,14,6,7,8,11,9,9,10,8,8,9
piazza_san_marco1.jpg,8,5,0,8,11,7,10,5,10,8,8,9,7,7,12
piazza_san_marco10.jpg,6,9,8,0,5,5,8,7,8,10,10,9,9,9,10
piazza_san_marco11.jpg,5,14,11,5,0,8,7,8,7,7,7,8,10,8,7
piazza_san_marco4.jpg,3,6,7,5,8,0,9,8,9,9,5,8,10,8,9
piazza_san_marco12.jpg,6,7,10,8,7,9,0,9,10,6,10,5,9,5,8
piazza_san_marco7.jpg,9,8,5,7,8,8,9,0,7,9,9,10,10,8,9
piazza_san_marco8.jpg,10,11,10,8,7,9,10,7,0,10,6,7,7,9,6
piazza_san_marco0.jpg,8,9,8,10,7,9,6,9,10,0,6,7,9,11,8
piazza_san_marco13.jpg,6,9,8,10,7,5,10,9,6,6,0,7,9,11,6
piazza_san_marco9.jpg,5,10,9,9,8,8,5,10,7,7,7,0,4,4,7
piazza_san_marco3.jpg,7,8,7,9,10,10,9,10,7,9,9,4,0,6,9
piazza_san_marco2.jpg,5,8,7,9,8,8,5,8,9,11,11,4,6,0,9
piazza_san_marco5.jpg,10,9,12,10,7,9,8,9,6,8,6,7,9,9,0
