,reggia_caserta11.jpg,reggia_caserta2.jpg,reggia_caserta14.jpg,reggia_caserta9.jpg,reggia_caserta10.jpg,reggia_caserta7.jpg,reggia_caserta8.jpg,reggia_caserta6.jpg,reggia_caserta1.jpg,reggia_caserta0.jpg,reggia_caserta5.jpg,reggia_caserta3.jpg,reggia_caserta12.jpg,reggia_caserta13.jpg,reggia_caserta4.jpg
Type,Meta,Meta,Meta,Meta,Meta,Meta,Meta,Meta,Meta,Meta,Meta,Meta,Meta,Meta,Meta
reggia_caserta11.jpg,0,5,6,3,4,3,4,2,1,4,3,5,3,3,4
reggia_caserta2.jpg,5,0,5,6,6,5,6,4,6,4,4,4,6,4,5
reggia_caserta14.jpg,6,5,0,6,3,5,5,6,5,3,4,4,4,5,3
reggia_caserta9.jpg,3,6,6,0,4,4,4,3,3,5,5,4,3,3,4
reggia_caserta10.jpg,4,6,3,4,0,4,6,4,3,3,4,5,2,5,1
reggia_caserta7.jpg,3,5,5,4,4,0,5,2,4,3,3,5,5,3,4
reggia_caserta8.jpg,4,6,5,4,6,5,0,6,4,6,6,5,5,5,6
reggia_caserta6.jpg,2,4,6,3,4,2,6,0,3,4,3,5,4,3,4
reggia_caserta1.jpg,1,6,5,3,3,4,4,3,0,3,4,4,2,4,3
reggia_caserta0.jpg,4,4,3,5,3,3,6,4,3,0,4,4,4,4,2
reggia_caserta5.jpg,3,4,4,5,4,3,6,3,4,4,0,5,5,5,4
reggia_caserta3.jpg,5,4,4,4,5,5,5,5,4,4,5,0,4,3,5
reggia_caserta12.jpg,3,6,4,3,2,5,5,4,2,4,5,4,0,4,2
reggia_caserta13.jpg,3,4,5,3,5,3,5,3,4,4,5,3,4,0,5
reggia_caserta4.jpg,4,5,3,4,1,4,6,4,3,2,4,5,2,5,0
Type,R-Meta,R-Meta,R-Meta,R-Meta,R-Meta,R-Meta,R-Meta,R-Meta,R-Meta,R-Meta,R-Meta,R-Meta,R-Meta,R-Meta,R-Meta
reggia_caserta11.jpg,0,4,5,1,3,2,2,2,0,3,5,2,2,1,3
reggia_caserta2.jpg,4,0,3,3,5,4,4,2,4,3,1,2,4,3,3
reggia_caserta14.jpg,5,3,0,4,2,3,3,3,5,4,2,5,5,4,4
reggia_caserta9.jpg,1,3,4,0,2,1,3,1,1,2,4,1,1,0,2
reggia_caserta10.jpg,3,5,2,2,0,1,3,3,3,2,4,3,3,2,2
reggia_caserta7.jpg,2,4,3,1,1,0,4,2,2,1,3,2,2,1,1
reggia_caserta8.jpg,2,4,3,3,3,4,0,4,2,5,5,4,4,3,5
reggia_caserta6.jpg,2,2,3,1,3,2,4,0,2,3,3,2,2,1,3
reggia_caserta1.jpg,0,4,5,1,3,2,2,2,0,3,5,2,2,1,3
reggia_caserta0.jpg,3,3,4,2,2,1,5,3,3,0,2,1,3,2,0
reggia_caserta5.jpg,5,1,2,4,4,3,5,3,5,2,0,3,5,4,2
reggia_caserta3.jpg,2,2,5,1,3,2,4,2,2,1,3,0,2,1,1
reggia_caserta12.jpg,2,4,5,1,3,2,4,2,2,3,5,2,0,1,3
reggia_caserta13.jpg,1,3,4,0,2,1,3,1,1,2,4,1,1,0,2
reggia_caserta4.jpg,3,3,4,2,2,1,5,3,3,0,2,1,3,2,0
Type,Content,Content,Content,Content,Content,Content,Content,Content,Content,Content,Content,Content,Content,Content,Content
reggia_caserta11.jpg,0,12,13,12,13,12,13,12,11,13,13,13,12,13,13
reggia_caserta2.jpg,12,0,12,13,11,13,10,13,13,13,12,13,13,13,11
reggia_caserta14.jpg,13,12,0,12,13,11,12,10,11,12,12,13,10,12,13
reggia_caserta9.jpg,12,13,12,0,12,13,11,12,13,11,12,12,12,11,12
reggia_caserta10.jpg,13,11,13,12,0,13,11,12,13,12,13,13,13,12,0
reggia_caserta7.jpg,12,13,11,13,13,0,13,13,13,13,13,13,9,13,13
reggia_caserta8.jpg,13,10,12,11,11,13,0,13,12,11,12,13,13,13,11
reggia_caserta6.jpg,12,13,10,12,12,13,13,0,11,12,12,13,12,12,12
reggia_caserta1.jpg,11,13,11,13,13,13,12,11,0,12,12,11,13,12,13
reggia_caserta0.jpg,13,13,12,11,12,13,11,12,12,0,13,12,11,10,12
reggia_caserta5.jpg,13,12,12,12,13,13,12,12,12,13,0,11,13,13,13
reggia_caserta3.jpg,13,13,13,12,13,13,13,13,11,12,11,0,13,13,13
reggia_caserta12.jpg,12,13,10,12,13,9,13,12,13,11,13,13,0,12,13
reggia_caserta13.jpg,13,13,12,11,12,13,13,12,12,10,13,13,12,0,12
reggia_caserta4.jpg,13,11,13,12,0,13,11,12,13,12,13,13,13,12,0
Type,R-Content,R-Content,R-Content,R-Content,R-Content,R-Content,R-Content,R-Content,R-Content,R-Content,R-Content,R-Content,R-Content,R-Content,R-Content
reggia_caserta11.jpg,0,11,11,13,13,7,12,11,7,9,11,10,10,11,13
reggia_caserta2.jpg,11,0,10,12,8,12,11,8,10,12,12,13,13,10,8
reggia_caserta14.jpg,11,10,0,10,12,8,11,8,10,8,12,7,9,10,12
reggia_caserta9.jpg,13,12,10,0,8,12,11,8,10,8,10,9,9,6,8
reggia_caserta10.jpg,13,8,12,8,0,12,7,8,10,10,10,13,11,10,0
reggia_caserta7.jpg,7,12,8,12,12,0,11,12,8,8,10,9,7,12,12
reggia_caserta8.jpg,12,11,11,11,7,11,0,11,7,7,9,10,14,9,7
reggia_caserta6.jpg,11,8,8,8,8,12,11,0,10,10,12,11,9,8,8
reggia_caserta1.jpg,7,10,10,10,10,8,7,10,0,8,10,9,11,8,10
reggia_caserta0.jpg,9,12,8,8,10,8,7,10,8,0,10,7,9,6,10
reggia_caserta5.jpg,11,12,12,10,10,10,9,12,10,10,0,9,13,10,10
reggia_caserta3.jpg,10,13,7,9,13,9,10,11,9,7,9,0,12,9,13
reggia_caserta12.jpg,10,13,9,9,11,7,14,9,11,9,13,12,0,11,11
reggia_caserta13.jpg,11,10,10,6,10,12,9,8,8,6,10,9,11,0,10
reggia_caserta4.jpg,13,8,12,8,0,12,7,8,10,10,10,13,11,10,0
Type,Final-R,Final-R,Final-R,Final-R,Final-R,Final-R,Final-R,Final-R,Final-R,Final-R,Final-R,Final-R,Final-R,Final-R,Final-R
reggia_caserta11.jpg,0,11,11,13,13,7,12,11,7,9,11,10,10,11,13
reggia_caserta2.jpg,11,0,10,12,8,12,11,8,10,12,12,13,13,10,8
reggia_caserta14.jpg,11,10,0,10,12,8,11,8,10,8,12,7,9,10,12
reggia_caserta9.jpg,13,12,10,0,8,12,11,8,10,8,10,9,9,6,8
reggia_caserta10.jpg,13,8,12,8,0,12,7,8,10,10,10,13,11,10,0
reggia_caserta7.jpg,7,12,8,12,12,0,11,12,8,8,10,9,7,12,12
reggia_caserta8.jpg,12,11,11,11,7,11,0,11,7,7,9,10,14,9,7
reggia_caserta6.jpg,11,8,8,8,8,12,11,0,10,10,12,11,9,8,8
reggia_caserta1.jpg,7,10,10,10,10,8,7,10,0,8,10,9,11,8,10
reggia_caserta0.jpg,9,12,8,8,10,8,7,10,8,0,10,7,9,6,10
reggia_caserta5.jpg,11,12,12,10,10,10,9,12,10,10,0,9,13,10,10
reggia_caserta3.jpg,10,13,7,9,13,9,10,11,9,7,9,0,12,9,13
reggia_caserta12.jpg,10,13,9,9,11,7,14,9,11,9,13,12,0,11,11
reggia_caserta13.jpg,11,10,10,6,10,12,9,8,8,6,10,9,11,0,10
reggia_caserta4.jpg,13,8,12,8,0,12,7,8,10,10,10,13,11,10,0
