,taj_mahal9.jpg,taj_mahal3.jpg,taj_mahal10.jpg,taj_mahal13.jpg,taj_mahal12.jpg,taj_mahal14.jpg,taj_mahal4.jpg,taj_mahal0.jpg,taj_mahal8.jpg,taj_mahal6.jpg,taj_mahal2.jpg,taj_mahal11.jpg,taj_mahal1.jpg,taj_mahal5.jpg,taj_mahal7.jpg
Type,Meta,Meta,Meta,Meta,Meta,Meta,Meta,Meta,Meta,Meta,Meta,Meta,Meta,Meta,Meta
taj_mahal9.jpg,0,4,3,3,6,3,1,4,4,6,5,5,5,5,5
taj_mahal3.jpg,4,0,4,5,4,4,4,4,3,5,5,5,6,5,4
taj_mahal10.jpg,3,4,0,3,6,2,3,4,5,5,5,4,3,5,5
taj_mahal13.jpg,3,5,3,0,6,3,4,3,6,5,4,6,5,5,6
taj_mahal12.jpg,6,4,6,6,0,6,6,7,4,6,5,4,5,6,5
taj_mahal14.jpg,3,4,2,3,6,0,3,4,5,6,5,5,4,5,5
taj_mahal4.jpg,1,4,3,4,6,3,0,4,4,6,5,5,5,5,5
taj_mahal0.jpg,4,4,4,3,7,4,4,0,6,5,4,7,6,5,5
taj_mahal8.jpg,4,3,5,6,4,5,4,6,0,4,5,4,6,6,3
taj_mahal6.jpg,6,5,5,5,6,6,6,5,4,0,5,5,6,6,4
taj_mahal2.jpg,5,5,5,4,5,5,5,4,5,5,0,6,5,5,5
taj_mahal11.jpg,5,5,4,6,4,5,5,7,4,5,6,0,3,6,5
taj_mahal1.jpg,5,6,3,5,5,4,5,6,6,6,5,3,0,6,6
taj_mahal5.jpg,5,5,5,5,6,5,5,5,6,6,5,6,6,0,7
taj_mahal7.jpg,5,4,5,6,5,5,5,5,3,4,5,5,6,7,0
Type,R-Meta,R-Meta,R-Meta,R-Meta,R-Meta,R-Meta,R-Meta,R-Meta,R-Meta,R-Meta,R-Meta,R-Meta,R-Meta,R-Meta,R-Meta
taj_mahal9.jpg,0,3,1,2,3,1,0,3,1,4,3,1,2,3,3
taj_mahal3.jpg,3,0,2,3,2,2,3,4,2,3,4,2,3,6,2
taj_mahal10.jpg,1,2,0,1,2,0,1,2,0,3,2,2,1,4,2
taj_mahal13.jpg,2,3,1,0,1,1,2,1,1,2,1,3,2,5,3
taj_mahal12.jpg,3,2,2,1,0,2,3,2,2,1,2,2,3,6,2
taj_mahal14.jpg,1,2,0,1,2,0,1,2,0,3,2,2,1,4,2
taj_mahal4.jpg,0,3,1,2,3,1,0,3,1,4,3,1,2,3,3
taj_mahal0.jpg,3,4,2,1,2,2,3,0,2,3,2,4,3,6,4
taj_mahal8.jpg,1,2,0,1,2,0,1,2,0,3,2,2,1,4,2
taj_mahal6.jpg,4,3,3,2,1,3,4,3,3,0,3,3,4,5,3
taj_mahal2.jpg,3,4,2,1,2,2,3,2,2,3,0,4,3,6,2
taj_mahal11.jpg,1,2,2,3,2,2,1,4,2,3,4,0,3,4,2
taj_mahal1.jpg,2,3,1,2,3,1,2,3,1,4,3,3,0,3,3
taj_mahal5.jpg,3,6,4,5,6,4,3,6,4,5,6,4,3,0,6
taj_mahal7.jpg,3,2,2,3,2,2,3,4,2,3,2,2,3,6,0
Type,Content,Content,Content,Content,Content,Content,Content,Content,Content,Content,Content,Content,Content,Content,Content
taj_mahal9.jpg,0,12,13,13,13,12,12,13,13,13,12,12,12,13,12
taj_mahal3.jpg,12,0,13,13,12,12,13,13,12,12,13,13,12,13,11
taj_mahal10.jpg,13,13,0,13,12,12,12,11,13,13,10,12,10,12,11
taj_mahal13.jpg,13,13,13,0,13,13,12,13,13,13,12,9,12,13,13
taj_mahal12.jpg,13,12,12,13,0,11,13,12,12,12,12,13,12,13,12
taj_mahal14.jpg,12,12,12,13,11,0,13,13,12,12,11,13,10,12,10
taj_mahal4.jpg,12,13,12,12,13,13,0,13,13,12,13,12,13,13,13
taj_mahal0.jpg,13,13,11,13,12,13,13,0,13,13,13,12,12,13,11
taj_mahal8.jpg,13,12,13,13,12,12,13,13,0,12,13,13,13,13,13
taj_mahal6.jpg,13,12,13,13,12,12,12,13,12,0,12,13,13,13,12
taj_mahal2.jpg,12,13,10,12,12,11,13,13,13,12,0,11,11,12,11
taj_mahal11.jpg,12,13,12,9,13,13,12,12,13,13,11,0,12,13,13
taj_mahal1.jpg,12,12,10,12,12,10,13,12,13,13,11,12,0,13,12
taj_mahal5.jpg,13,13,12,13,13,12,13,13,13,13,12,13,13,0,13
taj_mahal7.jpg,12,11,11,13,12,10,13,11,13,12,11,13,12,13,0
Type,R-Content,R-Content,R-Content,R-Content,R-Content,R-Content,R-Content,R-Content,R-Content,R-Content,R-Content,R-Content,R-Content,R-Content,R-Content
taj_mahal9.jpg,0,8,12,12,9,8,9,10,6,11,10,10,12,13,12
taj_mahal3.jpg,8,0,10,12,5,6,13,12,8,9,14,8,12,11,10
taj_mahal10.jpg,12,10,0,8,13,8,11,10,10,11,10,12,6,9,10
taj_mahal13.jpg,12,12,8,0,9,12,9,4,10,9,10,6,10,7,8
taj_mahal12.jpg,9,5,13,9,0,7,10,9,9,8,13,3,13,10,11
taj_mahal14.jpg,8,6,8,12,7,0,11,12,10,9,10,8,6,11,12
taj_mahal4.jpg,9,13,11,9,10,11,0,7,9,8,7,9,11,10,11
taj_mahal0.jpg,10,12,10,4,9,12,7,0,10,9,8,6,10,11,8
taj_mahal8.jpg,6,8,10,10,9,10,9,10,0,9,10,8,12,11,10
taj_mahal6.jpg,11,9,11,9,8,9,8,9,9,0,9,7,11,8,9
taj_mahal2.jpg,10,14,10,10,13,10,7,8,10,9,0,10,10,11,12
taj_mahal11.jpg,10,8,12,6,3,8,9,6,8,7,10,0,12,9,8
taj_mahal1.jpg,12,12,6,10,13,6,11,10,12,11,10,12,0,9,10
taj_mahal5.jpg,13,11,9,7,10,11,10,11,11,8,11,9,9,0,11
taj_mahal7.jpg,12,10,10,8,11,12,11,8,10,9,12,8,10,11,0
Type,Final-R,Final-R,Final-R,Final-R,Final-R,Final-R,Final-R,Final-R,Final-R,Final-R,Final-R,Final-R,Final-R,Final-R,Final-R
taj_mahal9.jpg,0,7,9,10,9,6,8,9,5,8,9,8,11,10,10
taj_mahal3.jpg,7,0,10,13,4,7,11,12,8,7,14,5,14,11,11
taj_mahal10.jpg,9,10,0,9,14,7,7,10,8,11,8,11,6,9,11
taj_mahal13.jpg,10,13,9,0,9,12,6,3,9,8,7,8,9,8,10
taj_mahal12.jpg,9,4,14,9,0,9,9,8,10,5,12,5,14,11,13
taj_mahal14.jpg,6,7,7,12,9,0,10,11,9,8,9,10,7,12,12
taj_mahal4.jpg,8,11,7,6,9,10,0,5,7,8,7,8,9,8,10
taj_mahal0.jpg,9,12,10,3,8,11,5,0,8,7,6,7,8,11,9
taj_mahal8.jpg,5,8,8,9,10,9,7,8,0,7,8,7,12,9,11
taj_mahal6.jpg,8,7,11,8,5,8,8,7,7,0,9,6,13,10,10
taj_mahal2.jpg,9,14,8,7,12,9,7,6,8,9,0,11,10,13,11
taj_mahal11.jpg,8,5,11,8,5,10,8,7,7,6,11,0,13,8,8
taj_mahal1.jpg,11,14,6,9,14,7,9,8,12,13,10,13,0,11,11
taj_mahal5.jpg,10,11,9,8,11,12,8,11,9,10,13,8,11,0,14
taj_mahal7.jpg,10,11,11,10,13,12,10,9,11,10,11,8,11,14,0
