,cinque_terre10.jpg,cinque_terre2.jpg,cinque_terre7.jpg,cinque_terre4.jpg,cinque_terre0.jpg,cinque_terre8.jpg,cinque_terre1.jpg,cinque_terre9.jpg,cinque_terre3.jpg,cinque_terre5.jpg,cinque_terre6.jpg,cinque_terre14.jpg,cinque_terre12.jpg,cinque_terre11.jpg,cinque_terre13.jpg
Type,Meta,Meta,Meta,Meta,Meta,Meta,Meta,Meta,Meta,Meta,Meta,Meta,Meta,Meta,Meta
cinque_terre10.jpg,0,5,4,6,4,5,4,6,5,5,7,3,4,4,3
cinque_terre2.jpg,5,0,6,6,5,5,3,3,5,3,7,5,2,3,6
cinque_terre7.jpg,4,6,0,5,4,3,6,5,6,4,6,4,5,6,6
cinque_terre4.jpg,6,6,5,0,4,5,4,3,4,4,5,6,6,4,6
cinque_terre0.jpg,4,5,4,4,0,4,3,5,4,6,5,5,5,4,5
cinque_terre8.jpg,5,5,3,5,4,0,4,3,5,4,6,4,5,5,6
cinque_terre1.jpg,4,3,6,4,3,4,0,3,3,4,6,4,3,2,5
cinque_terre9.jpg,6,3,5,3,5,3,3,0,4,1,7,5,3,3,7
cinque_terre3.jpg,5,5,6,4,4,5,3,4,0,5,7,5,5,4,6
cinque_terre5.jpg,5,3,4,4,6,4,4,1,5,0,7,4,2,3,7
cinque_terre6.jpg,7,7,6,5,5,6,6,7,7,7,0,7,7,6,7
cinque_terre14.jpg,3,5,4,6,5,4,4,5,5,4,7,0,4,4,4
cinque_terre12.jpg,4,2,5,6,5,5,3,3,5,2,7,4,0,3,6
cinque_terre11.jpg,4,3,6,4,4,5,2,3,4,3,6,4,3,0,5
cinque_terre13.jpg,3,6,6,6,5,6,5,7,6,7,7,4,6,5,0
Type,R-Meta,R-Meta,R-Meta,R-Meta,R-Meta,R-Meta,R-Meta,R-Meta,R-Meta,R-Meta,R-Meta,R-Meta,R-Meta,R-Meta,R-Meta
cinque_terre10.jpg,0,6,6,4,4,6,4,4,4,4,6,3,6,3,1
cinque_terre2.jpg,6,0,6,6,6,4,4,2,6,2,6,3,2,3,5
cinque_terre7.jpg,6,6,0,4,2,4,6,6,6,6,4,5,6,5,5
cinque_terre4.jpg,4,6,4,0,2,6,4,4,4,4,2,3,6,3,3
cinque_terre0.jpg,4,6,2,2,0,4,4,4,4,4,4,3,6,3,3
cinque_terre8.jpg,6,4,4,6,4,0,2,4,6,4,4,3,4,3,5
cinque_terre1.jpg,4,4,6,4,4,2,0,2,4,2,4,1,4,1,3
cinque_terre9.jpg,4,2,6,4,4,4,2,0,4,0,6,1,2,1,3
cinque_terre3.jpg,4,6,6,4,4,6,4,4,0,4,6,3,6,3,3
cinque_terre5.jpg,4,2,6,4,4,4,2,0,4,0,6,1,2,1,3
cinque_terre6.jpg,6,6,4,2,4,4,4,6,6,6,0,5,6,5,5
cinque_terre14.jpg,3,3,5,3,3,3,1,1,3,1,5,0,3,0,2
cinque_terre12.jpg,6,2,6,6,6,4,4,2,6,2,6,3,0,3,5
cinque_terre11.jpg,3,3,5,3,3,3,1,1,3,1,5,0,3,0,2
cinque_terre13.jpg,1,5,5,3,3,5,3,3,3,3,5,2,5,2,0
Type,Content,Content,Content,Content,Content,Content,Content,Content,Content,Content,Content,Content,Content,Content,Content
cinque_terre10.jpg,0,12,10,12,12,13,13,13,10,13,13,12,13,13,12
cinque_terre2.jpg,12,0,11,12,11,13,13,12,12,12,13,11,13,12,12
cinque_terre7.jpg,10,11,0,12,13,13,13,13,10,13,13,13,13,12,13
cinque_terre4.jpg,12,12,12,0,11,13,12,12,10,11,13,12,13,13,13
cinque_terre0.jpg,12,11,13,11,0,12,13,13,13,13,12,13,12,13,12
cinque_terre8.jpg,13,13,13,13,12,0,12,12,12,13,12,12,13,13,13
cinque_terre1.jpg,13,13,13,12,13,12,0,13,12,13,12,13,12,13,13
cinque_terre9.jpg,13,12,13,12,13,12,13,0,13,12,13,12,12,13,12
cinque_terre3.jpg,10,12,10,10,13,12,12,13,0,13,13,13,13,12,13
cinque_terre5.jpg,13,12,13,11,13,13,13,12,13,0,13,12,13,13,13
cinque_terre6.jpg,13,13,13,13,12,12,12,13,13,13,0,13,11,12,12
cinque_terre14.jpg,12,11,13,12,13,12,13,12,13,12,13,0,12,13,13
cinque_terre12.jpg,13,13,13,13,12,13,12,12,13,13,11,12,0,13,13
cinque_terre11.jpg,13,12,12,13,13,13,13,13,12,13,12,13,13,0,12
cinque_terre13.jpg,12,12,13,13,12,13,13,12,13,13,12,13,13,12,0
Type,R-Content,R-Content,R-Content,R-Content,R-Content,R-Content,R-Content,R-Content,R-Content,R-Content,R-Content,R-Content,R-Content,R-Content,R-Content
cinque_terre10.jpg,0,13,10,9,9,9,12,10,9,10,10,12,6,12,9
cinque_terre2.jpg,13,0,11,8,8,12,11,7,12,7,11,9,11,9,10
cinque_terre7.jpg,10,11,0,9,11,9,12,12,7,10,12,10,12,10,11
cinque_terre4.jpg,9,8,9,0,10,12,11,7,6,9,11,11,9,9,12
cinque_terre0.jpg,9,8,11,10,0,10,7,7,10,11,9,11,7,9,8
cinque_terre8.jpg,9,12,9,12,10,0,13,11,12,11,13,7,11,11,12
cinque_terre1.jpg,12,11,12,11,7,13,0,8,7,12,12,12,10,8,9
cinque_terre9.jpg,10,7,12,7,7,11,8,0,11,10,10,10,10,6,7
cinque_terre3.jpg,9,12,7,6,10,12,7,11,0,9,9,13,11,9,10
cinque_terre5.jpg,10,7,10,9,11,11,12,10,9,0,12,10,12,12,13
cinque_terre6.jpg,10,11,12,11,9,13,12,10,9,12,0,12,8,10,5
cinque_terre14.jpg,12,9,10,11,11,7,12,10,13,10,12,0,12,12,11
cinque_terre12.jpg,6,11,12,9,7,11,10,10,11,12,8,12,0,10,9
cinque_terre11.jpg,12,9,10,9,9,11,8,6,9,12,10,12,10,0,7
cinque_terre13.jpg,9,10,11,12,8,12,9,7,10,13,5,11,9,7,0
Type,Final-R,Final-R,Final-R,Final-R,Final-R,Final-R,Final-R,Final-R,Final-R,Final-R,Final-R,Final-R,Final-R,Final-R,Final-R
cinque_terre10.jpg,0,6,6,4,4,6,4,4,4,4,6,3,6,3,1
cinque_terre2.jpg,6,0,6,6,6,4,4,2,6,2,6,3,2,3,5
cinque_terre7.jpg,6,6,0,4,2,4,6,6,6,6,4,5,6,5,5
cinque_terre4.jpg,4,6,4,0,2,6,4,4,4,4,2,3,6,3,3
cinque_terre0.jpg,4,6,2,2,0,4,4,4,4,4,4,3,6,3,3
cinque_terre8.jpg,6,4,4,6,4,0,2,4,6,4,4,3,4,3,5
cinque_terre1.jpg,4,4,6,4,4,2,0,2,4,2,4,1,4,1,3
cinque_terre9.jpg,4,2,6,4,4,4,2,0,4,0,6,1,2,1,3
cinque_terre3.jpg,4,6,6,4,4,6,4,4,0,4,6,3,6,3,3
cinque_terre5.jpg,4,2,6,4,4,4,2,0,4,0,6,1,2,1,3
cinque_terre6.jpg,6,6,4,2,4,4,4,6,6,6,0,5,6,5,5
cinque_terre14.jpg,3,3,5,3,3,3,1,1,3,1,5,0,3,0,2
cinque_terre12.jpg,6,2,6,6,6,4,4,2,6,2,6,3,0,3,5
cinque_terre11.jpg,3,3,5,3,3,3,1,1,3,1,5,0,3,0,2
cinque_terre13.jpg,1,5,5,3,3,5,3,3,3,3,5,2,5,2,0
