,monalisa11.jpg,monalisa13.jpg,monalisa2.jpg,monalisa12.jpg,monalisa6.jpg,monalisa1.jpg,monalisa4.jpg,monalisa0.jpg,monalisa10.jpg,monalisa7.jpg,monalisa14.jpg,monalisa5.jpg,monalisa3.jpg,monalisa8.jpg,monalisa9.jpg
Type,SHA256,SHA256,SHA256,SHA256,SHA256,SHA256,SHA256,SHA256,SHA256,SHA256,SHA256,SHA256,SHA256,SHA256,SHA256
monalisa11.jpg,0,59,62,59,61,58,58,59,61,58,63,59,63,63,62
monalisa13.jpg,59,0,62,61,59,64,62,61,59,60,61,59,61,62,63
monalisa2.jpg,62,62,0,61,59,63,58,61,59,61,56,63,62,59,61
monalisa12.jpg,59,61,61,0,58,63,57,59,61,63,56,58,59,60,62
monalisa6.jpg,61,59,59,58,0,59,62,62,61,63,56,60,63,64,60
monalisa1.jpg,58,64,63,63,59,0,58,58,59,60,63,61,61,64,58
monalisa4.jpg,58,62,58,57,62,58,0,57,56,59,58,62,61,59,58
monalisa0.jpg,59,61,61,59,62,58,57,0,62,59,60,60,60,57,59
monalisa10.jpg,61,59,59,61,61,59,56,62,0,58,62,60,61,60,61
monalisa7.jpg,58,60,61,63,63,60,59,59,58,0,60,59,59,62,62
monalisa14.jpg,63,61,56,56,56,63,58,60,62,60,0,61,62,62,56
monalisa5.jpg,59,59,63,58,60,61,62,60,60,59,61,0,59,61,61
monalisa3.jpg,63,61,62,59,63,61,61,60,61,59,62,59,0,60,60
monalisa8.jpg,63,62,59,60,64,64,59,57,60,62,62,61,60,0,60
monalisa9.jpg,62,63,61,62,60,58,58,59,61,62,56,61,60,60,0
Type,Final-R,Final-R,Final-R,Final-R,Final-R,Final-R,Final-R,Final-R,Final-R,Final-R,Final-R,Final-R,Final-R,Final-R,Final-R
monalisa11.jpg,0,8,7,8,7,8,4,9,11,8,7,9,10,12,9
monalisa13.jpg,8,0,5,8,7,4,8,5,7,8,5,7,6,8,9
monalisa2.jpg,7,5,0,9,6,7,7,8,4,9,6,8,9,11,12
monalisa12.jpg,8,8,9,0,11,10,8,9,9,10,7,9,10,6,7
monalisa6.jpg,7,7,6,11,0,7,7,10,6,3,6,6,3,7,10
monalisa1.jpg,8,4,7,10,7,0,6,5,9,8,7,3,4,6,5
monalisa4.jpg,4,8,7,8,7,6,0,9,11,6,11,5,8,10,9
monalisa0.jpg,9,5,8,9,10,5,9,0,8,9,8,6,9,7,6
monalisa10.jpg,11,7,4,9,6,9,11,8,0,9,6,8,9,7,10
monalisa7.jpg,8,8,9,10,3,8,6,9,9,0,9,7,4,8,7
monalisa14.jpg,7,5,6,7,6,7,11,8,6,9,0,10,7,9,8
monalisa5.jpg,9,7,8,9,6,3,5,6,8,7,10,0,5,5,6
monalisa3.jpg,10,6,9,10,3,4,8,9,9,4,7,5,0,4,7
monalisa8.jpg,12,8,11,6,7,6,10,7,7,8,9,5,4,0,5
monalisa9.jpg,9,9,12,7,10,5,9,6,10,7,8,6,7,5,0
