Img-Name,SHA256,Final-R
arena_verona0.jpg,391f4300f492335ba7770bbc22d61b0016bf834a4dcb846f96874361763d1ecf,"[1, 0, 0, 0, 0, 0, 0, 0, 0, 0, 0, 1, 0, 0, 0, 1]"
arena_verona1.jpg,4cb52605d1e1e3dd9470e7eb85112403364fc6e0ddfb3d8d4cc1e4f485a154ca,"[0, 0, 0, 1, 0, 0, 0, 0, 0, 0, 1, 0, 0, 1, 0, 0]"
arena_verona10.jpg,25ece53d7a6ae19874f663636bf083803c466009ad504c527fd9ab730fa7135c,"[1, 0, 1, 0, 0, 0, 0, 0, 1, 0, 0, 0, 1, 0, 0, 0]"
arena_verona11.jpg,9e5b0dd1fe804900540e5ef61e4484b290f3e891782e7d6cf8c66d1fb2d84899,"[1, 0, 1, 0, 0, 0, 0, 0, 0, 1, 0, 0, 1, 0, 0, 0]"
arena_verona12.jpg,4ec1783451170a40d76125aa6b60f724d247fe9929148a4ba3497111b5160023,"[1, 0, 0, 1, 1, 0, 0, 0, 0, 0, 0, 1, 0, 0, 0, 0]"
arena_verona13.jpg,91ecff3b53910ef7f66dd965a9e895728104e9f8243d039fd5486ee3b7337653,"[0, 0, 1, 1, 0, 0, 0, 1, 0, 0, 0, 0, 0, 0, 0, 1]"
arena_verona14.jpg,71cc4b911373953807b0f175d8809fe5dc547f5c28298519808139f69ef58d17,"[0, 0, 0, 0, 0, 1, 0, 1, 1, 1, 0, 0, 0, 0, 0, 0]"
arena_verona2.jpg,8c197d8d8105a26afad97793a9f7531a856ff4b2daaafaa163b0969e5f69d41a,"[0, 1, 0, 0, 0, 0, 0, 0, 0, 0, 1, 0, 0, 0, 0, 0]"
arena_verona3.jpg,e34299ab8a3d79ad978a2bb1f73bbf3cd2154fab6ec802bedfb0aed19738e4f9,"[0, 0, 0, 0, 0, 0, 0, 0, 0, 1, 0, 0, 1, 1, 1, 0]"
arena_verona4.jpg,be62640074b8af3845ec237c569707c4b8b10ca97cebc9decfe165f19b42dfd6,"[0, 0, 0, 0, 1, 0, 1, 0, 1, 0, 0, 0, 0, 0, 1, 0]"
arena_verona5.jpg,99df40077a8c1536581067d31127d0b49127cf5693e7ae2e685657ae60405c81,"[0, 1, 0, 0, 1, 0, 1, 0, 0, 0, 0, 0, 0, 0, 1, 0]"
arena_verona6.jpg,04203c4314f4c15c5ec2d21a5d6660a35777a2810fa3cee2c1ce7619af774bc6,"[0, 0, 1, 1, 0, 0, 1, 0, 0, 0, 0, 0, 1, 0, 0, 0]"
arena_verona7.jpg,76f2ce22209ec01bfe4cc970c80c2a836b1095e5b7132ab9f663ef85a079c7c8,"[0, 0, 0, 1, 0, 0, 0, 0, 1, 1, 0, 1, 0, 0, 0, 0]"
arena_verona8.jpg,28448d95760554064f664ae8682d73668c206f3cf5f056658b2e93b1fad7cced,"[0, 0, 0, 0, 0, 1, 1, 0, 0, 0, 0, 0, 0, 1, 0, 0]"
arena_verona9.jpg,8165da4c64a19e3fa6eb06f35b7fd94acfb69d4e4023491de64f4af0ea5c3776,"[0, 0, 0, 0, 0, 0, 1, 0, 0, 0, 1, 0, 0, 1, 0, 1]"
