,basilica_san_marco8.jpg,basilica_san_marco4.jpg,basilica_san_marco1.jpg,basilica_san_marco6.jpg,basilica_san_marco14.jpg,basilica_san_marco7.jpg,basilica_san_marco2.jpg,basilica_san_marco10.jpg,basilica_san_marco11.jpg,basilica_san_marco0.jpg,basilica_san_marco3.jpg,basilica_san_marco13.jpg,basilica_san_marco12.jpg,basilica_san_marco9.jpg,basilica_san_marco5.jpg
Type,SHA256,SHA256,SHA256,SHA256,SHA256,SHA256,SHA256,SHA256,SHA256,SHA256,SHA256,SHA256,SHA256,SHA256,SHA256
basilica_san_marco8.jpg,0,61,63,61,57,60,62,57,60,61,60,60,60,60,59
basilica_san_marco4.jpg,61,0,62,60,60,60,64,59,57,63,56,59,57,59,60
basilica_san_marco1.jpg,63,62,0,60,62,60,64,60,58,63,59,62,62,58,60
basilica_san_marco6.jpg,61,60,60,0,60,57,62,59,61,58,57,62,63,61,62
basilica_san_marco14.jpg,57,60,62,60,0,59,58,61,58,55,60,62,62,58,62
basilica_san_marco7.jpg,60,60,60,57,59,0,57,61,61,58,60,62,59,64,61
basilica_san_marco2.jpg,62,64,64,62,58,57,0,61,63,58,60,60,61,62,58
basilica_san_marco10.jpg,57,59,60,59,61,61,61,0,60,61,60,59,59,61,60
basilica_san_marco11.jpg,60,57,58,61,58,61,63,60,0,59,63,60,63,57,60
basilica_san_marco0.jpg,61,63,63,58,55,58,58,61,59,0,61,59,60,62,59
basilica_san_marco3.jpg,60,56,59,57,60,60,60,60,63,61,0,60,56,62,60
basilica_san_marco13.jpg,60,59,62,62,62,62,60,59,60,59,60,0,61,63,58
basilica_san_marco12.jpg,60,57,62,63,62,59,61,59,63,60,56,61,0,59,59
basilica_san_marco9.jpg,60,59,58,61,58,64,62,61,57,62,62,63,59,0,59
basilica_san_marco5.jpg,59,60,60,62,62,61,58,60,60,59,60,58,59,59,0
Type,Final-R,Final-R,Final-R,Final-R,Final-R,Final-R,Final-R,Final-R,Final-R,Final-R,Final-R,Final-R,Final-R,Final-R,Final-R
basilica_san_marco8.jpg,0,4,7,6,8,6,5,5,8,8,8,8,5,8,4
basilica_san_marco4.jpg,4,0,5,4,8,6,7,7,8,8,8,8,3,8,6
basilica_san_marco1.jpg,7,5,0,5,7,5,6,6,5,3,5,7,6,7,7
basilica_san_marco6.jpg,6,4,5,0,6,4,7,7,4,6,8,8,5,8,6
basilica_san_marco14.jpg,8,8,7,6,0,6,5,7,4,6,8,8,7,8,8
basilica_san_marco7.jpg,6,6,5,4,6,0,5,5,6,6,8,8,7,8,8
basilica_san_marco2.jpg,5,7,6,7,5,5,0,4,5,7,5,7,6,7,7
basilica_san_marco10.jpg,5,7,6,7,7,5,4,0,7,7,7,5,4,7,7
basilica_san_marco11.jpg,8,8,5,4,4,6,5,7,0,4,6,8,7,8,8
basilica_san_marco0.jpg,8,8,3,6,6,6,7,7,4,0,6,8,7,8,8
basilica_san_marco3.jpg,8,8,5,8,8,8,5,7,6,6,0,6,7,6,8
basilica_san_marco13.jpg,8,8,7,8,8,8,7,5,8,8,6,0,7,6,8
basilica_san_marco12.jpg,5,3,6,5,7,7,6,4,7,7,7,7,0,7,5
basilica_san_marco9.jpg,8,8,7,8,8,8,7,7,8,8,6,6,7,0,4
basilica_san_marco5.jpg,4,6,7,6,8,8,7,7,8,8,8,8,5,4,0
