,piazza_san_marco6.jpg,piazza_san_marco14.jpg,piazza_san_marco1.jpg,piazza_san_marco10.jpg,piazza_san_marco11.jpg,piazza_san_marco4.jpg,piazza_san_marco12.jpg,piazza_san_marco7.jpg,piazza_san_marco8.jpg,piazza_san_marco0.jpg,piazza_san_marco13.jpg,piazza_san_marco9.jpg,piazza_san_marco3.jpg,piazza_san_marco2.jpg,piazza_san_marco5.jpg
Type,SHA256,SHA256,SHA256,SHA256,SHA256,SHA256,SHA256,SHA256,SHA256,SHA256,SHA256,SHA256,SHA256,SHA256,SHA256
piazza_san_marco6.jpg,0,60,57,62,61,61,58,60,61,60,56,60,61,60,58
piazza_san_marco14.jpg,60,0,61,58,62,60,63,58,60,61,61,62,58,58,60
piazza_san_marco1.jpg,57,61,0,63,60,61,61,60,61,57,63,62,64,61,63
piazza_san_marco10.jpg,62,58,63,0,60,57,58,58,62,60,63,61,58,59,61
piazza_san_marco11.jpg,61,62,60,60,0,60,60,56,59,60,59,56,61,60,60
piazza_san_marco4.jpg,61,60,61,57,60,0,61,60,58,59,56,61,61,62,61
piazza_san_marco12.jpg,58,63,61,58,60,61,0,56,54,62,62,57,61,57,59
piazza_san_marco7.jpg,60,58,60,58,56,60,56,0,58,62,61,60,58,59,63
piazza_san_marco8.jpg,61,60,61,62,59,58,54,58,0,59,63,60,60,57,57
piazza_san_marco0.jpg,60,61,57,60,60,59,62,62,59,0,61,61,61,62,59
piazza_san_marco13.jpg,56,61,63,63,59,56,62,61,63,61,0,56,60,61,61
piazza_san_marco9.jpg,60,62,62,61,56,61,57,60,60,61,56,0,61,58,58
piazza_san_marco3.jpg,61,58,64,58,61,61,61,58,60,61,60,61,0,60,61
piazza_san_marco2.jpg,60,58,61,59,60,62,57,59,57,62,61,58,60,0,58
piazza_san_marco5.jpg,58,60,63,61,60,61,59,63,57,59,61,58,61,58,0
Type,Final-R,Final-R,Final-R,Final-R,Final-R,Final-R,Final-R,Final-R,Final-R,Final-R,Final-R,Final-R,Final-R,Final-R,Final-R
piazza_san_marco6.jpg,0,14,10,11,9,7,9,13,13,13,9,8,10,8,11
piazza_san_marco14.jpg,14,0,12,11,15,13,9,11,13,13,11,14,16,10,13
piazza_san_marco1.jpg,10,12,0,13,13,9,13,9,15,13,11,14,12,12,13
piazza_san_marco10.jpg,11,11,13,0,12,8,10,14,12,12,12,13,11,11,12
piazza_san_marco11.jpg,9,15,13,12,0,12,12,10,10,10,12,13,13,13,12
piazza_san_marco4.jpg,7,13,9,8,12,0,12,12,12,12,8,13,11,11,12
piazza_san_marco12.jpg,9,9,13,10,12,12,0,10,10,10,12,7,13,7,10
piazza_san_marco7.jpg,13,11,9,14,10,12,10,0,10,14,12,15,13,13,12
piazza_san_marco8.jpg,13,13,15,12,10,12,10,10,0,10,10,9,7,13,8
piazza_san_marco0.jpg,13,13,13,12,10,12,10,14,10,0,8,11,11,15,10
piazza_san_marco13.jpg,9,11,11,12,12,8,12,12,10,8,0,13,11,13,10
piazza_san_marco9.jpg,8,14,14,13,13,13,7,15,9,11,13,0,10,8,9
piazza_san_marco3.jpg,10,16,12,11,13,11,13,13,7,11,11,10,0,12,9
piazza_san_marco2.jpg,8,10,12,11,13,11,7,13,13,15,13,8,12,0,11
piazza_san_marco5.jpg,11,13,13,12,12,12,10,12,8,10,10,9,9,11,0
