,obelisco_wash_dc2.jpg,obelisco_wash_dc11.jpg,obelisco_wash_dc9.jpg,obelisco_wash_dc5.jpg,obelisco_wash_dc14.jpg,obelisco_wash_dc13.jpg,obelisco_wash_dc3.jpg,obelisco_wash_dc8.jpg,obelisco_wash_dc6.jpg,obelisco_wash_dc4.jpg,obelisco_wash_dc1.jpg,obelisco_wash_dc12.jpg,obelisco_wash_dc0.jpg,obelisco_wash_dc10.jpg,obelisco_wash_dc7.jpg
Type,SHA256,SHA256,SHA256,SHA256,SHA256,SHA256,SHA256,SHA256,SHA256,SHA256,SHA256,SHA256,SHA256,SHA256,SHA256
obelisco_wash_dc2.jpg,0,59,63,60,61,61,60,58,58,55,60,58,62,59,60
obelisco_wash_dc11.jpg,59,0,61,56,61,61,61,62,63,64,61,61,62,59,58
obelisco_wash_dc9.jpg,63,61,0,62,58,60,58,58,64,63,60,63,61,62,60
obelisco_wash_dc5.jpg,60,56,62,0,60,63,58,62,62,59,60,60,59,58,61
obelisco_wash_dc14.jpg,61,61,58,60,0,61,64,61,61,61,58,61,59,58,63
obelisco_wash_dc13.jpg,61,61,60,63,61,0,60,64,62,60,59,59,61,58,58
obelisco_wash_dc3.jpg,60,61,58,58,64,60,0,59,59,62,62,61,62,60,62
obelisco_wash_dc8.jpg,58,62,58,62,61,64,59,0,60,58,60,61,60,61,59
obelisco_wash_dc6.jpg,58,63,64,62,61,62,59,60,0,58,63,59,60,61,62
obelisco_wash_dc4.jpg,55,64,63,59,61,60,62,58,58,0,61,56,55,62,57
obelisco_wash_dc1.jpg,60,61,60,60,58,59,62,60,63,61,0,53,62,63,60
obelisco_wash_dc12.jpg,58,61,63,60,61,59,61,61,59,56,53,0,62,59,60
obelisco_wash_dc0.jpg,62,62,61,59,59,61,62,60,60,55,62,62,0,61,62
obelisco_wash_dc10.jpg,59,59,62,58,58,58,60,61,61,62,63,59,61,0,63
obelisco_wash_dc7.jpg,60,58,60,61,63,58,62,59,62,57,60,60,62,63,0
Type,Final-R,Final-R,Final-R,Final-R,Final-R,Final-R,Final-R,Final-R,Final-R,Final-R,Final-R,Final-R,Final-R,Final-R,Final-R
obelisco_wash_dc2.jpg,0,9,8,6,10,14,8,14,13,7,11,10,15,12,12
obelisco_wash_dc11.jpg,9,0,13,7,13,13,11,11,14,14,10,9,14,13,11
obelisco_wash_dc9.jpg,8,13,0,8,8,14,10,14,13,7,9,10,15,12,12
obelisco_wash_dc5.jpg,6,7,8,0,8,12,10,12,15,9,7,10,15,12,12
obelisco_wash_dc14.jpg,10,13,8,8,0,12,12,12,11,9,11,12,13,10,12
obelisco_wash_dc13.jpg,14,13,14,12,12,0,10,12,13,13,15,14,9,10,10
obelisco_wash_dc3.jpg,8,11,10,10,12,10,0,12,13,11,11,10,13,10,10
obelisco_wash_dc8.jpg,14,11,14,12,12,12,12,0,13,11,9,12,7,6,14
obelisco_wash_dc6.jpg,13,14,13,15,11,13,13,13,0,8,16,11,14,15,11
obelisco_wash_dc4.jpg,7,14,7,9,9,13,11,11,8,0,12,7,12,13,11
obelisco_wash_dc1.jpg,11,10,9,7,11,15,11,9,16,12,0,9,12,9,13
obelisco_wash_dc12.jpg,10,9,10,10,12,14,10,12,11,7,9,0,13,14,12
obelisco_wash_dc0.jpg,15,14,15,15,13,9,13,7,14,12,12,13,0,9,11
obelisco_wash_dc10.jpg,12,13,12,12,10,10,10,6,15,13,9,14,9,0,14
obelisco_wash_dc7.jpg,12,11,12,12,12,10,10,14,11,11,13,12,11,14,0
