Img-Name,Meta,R-Meta,Content,R-Content,Final-R
piazza_san_marco6.jpg,AAAZI4SW4QBSFB3D,"[0, 0, 1, 1, 1, 0, 0, 1]",EEAZDJTPXE6EHEJ4,"[1, 0, 1, 0, 1, 1, 0, 0]","[0, 0, 1, 1, 1, 0, 0, 1]"
piazza_san_marco14.jpg,AAAZJ7QW4QBSFB3D,"[0, 0, 1, 1, 1, 0, 0, 1]",EEA5CKTVRDZCTVRP,"[1, 0, 0, 1, 0, 1, 1, 0]","[0, 0, 1, 1, 1, 0, 0, 1]"
piazza_san_marco1.jpg,AAA3N4QW4QBSFB3D,"[0, 0, 0, 1, 1, 0, 0, 1]",EEA6KHRLKOGKKSXS,"[0, 0, 0, 1, 1, 0, 1, 0]","[0, 0, 0, 1, 1, 0, 0, 1]"
piazza_san_marco10.jpg,AAA3L7TW4QBSFB3D,"[0, 0, 0, 1, 1, 0, 0, 1]",EEA7TGZZ3A4GJDTE,"[0, 0, 1, 0, 0, 1, 0, 1]","[0, 0, 0, 1, 1, 0, 0, 1]"
piazza_san_marco11.jpg,AAAZN7WW6QBSFB3D,"[0, 0, 1, 1, 1, 0, 0, 1]",EEA22LZKZHCTFGSV,"[0, 0, 1, 1, 1, 0, 1, 0]","[0, 0, 1, 1, 1, 0, 0, 1]"
piazza_san_marco4.jpg,AAA3J7EU4QBSFB3D,"[0, 0, 0, 1, 1, 1, 0, 0]",EEA5A5JHZWNQHZC2,"[1, 1, 1, 0, 0, 1, 0, 0]","[0, 0, 0, 1, 1, 1, 0, 0]"
piazza_san_marco12.jpg,AAA3J7SW6QBSFB3D,"[0, 0, 0, 1, 1, 0, 0, 1]",EEA5CPFNIG7FMI44,"[0, 0, 0, 0, 1, 1, 1, 0]","[0, 0, 0, 1, 1, 0, 0, 1]"
piazza_san_marco7.jpg,AAA3J4SU4QBSFB3D,"[0, 0, 0, 1, 1, 1, 0, 0]",EEA3KK5K2I5KNSVQ,"[0, 1, 0, 1, 0, 0, 0, 0]","[0, 0, 0, 1, 1, 1, 0, 0]"
piazza_san_marco8.jpg,AAA3J5UU4QBSFB3D,"[0, 0, 0, 1, 1, 1, 0, 0]",EEAZ3ONKIKMH4Q44,"[1, 0, 1, 1, 1, 0, 0, 0]","[0, 0, 0, 1, 1, 1, 0, 0]"
piazza_san_marco0.jpg,AAAZI5EW6QBSFB3D,"[0, 0, 1, 1, 1, 0, 0, 1]",EEAYK6T2Q7UD5TYA,"[0, 1, 1, 0, 1, 0, 0, 0]","[0, 0, 1, 1, 1, 0, 0, 1]"
piazza_san_marco13.jpg,AAAZJ7RW4QBSFB3D,"[0, 0, 1, 1, 1, 0, 0, 1]",EEAYJPB3APAXB76M,"[1, 1, 0, 1, 0, 1, 0, 0]","[0, 0, 1, 1, 1, 0, 0, 1]"
piazza_san_marco9.jpg,AAAZJPSU2QBSFB3D,"[0, 0, 1, 1, 1, 1, 0, 0]",EEA3KJJFURKVLLLT,"[0, 0, 0, 1, 1, 0, 1, 0]","[0, 0, 1, 1, 1, 1, 0, 0]"
piazza_san_marco3.jpg,AAAZJ7QW4QBSFB3D,"[0, 0, 1, 1, 1, 0, 0, 1]",EEAYJLQ3KOCG626G,"[0, 1, 0, 1, 0, 0, 0, 1]","[0, 0, 1, 1, 1, 0, 0, 1]"
piazza_san_marco2.jpg,AAAZN5XW4QBSFB3D,"[0, 0, 1, 1, 1, 0, 0, 1]",EEA4JPRMZPYSHRRU,"[0, 0, 0, 1, 1, 1, 0, 0]","[0, 0, 1, 1, 1, 0, 0, 1]"
piazza_san_marco5.jpg,AAAZI5QU6QBSFB3D,"[0, 0, 1, 1, 1, 1, 0, 0]",EEAYLB3TLKOWDOQ2,"[0, 1, 1, 0, 1, 0, 0, 1]","[0, 0, 1, 1, 1, 1, 0, 0]"
