,torre_pisa0.jpg,torre_pisa5.jpg,torre_pisa11.jpg,torre_pisa13.jpg,torre_pisa12.jpg,torre_pisa3.jpg,torre_pisa4.jpg,torre_pisa10.jpg,torre_pisa7.jpg,torre_pisa1.jpg,torre_pisa6.jpg,torre_pisa9.jpg,torre_pisa8.jpg,torre_pisa2.jpg,torre_pisa14.jpg
Type,SHA256,SHA256,SHA256,SHA256,SHA256,SHA256,SHA256,SHA256,SHA256,SHA256,SHA256,SHA256,SHA256,SHA256,SHA256
torre_pisa0.jpg,0,59,62,59,62,61,59,59,62,62,63,60,60,59,58
torre_pisa5.jpg,59,0,58,61,62,61,58,57,60,61,63,62,62,61,62
torre_pisa11.jpg,62,58,0,61,63,60,58,62,61,54,59,62,61,55,62
torre_pisa13.jpg,59,61,61,0,62,61,63,61,59,62,61,62,58,61,59
torre_pisa12.jpg,62,62,63,62,0,59,63,58,62,62,62,62,59,62,61
torre_pisa3.jpg,61,61,60,61,59,0,60,58,60,62,63,59,59,60,61
torre_pisa4.jpg,59,58,58,63,63,60,0,59,59,60,61,61,62,57,63
torre_pisa10.jpg,59,57,62,61,58,58,59,0,59,59,58,59,60,60,62
torre_pisa7.jpg,62,60,61,59,62,60,59,59,0,63,63,57,59,60,62
torre_pisa1.jpg,62,61,54,62,62,62,60,59,63,0,62,60,59,59,62
torre_pisa6.jpg,63,63,59,61,62,63,61,58,63,62,0,61,61,57,58
torre_pisa9.jpg,60,62,62,62,62,59,61,59,57,60,61,0,60,58,59
torre_pisa8.jpg,60,62,61,58,59,59,62,60,59,59,61,60,0,63,62
torre_pisa2.jpg,59,61,55,61,62,60,57,60,60,59,57,58,63,0,58
torre_pisa14.jpg,58,62,62,59,61,61,63,62,62,62,58,59,62,58,0
Type,Final-R,Final-R,Final-R,Final-R,Final-R,Final-R,Final-R,Final-R,Final-R,Final-R,Final-R,Final-R,Final-R,Final-R,Final-R
torre_pisa0.jpg,0,30,32,24,32,32,30,28,30,32,31,28,32,29,32
torre_pisa5.jpg,30,0,32,32,32,28,28,28,28,32,31,28,32,27,32
torre_pisa11.jpg,32,32,0,32,30,30,30,30,28,32,29,32,32,29,28
torre_pisa13.jpg,24,32,32,0,32,30,30,28,28,32,27,28,30,31,32
torre_pisa12.jpg,32,32,30,32,0,28,30,28,32,30,29,30,30,27,28
torre_pisa3.jpg,32,28,30,30,28,0,28,28,32,32,31,32,28,29,32
torre_pisa4.jpg,30,28,30,30,30,28,0,30,26,28,31,28,28,31,30
torre_pisa10.jpg,28,28,30,28,28,28,30,0,30,26,27,30,30,29,28
torre_pisa7.jpg,30,28,28,28,32,32,26,30,0,32,29,30,30,29,30
torre_pisa1.jpg,32,32,32,32,30,32,28,26,32,0,27,30,32,29,28
torre_pisa6.jpg,31,31,29,27,29,31,31,27,29,27,0,29,29,28,25
torre_pisa9.jpg,28,28,32,28,30,32,28,30,30,30,29,0,28,25,32
torre_pisa8.jpg,32,32,32,30,30,28,28,30,30,32,29,28,0,27,32
torre_pisa2.jpg,29,27,29,31,27,29,31,29,29,29,28,25,27,0,27
torre_pisa14.jpg,32,32,28,32,28,32,30,28,30,28,25,32,32,27,0
