,lavorare_preferisco_mare5.jpg,lavorare_preferisco_mare8.jpg,lavorare_preferisco_mare10.jpg,lavorare_preferisco_mare1.jpg,lavorare_preferisco_mare2.jpg,lavorare_preferisco_mare11.jpg,lavorare_preferisco_mare14.jpg,lavorare_preferisco_mare7.jpg,lavorare_preferisco_mare3.jpg,lavorare_preferisco_mare0.jpg,lavorare_preferisco_mare4.jpg,lavorare_preferisco_mare9.jpg,lavorare_preferisco_mare13.jpg,lavorare_preferisco_mare12.jpg,lavorare_preferisco_mare6.jpg
Type,Meta,Meta,Meta,Meta,Meta,Meta,Meta,Meta,Meta,Meta,Meta,Meta,Meta,Meta,Meta
lavorare_preferisco_mare5.jpg,0,1,3,2,3,2,4,4,5,4,5,2,2,4,5
lavorare_preferisco_mare8.jpg,1,0,3,1,3,2,4,3,5,4,5,3,2,4,5
lavorare_preferisco_mare10.jpg,3,3,0,3,4,3,2,3,5,3,3,5,3,4,3
lavorare_preferisco_mare1.jpg,2,1,3,0,4,3,3,2,5,5,4,4,3,5,4
lavorare_preferisco_mare2.jpg,3,3,4,4,0,4,4,4,7,4,5,5,4,3,5
lavorare_preferisco_mare11.jpg,2,2,3,3,4,0,4,5,3,2,3,2,2,2,3
lavorare_preferisco_mare14.jpg,4,4,2,3,4,4,0,2,6,3,2,6,4,3,2
lavorare_preferisco_mare7.jpg,4,3,3,2,4,5,2,0,7,3,3,6,5,5,3
lavorare_preferisco_mare3.jpg,5,5,5,5,7,3,6,7,0,5,5,4,4,5,5
lavorare_preferisco_mare0.jpg,4,4,3,5,4,2,3,3,5,0,2,4,4,2,2
lavorare_preferisco_mare4.jpg,5,5,3,4,5,3,2,3,5,2,0,5,5,3,1
lavorare_preferisco_mare9.jpg,2,3,5,4,5,2,6,6,4,4,5,0,3,4,5
lavorare_preferisco_mare13.jpg,2,2,3,3,4,2,4,5,4,4,5,3,0,4,5
lavorare_preferisco_mare12.jpg,4,4,4,5,3,2,3,5,5,2,3,4,4,0,3
lavorare_preferisco_mare6.jpg,5,5,3,4,5,3,2,3,5,2,1,5,5,3,0
Type,R-Meta,R-Meta,R-Meta,R-Meta,R-Meta,R-Meta,R-Meta,R-Meta,R-Meta,R-Meta,R-Meta,R-Meta,R-Meta,R-Meta,R-Meta
lavorare_preferisco_mare5.jpg,0,0,1,0,5,1,3,1,1,2,3,0,1,4,2
lavorare_preferisco_mare8.jpg,0,0,1,0,5,1,3,1,1,2,3,0,1,4,2
lavorare_preferisco_mare10.jpg,1,1,0,1,4,0,2,2,0,1,2,1,0,3,1
lavorare_preferisco_mare1.jpg,0,0,1,0,5,1,3,1,1,2,3,0,1,4,2
lavorare_preferisco_mare2.jpg,5,5,4,5,0,4,4,4,4,3,2,5,4,3,3
lavorare_preferisco_mare11.jpg,1,1,0,1,4,0,2,2,0,1,2,1,0,3,1
lavorare_preferisco_mare14.jpg,3,3,2,3,4,2,0,2,2,1,2,3,2,1,1
lavorare_preferisco_mare7.jpg,1,1,2,1,4,2,2,0,2,1,2,1,2,3,1
lavorare_preferisco_mare3.jpg,1,1,0,1,4,0,2,2,0,1,2,1,0,3,1
lavorare_preferisco_mare0.jpg,2,2,1,2,3,1,1,1,1,0,1,2,1,2,0
lavorare_preferisco_mare4.jpg,3,3,2,3,2,2,2,2,2,1,0,3,2,3,1
lavorare_preferisco_mare9.jpg,0,0,1,0,5,1,3,1,1,2,3,0,1,4,2
lavorare_preferisco_mare13.jpg,1,1,0,1,4,0,2,2,0,1,2,1,0,3,1
lavorare_preferisco_mare12.jpg,4,4,3,4,3,3,1,3,3,2,3,4,3,0,2
lavorare_preferisco_mare6.jpg,2,2,1,2,3,1,1,1,1,0,1,2,1,2,0
Type,Content,Content,Content,Content,Content,Content,Content,Content,Content,Content,Content,Content,Content,Content,Content
lavorare_preferisco_mare5.jpg,0,13,11,12,13,13,11,13,12,13,13,13,13,12,12
lavorare_preferisco_mare8.jpg,13,0,13,13,12,12,10,13,13,11,13,12,10,13,12
lavorare_preferisco_mare10.jpg,11,13,0,12,13,13,13,13,12,13,12,13,13,11,12
lavorare_preferisco_mare1.jpg,12,13,12,0,13,13,12,13,12,13,13,12,12,13,13
lavorare_preferisco_mare2.jpg,13,12,13,13,0,11,13,13,12,13,13,12,12,13,12
lavorare_preferisco_mare11.jpg,13,12,13,13,11,0,12,13,13,12,13,13,13,13,13
lavorare_preferisco_mare14.jpg,11,10,13,12,13,12,0,13,13,12,11,13,12,13,11
lavorare_preferisco_mare7.jpg,13,13,13,13,13,13,13,0,13,13,12,13,12,13,12
lavorare_preferisco_mare3.jpg,12,13,12,12,12,13,13,13,0,13,13,12,13,12,13
lavorare_preferisco_mare0.jpg,13,11,13,13,13,12,12,13,13,0,13,12,12,13,11
lavorare_preferisco_mare4.jpg,13,13,12,13,13,13,11,12,13,13,0,13,13,13,12
lavorare_preferisco_mare9.jpg,13,12,13,12,12,13,13,13,12,12,13,0,13,13,12
lavorare_preferisco_mare13.jpg,13,10,13,12,12,13,12,12,13,12,13,13,0,13,10
lavorare_preferisco_mare12.jpg,12,13,11,13,13,13,13,13,12,13,13,13,13,0,11
lavorare_preferisco_mare6.jpg,12,12,12,13,12,13,11,12,13,11,12,12,10,11,0
Type,R-Content,R-Content,R-Content,R-Content,R-Content,R-Content,R-Content,R-Content,R-Content,R-Content,R-Content,R-Content,R-Content,R-Content,R-Content
lavorare_preferisco_mare5.jpg,0,7,5,6,10,5,5,7,8,7,10,4,8,6,8
lavorare_preferisco_mare8.jpg,7,0,8,7,7,6,6,6,7,4,7,5,5,7,3
lavorare_preferisco_mare10.jpg,5,8,0,3,5,6,8,6,5,10,7,5,7,5,7
lavorare_preferisco_mare1.jpg,6,7,3,0,6,5,7,7,4,9,10,6,6,6,6
lavorare_preferisco_mare2.jpg,10,7,5,6,0,9,9,7,4,7,6,6,6,8,8
lavorare_preferisco_mare11.jpg,5,6,6,5,9,0,6,6,9,6,7,5,3,7,7
lavorare_preferisco_mare14.jpg,5,6,8,7,9,6,0,10,7,4,9,3,7,7,5
lavorare_preferisco_mare7.jpg,7,6,6,7,7,6,10,0,9,6,5,9,7,7,9
lavorare_preferisco_mare3.jpg,8,7,5,4,4,9,7,9,0,7,8,6,8,6,6
lavorare_preferisco_mare0.jpg,7,4,10,9,7,6,4,6,7,0,7,5,5,9,5
lavorare_preferisco_mare4.jpg,10,7,7,10,6,7,9,5,8,7,0,8,8,8,8
lavorare_preferisco_mare9.jpg,4,5,5,6,6,5,3,9,6,5,8,0,6,4,6
lavorare_preferisco_mare13.jpg,8,5,7,6,6,3,7,7,8,5,8,6,0,8,4
lavorare_preferisco_mare12.jpg,6,7,5,6,8,7,7,7,6,9,8,4,8,0,8
lavorare_preferisco_mare6.jpg,8,3,7,6,8,7,5,9,6,5,8,6,4,8,0
Type,Final-R,Final-R,Final-R,Final-R,Final-R,Final-R,Final-R,Final-R,Final-R,Final-R,Final-R,Final-R,Final-R,Final-R,Final-R
lavorare_preferisco_mare5.jpg,0,2,4,3,7,5,3,5,3,3,8,2,4,6,2
lavorare_preferisco_mare8.jpg,2,0,4,3,7,3,5,5,3,3,6,2,2,6,0
lavorare_preferisco_mare10.jpg,4,4,0,3,5,3,7,3,3,5,4,4,4,6,4
lavorare_preferisco_mare1.jpg,3,3,3,0,4,4,4,4,0,4,7,3,3,3,3
lavorare_preferisco_mare2.jpg,7,7,5,4,0,6,6,4,4,6,5,5,5,5,7
lavorare_preferisco_mare11.jpg,5,3,3,4,6,0,6,6,4,4,3,3,1,7,3
lavorare_preferisco_mare14.jpg,3,5,7,4,6,6,0,6,4,2,7,3,5,5,5
lavorare_preferisco_mare7.jpg,5,5,3,4,4,6,6,0,4,4,3,5,5,3,5
lavorare_preferisco_mare3.jpg,3,3,3,0,4,4,4,4,0,4,7,3,3,3,3
lavorare_preferisco_mare0.jpg,3,3,5,4,6,4,2,4,4,0,5,1,3,5,3
lavorare_preferisco_mare4.jpg,8,6,4,7,5,3,7,3,7,5,0,6,4,6,6
lavorare_preferisco_mare9.jpg,2,2,4,3,5,3,3,5,3,1,6,0,2,6,2
lavorare_preferisco_mare13.jpg,4,2,4,3,5,1,5,5,3,3,4,2,0,6,2
lavorare_preferisco_mare12.jpg,6,6,6,3,5,7,5,3,3,5,6,6,6,0,6
lavorare_preferisco_mare6.jpg,2,0,4,3,7,3,5,5,3,3,6,2,2,6,0
