,fontana_trevi5.jpg,fontana_trevi4.jpg,fontana_trevi9.jpg,fontana_trevi3.jpg,fontana_trevi10.jpg,fontana_trevi13.jpg,fontana_trevi2.jpg,fontana_trevi7.jpg,fontana_trevi0.jpg,fontana_trevi14.jpg,fontana_trevi8.jpg,fontana_trevi12.jpg,fontana_trevi6.jpg,fontana_trevi1.jpg,fontana_trevi11.jpg
Type,SHA256,SHA256,SHA256,SHA256,SHA256,SHA256,SHA256,SHA256,SHA256,SHA256,SHA256,SHA256,SHA256,SHA256,SHA256
fontana_trevi5.jpg,0,60,60,59,63,58,61,60,60,60,61,55,58,59,63
fontana_trevi4.jpg,60,0,63,58,60,62,56,63,62,63,63,59,58,60,60
fontana_trevi9.jpg,60,63,0,59,62,59,63,58,58,60,59,59,59,61,59
fontana_trevi3.jpg,59,58,59,0,63,57,62,58,60,58,64,62,61,61,60
fontana_trevi10.jpg,63,60,62,63,0,60,60,59,57,62,61,62,63,58,60
fontana_trevi13.jpg,58,62,59,57,60,0,60,61,62,60,61,62,62,61,62
fontana_trevi2.jpg,61,56,63,62,60,60,0,62,58,60,58,59,62,57,59
fontana_trevi7.jpg,60,63,58,58,59,61,62,0,62,60,63,58,59,55,60
fontana_trevi0.jpg,60,62,58,60,57,62,58,62,0,61,61,60,62,57,62
fontana_trevi14.jpg,60,63,60,58,62,60,60,60,61,0,57,61,58,58,58
fontana_trevi8.jpg,61,63,59,64,61,61,58,63,61,57,0,58,62,59,63
fontana_trevi12.jpg,55,59,59,62,62,62,59,58,60,61,58,0,62,61,60
fontana_trevi6.jpg,58,58,59,61,63,62,62,59,62,58,62,62,0,62,62
fontana_trevi1.jpg,59,60,61,61,58,61,57,55,57,58,59,61,62,0,60
fontana_trevi11.jpg,63,60,59,60,60,62,59,60,62,58,63,60,62,60,0
Type,Final-R,Final-R,Final-R,Final-R,Final-R,Final-R,Final-R,Final-R,Final-R,Final-R,Final-R,Final-R,Final-R,Final-R,Final-R
fontana_trevi5.jpg,0,28,32,28,29,32,31,30,26,26,28,30,30,30,30
fontana_trevi4.jpg,28,0,30,28,29,28,27,28,30,28,24,28,30,30,30
fontana_trevi9.jpg,32,30,0,32,29,32,31,26,28,28,32,30,30,30,30
fontana_trevi3.jpg,28,28,32,0,29,32,31,28,30,30,30,26,32,30,32
fontana_trevi10.jpg,29,29,29,29,0,31,30,27,31,31,27,29,29,27,31
fontana_trevi13.jpg,32,28,32,32,31,0,25,30,32,28,32,32,32,32,24
fontana_trevi2.jpg,31,27,31,31,30,25,0,31,29,27,25,27,31,31,29
fontana_trevi7.jpg,30,28,26,28,27,30,31,0,32,30,30,32,32,28,30
fontana_trevi0.jpg,26,30,28,30,31,32,29,32,0,32,32,32,32,24,30
fontana_trevi14.jpg,26,28,28,30,31,28,27,30,32,0,30,30,28,28,32
fontana_trevi8.jpg,28,24,32,30,27,32,25,30,32,30,0,28,32,32,32
fontana_trevi12.jpg,30,28,30,26,29,32,27,32,32,30,28,0,32,30,32
fontana_trevi6.jpg,30,30,30,32,29,32,31,32,32,28,32,32,0,28,30
fontana_trevi1.jpg,30,30,30,30,27,32,31,28,24,28,32,30,28,0,26
fontana_trevi11.jpg,30,30,30,32,31,24,29,30,30,32,32,32,30,26,0
