Img-Name,Meta,R-Meta,Content,R-Content,Final-R
cinque_terre10.jpg,AAA5K4TLMBZXFHDT,"[1, 1, 1, 0, 1, 1, 0, 0]",EEA5TBZ4YMQ6HWTQ,"[0, 1, 1, 0, 1, 1, 1, 1]","[0, 1, 1, 0, 1, 1, 1, 1]"
cinque_terre2.jpg,AAA5PMT3OFZXFHDT,"[1, 1, 0, 1, 1, 1, 1, 0]",EEAYTH4UD3FA7Y4G,"[1, 1, 0, 1, 0, 1, 0, 1]","[1, 1, 0, 1, 0, 1, 0, 1]"
cinque_terre7.jpg,AAA5KW32MVZXFHDT,"[1, 1, 1, 0, 1, 1, 1, 1]",EEA2TBYGLPF6KVIT,"[1, 0, 1, 0, 1, 1, 1, 1]","[1, 0, 1, 0, 1, 1, 1, 1]"
cinque_terre4.jpg,AAAVL434OVZXFHDT,"[1, 1, 0, 0, 1, 0, 1, 0]",EEAYJB23NBSKM6D7,"[0, 1, 1, 1, 0, 1, 1, 1]","[0, 1, 1, 1, 0, 1, 1, 1]"
cinque_terre0.jpg,AAA5L4T2KVZXFHDT,"[1, 1, 1, 0, 1, 1, 1, 0]",EEA5HDB3DNSMGDPG,"[0, 0, 0, 1, 1, 1, 1, 1]","[0, 0, 0, 1, 1, 1, 1, 1]"
cinque_terre8.jpg,AAA5L632MFZXFHDT,"[1, 1, 1, 0, 1, 1, 1, 0]",EEAZBIOZZTGMI4XP,"[1, 1, 1, 0, 1, 1, 0, 0]","[1, 1, 1, 0, 1, 1, 0, 0]"
cinque_terre1.jpg,AAA5L4T6OFZXFHDT,"[1, 1, 0, 0, 1, 1, 1, 0]",EEA3JCGDZXE2N5CL,"[1, 0, 1, 1, 1, 1, 0, 0]","[1, 0, 1, 1, 1, 1, 0, 0]"
cinque_terre9.jpg,AAA5LM34OFZXFHDT,"[1, 1, 0, 0, 1, 1, 1, 0]",EEAYREE5TRYY63XJ,"[0, 1, 1, 1, 0, 1, 0, 0]","[0, 1, 1, 1, 0, 1, 0, 0]"
cinque_terre3.jpg,AAA5L4R7ONZXFHDT,"[1, 1, 0, 0, 1, 1, 1, 1]",EEA2TBQ7ZDQLB6E7,"[0, 0, 1, 0, 1, 1, 1, 1]","[0, 0, 1, 0, 1, 1, 1, 1]"
cinque_terre5.jpg,AAA5KM34OFZXFHDT,"[1, 1, 0, 0, 1, 1, 1, 0]",EEAYLA5Q4B7T2HWD,"[1, 1, 1, 0, 1, 1, 0, 0]","[1, 1, 1, 0, 1, 1, 0, 0]"
cinque_terre6.jpg,AAAVO6L6KVZXFHDT,"[1, 1, 0, 0, 1, 0, 1, 0]",EEA6NWONWOEDGJRU,"[0, 0, 1, 0, 1, 1, 1, 1]","[0, 0, 1, 0, 1, 1, 1, 1]"
cinque_terre14.jpg,AAA5K4D5MFZXFHDT,"[1, 1, 0, 0, 1, 1, 1, 0]",EEAYDM4TYVGUZZFX,"[1, 1, 1, 0, 1, 1, 1, 0]","[1, 1, 1, 0, 1, 1, 1, 0]"
cinque_terre12.jpg,AAA5KMTKOFZXFHDT,"[1, 1, 0, 1, 1, 1, 1, 0]",EEA6HQGNICLWZ3LM,"[0, 1, 0, 1, 0, 1, 1, 1]","[0, 1, 0, 1, 0, 1, 1, 1]"
cinque_terre11.jpg,AAA5O4T4OFZXFHDT,"[1, 1, 0, 0, 1, 1, 1, 0]",EEA23SIJW3JJXFMS,"[0, 0, 1, 1, 0, 1, 1, 0]","[0, 0, 1, 1, 0, 1, 1, 0]"
cinque_terre13.jpg,AAA4D4T5MBZXFHDT,"[1, 1, 1, 0, 1, 1, 0, 0]",EEA5RW6US2DJJEON,"[0, 0, 1, 0, 0, 1, 1, 1]","[0, 0, 1, 0, 0, 1, 1, 1]"
