,pietà_mic14.jpg,pietà_mic6.jpg,pietà_mic9.jpg,pietà_mic7.jpg,pietà_mic2.jpg,pietà_mic4.jpg,pietà_mic1.jpg,pietà_mic13.jpg,pietà_mic10.jpg,pietà_mic11.jpg,pietà_mic3.jpg,pietà_mic5.jpg,pietà_mic0.jpg,pietà_mic8.jpg,pietà_mic12.jpg
Type,SHA256,SHA256,SHA256,SHA256,SHA256,SHA256,SHA256,SHA256,SHA256,SHA256,SHA256,SHA256,SHA256,SHA256,SHA256
pietà_mic14.jpg,0,57,62,62,60,62,63,59,60,61,61,62,60,63,61
pietà_mic6.jpg,57,0,57,61,63,59,62,59,62,60,63,63,59,62,62
pietà_mic9.jpg,62,57,0,60,61,59,61,60,60,57,62,60,59,62,59
pietà_mic7.jpg,62,61,60,0,58,59,58,58,64,59,63,62,64,59,60
pietà_mic2.jpg,60,63,61,58,0,61,60,60,58,60,60,57,60,60,59
pietà_mic4.jpg,62,59,59,59,61,0,59,61,61,61,57,62,56,60,60
pietà_mic1.jpg,63,62,61,58,60,59,0,62,61,60,58,59,61,59,59
pietà_mic13.jpg,59,59,60,58,60,61,62,0,61,62,62,59,62,61,63
pietà_mic10.jpg,60,62,60,64,58,61,61,61,0,59,61,60,59,60,60
pietà_mic11.jpg,61,60,57,59,60,61,60,62,59,0,63,60,61,60,55
pietà_mic3.jpg,61,63,62,63,60,57,58,62,61,63,0,64,58,61,62
pietà_mic5.jpg,62,63,60,62,57,62,59,59,60,60,64,0,58,62,58
pietà_mic0.jpg,60,59,59,64,60,56,61,62,59,61,58,58,0,62,62
pietà_mic8.jpg,63,62,62,59,60,60,59,61,60,60,61,62,62,0,60
pietà_mic12.jpg,61,62,59,60,59,60,59,63,60,55,62,58,62,60,0
Type,Final-R,Final-R,Final-R,Final-R,Final-R,Final-R,Final-R,Final-R,Final-R,Final-R,Final-R,Final-R,Final-R,Final-R,Final-R
pietà_mic14.jpg,0,16,16,16,14,15,16,16,14,16,16,16,16,16,14
pietà_mic6.jpg,16,0,16,14,16,15,14,16,14,14,16,16,14,14,16
pietà_mic9.jpg,16,16,0,14,16,13,16,16,16,16,16,16,16,16,16
pietà_mic7.jpg,16,14,14,0,16,15,16,16,16,16,16,16,16,16,16
pietà_mic2.jpg,14,16,16,16,0,15,16,14,16,16,16,16,16,16,16
pietà_mic4.jpg,15,15,13,15,15,0,15,15,15,15,15,15,15,15,15
pietà_mic1.jpg,16,14,16,16,16,15,0,16,16,16,16,16,14,16,16
pietà_mic13.jpg,16,16,16,16,14,15,16,0,16,16,16,16,16,14,14
pietà_mic10.jpg,14,14,16,16,16,15,16,16,0,16,16,16,16,14,16
pietà_mic11.jpg,16,14,16,16,16,15,16,16,16,0,14,14,16,16,16
pietà_mic3.jpg,16,16,16,16,16,15,16,16,16,14,0,14,16,16,16
pietà_mic5.jpg,16,16,16,16,16,15,16,16,16,14,14,0,16,16,16
pietà_mic0.jpg,16,14,16,16,16,15,14,16,16,16,16,16,0,16,16
pietà_mic8.jpg,16,14,16,16,16,15,16,14,14,16,16,16,16,0,16
pietà_mic12.jpg,14,16,16,16,16,15,16,14,16,16,16,16,16,16,0
