,colosseo13.jpg,colosseo4.jpg,colosseo9.jpg,colosseo3.jpg,colosseo12.jpg,colosseo7.jpg,colosseo14.jpg,colosseo2.jpg,colosseo0.jpg,colosseo5.jpg,colosseo8.jpg,colosseo6.jpg,colosseo10.jpg,colosseo11.jpg,colosseo1.jpg
Type,Meta,Meta,Meta,Meta,Meta,Meta,Meta,Meta,Meta,Meta,Meta,Meta,Meta,Meta,Meta
colosseo13.jpg,0,5,5,3,3,5,4,4,5,5,5,6,4,4,5
colosseo4.jpg,5,0,3,4,3,3,5,5,5,3,4,4,4,5,5
colosseo9.jpg,5,3,0,5,4,4,4,5,3,6,5,5,3,4,6
colosseo3.jpg,3,4,5,0,3,5,4,4,4,3,5,6,4,4,6
colosseo12.jpg,3,3,4,3,0,5,3,4,5,5,4,6,4,3,4
colosseo7.jpg,5,3,4,5,5,0,4,4,4,5,2,3,3,4,4
colosseo14.jpg,4,5,4,4,3,4,0,4,3,6,3,6,3,1,4
colosseo2.jpg,4,5,5,4,4,4,4,0,4,5,4,6,4,4,4
colosseo0.jpg,5,5,3,4,5,4,3,4,0,6,5,4,3,3,6
colosseo5.jpg,5,3,6,3,5,5,6,5,6,0,5,6,6,6,5
colosseo8.jpg,5,4,5,5,4,2,3,4,5,5,0,4,4,3,3
colosseo6.jpg,6,4,5,6,6,3,6,6,4,6,4,0,5,6,6
colosseo10.jpg,4,4,3,4,4,3,3,4,3,6,4,5,0,3,5
colosseo11.jpg,4,5,4,4,3,4,1,4,3,6,3,6,3,0,3
colosseo1.jpg,5,5,6,6,4,4,4,4,6,5,3,6,5,3,0
Type,R-Meta,R-Meta,R-Meta,R-Meta,R-Meta,R-Meta,R-Meta,R-Meta,R-Meta,R-Meta,R-Meta,R-Meta,R-Meta,R-Meta,R-Meta
colosseo13.jpg,0,3,1,1,1,3,1,3,2,4,3,4,1,1,5
colosseo4.jpg,3,0,4,2,2,2,4,4,5,1,2,3,4,4,4
colosseo9.jpg,1,4,0,2,2,2,0,2,1,5,2,5,0,0,4
colosseo3.jpg,1,2,2,0,0,4,2,4,3,3,4,5,2,2,6
colosseo12.jpg,1,2,2,0,0,4,2,4,3,3,4,5,2,2,6
colosseo7.jpg,3,2,2,4,4,0,2,2,3,3,0,3,2,2,2
colosseo14.jpg,1,4,0,2,2,2,0,2,1,5,2,5,0,0,4
colosseo2.jpg,3,4,2,4,4,2,2,0,3,5,2,5,2,2,4
colosseo0.jpg,2,5,1,3,3,3,1,3,0,6,3,4,1,1,3
colosseo5.jpg,4,1,5,3,3,3,5,5,6,0,3,4,5,5,3
colosseo8.jpg,3,2,2,4,4,0,2,2,3,3,0,3,2,2,2
colosseo6.jpg,4,3,5,5,5,3,5,5,4,4,3,0,5,5,3
colosseo10.jpg,1,4,0,2,2,2,0,2,1,5,2,5,0,0,4
colosseo11.jpg,1,4,0,2,2,2,0,2,1,5,2,5,0,0,4
colosseo1.jpg,5,4,4,6,6,2,4,4,3,3,2,3,4,4,0
Type,Content,Content,Content,Content,Content,Content,Content,Content,Content,Content,Content,Content,Content,Content,Content
colosseo13.jpg,0,13,13,12,12,13,12,13,13,13,13,11,10,11,13
colosseo4.jpg,13,0,12,13,12,13,13,13,12,13,12,13,12,13,13
colosseo9.jpg,13,12,0,12,11,13,13,12,13,13,12,12,11,13,12
colosseo3.jpg,12,13,12,0,13,13,12,13,13,11,13,13,13,13,13
colosseo12.jpg,12,12,11,13,0,12,13,12,12,12,12,13,10,13,13
colosseo7.jpg,13,13,13,13,12,0,11,12,10,13,13,11,13,13,12
colosseo14.jpg,12,13,13,12,13,11,0,13,13,12,13,13,13,13,12
colosseo2.jpg,13,13,12,13,12,12,13,0,12,13,13,11,12,13,12
colosseo0.jpg,13,12,13,13,12,10,13,12,0,13,13,12,13,13,12
colosseo5.jpg,13,13,13,11,12,13,12,13,13,0,12,13,13,11,12
colosseo8.jpg,13,12,12,13,12,13,13,13,13,12,0,13,13,11,12
colosseo6.jpg,11,13,12,13,13,11,13,11,12,13,13,0,12,12,12
colosseo10.jpg,10,12,11,13,10,13,13,12,13,13,13,12,0,12,12
colosseo11.jpg,11,13,13,13,13,13,13,13,13,11,11,12,12,0,13
colosseo1.jpg,13,13,12,13,13,12,12,12,12,12,12,12,12,13,0
Type,R-Content,R-Content,R-Content,R-Content,R-Content,R-Content,R-Content,R-Content,R-Content,R-Content,R-Content,R-Content,R-Content,R-Content,R-Content
colosseo13.jpg,0,4,6,5,6,6,4,5,5,4,5,4,6,7,7
colosseo4.jpg,4,0,4,7,8,6,6,7,7,6,5,4,6,7,5
colosseo9.jpg,6,4,0,5,6,6,8,9,9,6,5,8,4,7,5
colosseo3.jpg,5,7,5,0,9,5,7,6,6,7,8,7,7,8,8
colosseo12.jpg,6,8,6,9,0,10,8,7,9,4,7,10,8,7,7
colosseo7.jpg,6,6,6,5,10,0,6,5,3,6,7,6,6,5,5
colosseo14.jpg,4,6,8,7,8,6,0,9,5,6,3,4,8,5,5
colosseo2.jpg,5,7,9,6,7,5,9,0,4,5,10,5,7,8,8
colosseo0.jpg,5,7,9,6,9,3,5,4,0,7,6,5,9,6,8
colosseo5.jpg,4,6,6,7,4,6,6,5,7,0,7,6,4,5,3
colosseo8.jpg,5,5,5,8,7,7,3,10,6,7,0,5,7,4,6
colosseo6.jpg,4,4,8,7,10,6,4,5,5,6,5,0,6,5,5
colosseo10.jpg,6,6,4,7,8,6,8,7,9,4,7,6,0,5,3
colosseo11.jpg,7,7,7,8,7,5,5,8,6,5,4,5,5,0,4
colosseo1.jpg,7,5,5,8,7,5,5,8,8,3,6,5,3,4,0
Type,Final-R,Final-R,Final-R,Final-R,Final-R,Final-R,Final-R,Final-R,Final-R,Final-R,Final-R,Final-R,Final-R,Final-R,Final-R
colosseo13.jpg,0,4,6,3,3,4,3,4,2,3,7,3,5,6,7
colosseo4.jpg,4,0,6,5,5,4,5,6,4,1,3,1,7,6,3
colosseo9.jpg,6,6,0,5,5,4,5,4,4,7,5,7,3,4,5
colosseo3.jpg,3,5,5,0,6,5,4,7,3,6,8,4,6,7,8
colosseo12.jpg,3,5,5,6,0,7,6,5,5,4,6,6,6,5,8
colosseo7.jpg,4,4,4,5,7,0,3,2,2,5,5,3,5,4,3
colosseo14.jpg,3,5,5,4,6,3,0,5,1,6,4,4,4,3,4
colosseo2.jpg,4,6,4,7,5,2,5,0,4,5,5,5,5,6,5
colosseo0.jpg,2,4,4,3,5,2,1,4,0,5,5,3,5,4,5
colosseo5.jpg,3,1,7,6,4,5,6,5,5,0,4,2,6,7,4
colosseo8.jpg,7,3,5,8,6,5,4,5,5,4,0,4,6,5,2
colosseo6.jpg,3,1,7,4,6,3,4,5,3,2,4,0,8,7,4
colosseo10.jpg,5,7,3,6,6,5,4,5,5,6,6,8,0,3,4
colosseo11.jpg,6,6,4,7,5,4,3,6,4,7,5,7,3,0,3
colosseo1.jpg,7,3,5,8,8,3,4,5,5,4,2,4,4,3,0
