,basilica_san_marco8.jpg,basilica_san_marco4.jpg,basilica_san_marco1.jpg,basilica_san_marco6.jpg,basilica_san_marco14.jpg,basilica_san_marco7.jpg,basilica_san_marco2.jpg,basilica_san_marco10.jpg,basilica_san_marco11.jpg,basilica_san_marco0.jpg,basilica_san_marco3.jpg,basilica_san_marco13.jpg,basilica_san_marco12.jpg,basilica_san_marco9.jpg,basilica_san_marco5.jpg
Type,SHA256,SHA256,SHA256,SHA256,SHA256,SHA256,SHA256,SHA256,SHA256,SHA256,SHA256,SHA256,SHA256,SHA256,SHA256
basilica_san_marco8.jpg,0,61,63,61,57,60,62,57,60,61,60,60,60,60,59
basilica_san_marco4.jpg,61,0,62,60,60,60,64,59,57,63,56,59,57,59,60
basilica_san_marco1.jpg,63,62,0,60,62,60,64,60,58,63,59,62,62,58,60
basilica_san_marco6.jpg,61,60,60,0,60,57,62,59,61,58,57,62,63,61,62
basilica_san_marco14.jpg,57,60,62,60,0,59,58,61,58,55,60,62,62,58,62
basilica_san_marco7.jpg,60,60,60,57,59,0,57,61,61,58,60,62,59,64,61
basilica_san_marco2.jpg,62,64,64,62,58,57,0,61,63,58,60,60,61,62,58
basilica_san_marco10.jpg,57,59,60,59,61,61,61,0,60,61,60,59,59,61,60
basilica_san_marco11.jpg,60,57,58,61,58,61,63,60,0,59,63,60,63,57,60
basilica_san_marco0.jpg,61,63,63,58,55,58,58,61,59,0,61,59,60,62,59
basilica_san_marco3.jpg,60,56,59,57,60,60,60,60,63,61,0,60,56,62,60
basilica_san_marco13.jpg,60,59,62,62,62,62,60,59,60,59,60,0,61,63,58
basilica_san_marco12.jpg,60,57,62,63,62,59,61,59,63,60,56,61,0,59,59
basilica_san_marco9.jpg,60,59,58,61,58,64,62,61,57,62,62,63,59,0,59
basilica_san_marco5.jpg,59,60,60,62,62,61,58,60,60,59,60,58,59,59,0
Type,Final-R,Final-R,Final-R,Final-R,Final-R,Final-R,Final-R,Final-R,Final-R,Final-R,Final-R,Final-R,Final-R,Final-R,Final-R
basilica_san_marco8.jpg,0,2,3,2,7,3,4,4,4,4,5,4,4,5,2
basilica_san_marco4.jpg,2,0,3,2,5,5,4,6,4,4,3,6,2,5,2
basilica_san_marco1.jpg,3,3,0,3,6,4,5,3,3,1,4,5,3,6,5
basilica_san_marco6.jpg,2,2,3,0,5,3,6,6,2,2,3,4,4,7,4
basilica_san_marco14.jpg,7,5,6,5,0,4,3,5,3,5,2,3,5,2,5
basilica_san_marco7.jpg,3,5,4,3,4,0,3,5,1,3,4,3,7,4,5
basilica_san_marco2.jpg,4,4,5,6,3,3,0,4,4,6,5,4,4,1,2
basilica_san_marco10.jpg,4,6,3,6,5,5,4,0,6,4,5,2,4,3,4
basilica_san_marco11.jpg,4,4,3,2,3,1,4,6,0,2,3,4,6,5,6
basilica_san_marco0.jpg,4,4,1,2,5,3,6,4,2,0,3,4,4,7,6
basilica_san_marco3.jpg,5,3,4,3,2,4,5,5,3,3,0,3,5,4,5
basilica_san_marco13.jpg,4,6,5,4,3,3,4,2,4,4,3,0,6,3,4
basilica_san_marco12.jpg,4,2,3,4,5,7,4,4,6,4,5,6,0,5,2
basilica_san_marco9.jpg,5,5,6,7,2,4,1,3,5,7,4,3,5,0,3
basilica_san_marco5.jpg,2,2,5,4,5,5,2,4,6,6,5,4,2,3,0
