,urlo_munch7.jpg,urlo_munch14.jpg,urlo_munch9.jpg,urlo_munch3.jpg,urlo_munch1.jpg,urlo_munch6.jpg,urlo_munch10.jpg,urlo_munch4.jpg,urlo_munch13.jpg,urlo_munch8.jpg,urlo_munch12.jpg,urlo_munch11.jpg,urlo_munch2.jpg,urlo_munch5.jpg,urlo_munch0.jpg
Type,Meta,Meta,Meta,Meta,Meta,Meta,Meta,Meta,Meta,Meta,Meta,Meta,Meta,Meta,Meta
urlo_munch7.jpg,0,4,5,6,5,5,4,4,5,4,5,5,4,7,5
urlo_munch14.jpg,4,0,5,6,5,4,4,4,3,5,3,3,5,6,4
urlo_munch9.jpg,5,5,0,6,5,3,4,3,5,4,4,4,4,5,4
urlo_munch3.jpg,6,6,6,0,5,6,4,5,4,5,5,5,7,4,6
urlo_munch1.jpg,5,5,5,5,0,6,3,6,3,4,4,2,5,5,6
urlo_munch6.jpg,5,4,3,6,6,0,5,2,5,4,4,5,5,5,2
urlo_munch10.jpg,4,4,4,4,3,5,0,4,3,4,4,2,6,6,5
urlo_munch4.jpg,4,4,3,5,6,2,4,0,4,4,3,4,5,5,3
urlo_munch13.jpg,5,3,5,4,3,5,3,4,0,5,2,1,5,3,5
urlo_munch8.jpg,4,5,4,5,4,4,4,4,5,0,6,5,4,6,3
urlo_munch12.jpg,5,3,4,5,4,4,4,3,2,6,0,2,3,3,5
urlo_munch11.jpg,5,3,4,5,2,5,2,4,1,5,2,0,5,4,5
urlo_munch2.jpg,4,5,4,7,5,5,6,5,5,4,3,5,0,4,5
urlo_munch5.jpg,7,6,5,4,5,5,6,5,3,6,3,4,4,0,5
urlo_munch0.jpg,5,4,4,6,6,2,5,3,5,3,5,5,5,5,0
Type,R-Meta,R-Meta,R-Meta,R-Meta,R-Meta,R-Meta,R-Meta,R-Meta,R-Meta,R-Meta,R-Meta,R-Meta,R-Meta,R-Meta,R-Meta
urlo_munch7.jpg,0,1,3,4,3,1,3,1,2,1,2,2,1,4,0
urlo_munch14.jpg,1,0,2,3,2,2,2,2,1,2,1,1,2,3,1
urlo_munch9.jpg,3,2,0,5,2,2,2,2,3,4,1,1,2,3,3
urlo_munch3.jpg,4,3,5,0,3,5,5,5,2,3,4,4,5,2,4
urlo_munch1.jpg,3,2,2,3,0,4,2,4,1,2,3,1,4,3,3
urlo_munch6.jpg,1,2,2,5,4,0,4,0,3,2,1,3,0,3,1
urlo_munch10.jpg,3,2,2,5,2,4,0,4,3,4,3,1,4,5,3
urlo_munch4.jpg,1,2,2,5,4,0,4,0,3,2,1,3,0,3,1
urlo_munch13.jpg,2,1,3,2,1,3,3,3,0,1,2,2,3,2,2
urlo_munch8.jpg,1,2,4,3,2,2,4,2,1,0,3,3,2,3,1
urlo_munch12.jpg,2,1,1,4,3,1,3,1,2,3,0,2,1,2,2
urlo_munch11.jpg,2,1,1,4,1,3,1,3,2,3,2,0,3,4,2
urlo_munch2.jpg,1,2,2,5,4,0,4,0,3,2,1,3,0,3,1
urlo_munch5.jpg,4,3,3,2,3,3,5,3,2,3,2,4,3,0,4
urlo_munch0.jpg,0,1,3,4,3,1,3,1,2,1,2,2,1,4,0
Type,Content,Content,Content,Content,Content,Content,Content,Content,Content,Content,Content,Content,Content,Content,Content
urlo_munch7.jpg,0,13,12,12,12,13,12,12,4,11,12,13,11,11,9
urlo_munch14.jpg,13,0,11,12,11,11,13,9,11,9,12,12,10,12,10
urlo_munch9.jpg,12,11,0,13,11,12,12,10,11,10,12,11,11,10,10
urlo_munch3.jpg,12,12,13,0,13,12,12,11,12,11,12,13,11,13,8
urlo_munch1.jpg,12,11,11,13,0,11,13,12,11,11,12,12,8,10,9
urlo_munch6.jpg,13,11,12,12,11,0,13,12,13,11,11,13,11,12,12
urlo_munch10.jpg,12,13,12,12,13,13,0,12,12,13,11,12,13,13,12
urlo_munch4.jpg,12,9,10,11,12,12,12,0,11,10,12,13,11,12,8
urlo_munch13.jpg,4,11,11,12,11,13,12,11,0,10,13,13,9,10,8
urlo_munch8.jpg,11,9,10,11,11,11,13,10,10,0,12,13,11,10,10
urlo_munch12.jpg,12,12,12,12,12,11,11,12,13,12,0,13,12,13,12
urlo_munch11.jpg,13,12,11,13,12,13,12,13,13,13,13,0,13,13,13
urlo_munch2.jpg,11,10,11,11,8,11,13,11,9,11,12,13,0,5,7
urlo_munch5.jpg,11,12,10,13,10,12,13,12,10,10,13,13,5,0,11
urlo_munch0.jpg,9,10,10,8,9,12,12,8,8,10,12,13,7,11,0
Type,R-Content,R-Content,R-Content,R-Content,R-Content,R-Content,R-Content,R-Content,R-Content,R-Content,R-Content,R-Content,R-Content,R-Content,R-Content
urlo_munch7.jpg,0,5,5,4,4,6,6,5,1,4,5,6,5,4,4
urlo_munch14.jpg,5,0,4,5,3,3,7,4,4,1,2,3,2,5,3
urlo_munch9.jpg,5,4,0,5,1,5,3,2,4,3,4,5,2,3,3
urlo_munch3.jpg,4,5,5,0,6,4,8,5,5,4,5,6,3,4,2
urlo_munch1.jpg,4,3,1,6,0,4,4,3,3,2,3,6,3,4,4
urlo_munch6.jpg,6,3,5,4,4,0,8,5,5,2,1,6,3,6,4
urlo_munch10.jpg,6,7,3,8,4,8,0,3,5,6,7,4,5,6,6
urlo_munch4.jpg,5,4,2,5,3,5,3,0,4,3,4,3,2,5,3
urlo_munch13.jpg,1,4,4,5,3,5,5,4,0,3,4,5,4,3,3
urlo_munch8.jpg,4,1,3,4,2,2,6,3,3,0,1,4,1,4,2
urlo_munch12.jpg,5,2,4,5,3,1,7,4,4,1,0,5,2,5,3
urlo_munch11.jpg,6,3,5,6,6,6,4,3,5,4,5,0,3,6,4
urlo_munch2.jpg,5,2,2,3,3,3,5,2,4,1,2,3,0,3,1
urlo_munch5.jpg,4,5,3,4,4,6,6,5,3,4,5,6,3,0,2
urlo_munch0.jpg,4,3,3,2,4,4,6,3,3,2,3,4,1,2,0
Type,Final-R,Final-R,Final-R,Final-R,Final-R,Final-R,Final-R,Final-R,Final-R,Final-R,Final-R,Final-R,Final-R,Final-R,Final-R
urlo_munch7.jpg,0,5,5,4,4,6,6,5,1,4,5,6,5,4,4
urlo_munch14.jpg,5,0,4,5,3,3,7,4,4,1,2,3,2,5,3
urlo_munch9.jpg,5,4,0,5,1,5,3,2,4,3,4,5,2,3,3
urlo_munch3.jpg,4,5,5,0,6,4,8,5,5,4,5,6,3,4,2
urlo_munch1.jpg,4,3,1,6,0,4,4,3,3,2,3,6,3,4,4
urlo_munch6.jpg,6,3,5,4,4,0,8,5,5,2,1,6,3,6,4
urlo_munch10.jpg,6,7,3,8,4,8,0,3,5,6,7,4,5,6,6
urlo_munch4.jpg,5,4,2,5,3,5,3,0,4,3,4,3,2,5,3
urlo_munch13.jpg,1,4,4,5,3,5,5,4,0,3,4,5,4,3,3
urlo_munch8.jpg,4,1,3,4,2,2,6,3,3,0,1,4,1,4,2
urlo_munch12.jpg,5,2,4,5,3,1,7,4,4,1,0,5,2,5,3
urlo_munch11.jpg,6,3,5,6,6,6,4,3,5,4,5,0,3,6,4
urlo_munch2.jpg,5,2,2,3,3,3,5,2,4,1,2,3,0,3,1
urlo_munch5.jpg,4,5,3,4,4,6,6,5,3,4,5,6,3,0,2
urlo_munch0.jpg,4,3,3,2,4,4,6,3,3,2,3,4,1,2,0
