,cinque_terre10.jpg,cinque_terre2.jpg,cinque_terre7.jpg,cinque_terre4.jpg,cinque_terre0.jpg,cinque_terre8.jpg,cinque_terre1.jpg,cinque_terre9.jpg,cinque_terre3.jpg,cinque_terre5.jpg,cinque_terre6.jpg,cinque_terre14.jpg,cinque_terre12.jpg,cinque_terre11.jpg,cinque_terre13.jpg
Type,SHA256,SHA256,SHA256,SHA256,SHA256,SHA256,SHA256,SHA256,SHA256,SHA256,SHA256,SHA256,SHA256,SHA256,SHA256
cinque_terre10.jpg,0,60,60,63,58,56,60,58,61,58,58,62,59,59,58
cinque_terre2.jpg,60,0,62,61,61,61,62,60,59,60,62,62,63,60,61
cinque_terre7.jpg,60,62,0,57,62,62,61,59,59,64,59,58,63,56,61
cinque_terre4.jpg,63,61,57,0,61,63,61,60,58,59,57,59,59,63,58
cinque_terre0.jpg,58,61,62,61,0,58,61,60,64,59,61,62,59,61,61
cinque_terre8.jpg,56,61,62,63,58,0,57,62,61,61,61,63,60,62,57
cinque_terre1.jpg,60,62,61,61,61,57,0,62,63,59,60,55,60,61,61
cinque_terre9.jpg,58,60,59,60,60,62,62,0,58,57,57,60,59,59,59
cinque_terre3.jpg,61,59,59,58,64,61,63,58,0,63,59,61,59,59,58
cinque_terre5.jpg,58,60,64,59,59,61,59,57,63,0,60,61,61,62,60
cinque_terre6.jpg,58,62,59,57,61,61,60,57,59,60,0,62,60,60,64
cinque_terre14.jpg,62,62,58,59,62,63,55,60,61,61,62,0,60,61,60
cinque_terre12.jpg,59,63,63,59,59,60,60,59,59,61,60,60,0,59,56
cinque_terre11.jpg,59,60,56,63,61,62,61,59,59,62,60,61,59,0,61
cinque_terre13.jpg,58,61,61,58,61,57,61,59,58,60,64,60,56,61,0
Type,Final-R,Final-R,Final-R,Final-R,Final-R,Final-R,Final-R,Final-R,Final-R,Final-R,Final-R,Final-R,Final-R,Final-R,Final-R
cinque_terre10.jpg,0,10,10,10,6,6,6,10,13,7,10,12,5,6,9
cinque_terre2.jpg,10,0,4,4,6,6,10,8,7,9,8,6,9,8,7
cinque_terre7.jpg,10,4,0,6,6,6,10,4,3,9,6,4,11,10,7
cinque_terre4.jpg,10,4,6,0,6,6,6,8,7,9,6,4,11,10,3
cinque_terre0.jpg,6,6,6,6,0,4,6,10,7,11,8,6,9,6,7
cinque_terre8.jpg,6,6,6,6,4,0,6,8,7,9,6,8,7,6,9
cinque_terre1.jpg,6,10,10,6,6,6,0,10,11,7,8,6,7,6,7
cinque_terre9.jpg,10,8,4,8,10,8,10,0,5,7,4,6,9,10,7
cinque_terre3.jpg,13,7,3,7,7,7,11,5,0,10,5,5,12,11,8
cinque_terre5.jpg,7,9,9,9,11,9,7,7,10,0,11,11,8,9,6
cinque_terre6.jpg,10,8,6,6,8,6,8,4,5,11,0,6,7,8,7
cinque_terre14.jpg,12,6,4,4,6,8,6,6,5,11,6,0,11,8,5
cinque_terre12.jpg,5,9,11,11,9,7,7,9,12,8,7,11,0,3,10
cinque_terre11.jpg,6,8,10,10,6,6,6,10,11,9,8,8,3,0,9
cinque_terre13.jpg,9,7,7,3,7,9,7,7,8,6,7,5,10,9,0
