,cinque_terre4.jpg,cinque_terre13.jpg,cinque_terre11.jpg,cinque_terre2.jpg,cinque_terre5.jpg,cinque_terre7.jpg,cinque_terre12.jpg,cinque_terre10.jpg,cinque_terre6.jpg,cinque_terre14.jpg,cinque_terre3.jpg,cinque_terre0.jpg,cinque_terre1.jpg,cinque_terre8.jpg,cinque_terre9.jpg
Type,Meta,Meta,Meta,Meta,Meta,Meta,Meta,Meta,Meta,Meta,Meta,Meta,Meta,Meta,Meta
cinque_terre4.jpg,0,6,4,6,4,5,6,6,5,6,4,4,4,5,3
cinque_terre13.jpg,6,0,5,6,7,6,6,3,7,4,6,5,5,6,7
cinque_terre11.jpg,4,5,0,3,3,6,3,4,6,4,4,4,2,5,3
cinque_terre2.jpg,6,6,3,0,3,6,2,5,7,5,5,5,3,5,3
cinque_terre5.jpg,4,7,3,3,0,4,2,5,7,4,5,6,4,4,1
cinque_terre7.jpg,5,6,6,6,4,0,5,4,6,4,6,4,6,3,5
cinque_terre12.jpg,6,6,3,2,2,5,0,4,7,4,5,5,3,5,3
cinque_terre10.jpg,6,3,4,5,5,4,4,0,7,3,5,4,4,5,6
cinque_terre6.jpg,5,7,6,7,7,6,7,7,0,7,7,5,6,6,7
cinque_terre14.jpg,6,4,4,5,4,4,4,3,7,0,5,5,4,4,5
cinque_terre3.jpg,4,6,4,5,5,6,5,5,7,5,0,4,3,5,4
cinque_terre0.jpg,4,5,4,5,6,4,5,4,5,5,4,0,3,4,5
cinque_terre1.jpg,4,5,2,3,4,6,3,4,6,4,3,3,0,4,3
cinque_terre8.jpg,5,6,5,5,4,3,5,5,6,4,5,4,4,0,3
cinque_terre9.jpg,3,7,3,3,1,5,3,6,7,5,4,5,3,3,0
Type,R-Meta,R-Meta,R-Meta,R-Meta,R-Meta,R-Meta,R-Meta,R-Meta,R-Meta,R-Meta,R-Meta,R-Meta,R-Meta,R-Meta,R-Meta
cinque_terre4.jpg,0,1,2,3,3,3,4,1,0,2,3,2,1,2,3
cinque_terre13.jpg,1,0,1,2,2,2,3,0,1,1,2,1,2,3,2
cinque_terre11.jpg,2,1,0,1,1,3,2,1,2,0,3,2,1,2,1
cinque_terre2.jpg,3,2,1,0,0,4,1,2,3,1,2,3,2,3,0
cinque_terre5.jpg,3,2,1,0,0,4,1,2,3,1,2,3,2,3,0
cinque_terre7.jpg,3,2,3,4,4,0,5,2,3,3,2,1,4,3,4
cinque_terre12.jpg,4,3,2,1,1,5,0,3,4,2,3,4,3,4,1
cinque_terre10.jpg,1,0,1,2,2,2,3,0,1,1,2,1,2,3,2
cinque_terre6.jpg,0,1,2,3,3,3,4,1,0,2,3,2,1,2,3
cinque_terre14.jpg,2,1,0,1,1,3,2,1,2,0,3,2,1,2,1
cinque_terre3.jpg,3,2,3,2,2,2,3,2,3,3,0,3,4,5,2
cinque_terre0.jpg,2,1,2,3,3,1,4,1,2,2,3,0,3,2,3
cinque_terre1.jpg,1,2,1,2,2,4,3,2,1,1,4,3,0,1,2
cinque_terre8.jpg,2,3,2,3,3,3,4,3,2,2,5,2,1,0,3
cinque_terre9.jpg,3,2,1,0,0,4,1,2,3,1,2,3,2,3,0
Type,Content,Content,Content,Content,Content,Content,Content,Content,Content,Content,Content,Content,Content,Content,Content
cinque_terre4.jpg,0,13,13,12,11,12,13,12,13,12,10,11,12,13,12
cinque_terre13.jpg,13,0,12,12,13,13,13,12,12,13,13,12,13,13,12
cinque_terre11.jpg,13,12,0,12,13,12,13,13,12,13,12,13,13,13,13
cinque_terre2.jpg,12,12,12,0,12,11,13,12,13,11,12,11,13,13,12
cinque_terre5.jpg,11,13,13,12,0,13,13,13,13,12,13,13,13,13,12
cinque_terre7.jpg,12,13,12,11,13,0,13,10,13,13,10,13,13,13,13
cinque_terre12.jpg,13,13,13,13,13,13,0,13,11,12,13,12,12,13,12
cinque_terre10.jpg,12,12,13,12,13,10,13,0,13,12,10,12,13,13,13
cinque_terre6.jpg,13,12,12,13,13,13,11,13,0,13,13,12,12,12,13
cinque_terre14.jpg,12,13,13,11,12,13,12,12,13,0,13,13,13,12,12
cinque_terre3.jpg,10,13,12,12,13,10,13,10,13,13,0,13,12,12,13
cinque_terre0.jpg,11,12,13,11,13,13,12,12,12,13,13,0,13,12,13
cinque_terre1.jpg,12,13,13,13,13,13,12,13,12,13,12,13,0,12,13
cinque_terre8.jpg,13,13,13,13,13,13,13,13,12,12,12,12,12,0,12
cinque_terre9.jpg,12,12,13,12,12,13,12,13,13,12,13,13,13,12,0
Type,R-Content,R-Content,R-Content,R-Content,R-Content,R-Content,R-Content,R-Content,R-Content,R-Content,R-Content,R-Content,R-Content,R-Content,R-Content
cinque_terre4.jpg,0,9,8,8,9,8,7,7,9,9,6,10,11,11,7
cinque_terre13.jpg,9,0,5,9,12,9,8,8,4,10,7,7,8,10,4
cinque_terre11.jpg,8,5,0,8,11,8,9,11,9,11,8,8,7,9,3
cinque_terre2.jpg,8,9,8,0,7,10,11,11,11,9,12,6,9,11,5
cinque_terre5.jpg,9,12,11,7,0,9,12,8,12,10,9,11,12,10,10
cinque_terre7.jpg,8,9,8,10,9,0,11,7,11,9,6,10,11,7,9
cinque_terre12.jpg,7,8,9,11,12,11,0,6,8,10,9,7,10,10,10
cinque_terre10.jpg,7,8,11,11,8,7,6,0,8,6,7,9,12,8,10
cinque_terre6.jpg,9,4,9,11,12,11,8,8,0,10,7,7,10,12,8
cinque_terre14.jpg,9,10,11,9,10,9,10,6,10,0,11,9,10,6,8
cinque_terre3.jpg,6,7,8,12,9,6,9,7,7,11,0,10,7,11,9
cinque_terre0.jpg,10,7,8,6,11,10,7,9,7,9,10,0,7,9,7
cinque_terre1.jpg,11,8,7,9,12,11,10,12,10,10,7,7,0,12,6
cinque_terre8.jpg,11,10,9,11,10,7,10,8,12,6,11,9,12,0,10
cinque_terre9.jpg,7,4,3,5,10,9,10,10,8,8,9,7,6,10,0
Type,Final-R,Final-R,Final-R,Final-R,Final-R,Final-R,Final-R,Final-R,Final-R,Final-R,Final-R,Final-R,Final-R,Final-R,Final-R
cinque_terre4.jpg,0,7,8,7,7,5,6,4,7,6,5,10,8,9,7
cinque_terre13.jpg,7,0,3,8,10,6,7,7,4,9,6,5,7,8,4
cinque_terre11.jpg,8,3,0,7,9,7,10,8,7,8,7,6,6,7,3
cinque_terre2.jpg,7,8,7,0,4,8,9,7,10,5,8,5,9,8,4
cinque_terre5.jpg,7,10,9,4,0,10,9,5,10,7,6,7,9,10,6
cinque_terre7.jpg,5,6,7,8,10,0,9,5,8,9,4,7,7,6,8
cinque_terre12.jpg,6,7,10,9,9,9,0,4,7,8,7,8,8,9,9
cinque_terre10.jpg,4,7,8,7,5,5,4,0,7,6,3,8,8,7,7
cinque_terre6.jpg,7,4,7,10,10,8,7,7,0,9,6,7,7,10,8
cinque_terre14.jpg,6,9,8,5,7,9,8,6,9,0,7,8,6,5,5
cinque_terre3.jpg,5,6,7,8,6,4,7,3,6,7,0,5,5,6,6
cinque_terre0.jpg,10,5,6,5,7,7,8,8,7,8,5,0,6,7,5
cinque_terre1.jpg,8,7,6,9,9,7,8,8,7,6,5,6,0,7,7
cinque_terre8.jpg,9,8,7,8,10,6,9,7,10,5,6,7,7,0,6
cinque_terre9.jpg,7,4,3,4,6,8,9,7,8,5,6,5,7,6,0
