,lavorare_preferisco_mare7.jpg,lavorare_preferisco_mare6.jpg,lavorare_preferisco_mare4.jpg,lavorare_preferisco_mare1.jpg,lavorare_preferisco_mare11.jpg,lavorare_preferisco_mare10.jpg,lavorare_preferisco_mare9.jpg,lavorare_preferisco_mare13.jpg,lavorare_preferisco_mare12.jpg,lavorare_preferisco_mare3.jpg,lavorare_preferisco_mare5.jpg,lavorare_preferisco_mare8.jpg,lavorare_preferisco_mare0.jpg,lavorare_preferisco_mare2.jpg,lavorare_preferisco_mare14.jpg
Type,Meta,Meta,Meta,Meta,Meta,Meta,Meta,Meta,Meta,Meta,Meta,Meta,Meta,Meta,Meta
lavorare_preferisco_mare7.jpg,0,3,3,2,5,3,6,5,5,7,4,3,3,4,2
lavorare_preferisco_mare6.jpg,3,0,1,4,3,3,5,5,3,5,5,5,2,5,2
lavorare_preferisco_mare4.jpg,3,1,0,4,3,3,5,5,3,5,5,5,2,5,2
lavorare_preferisco_mare1.jpg,2,4,4,0,3,3,4,3,5,5,2,1,5,4,3
lavorare_preferisco_mare11.jpg,5,3,3,3,0,3,2,2,2,3,2,2,2,4,4
lavorare_preferisco_mare10.jpg,3,3,3,3,3,0,5,3,4,5,3,3,3,4,2
lavorare_preferisco_mare9.jpg,6,5,5,4,2,5,0,3,4,4,2,3,4,5,6
lavorare_preferisco_mare13.jpg,5,5,5,3,2,3,3,0,4,4,2,2,4,4,4
lavorare_preferisco_mare12.jpg,5,3,3,5,2,4,4,4,0,5,4,4,2,3,3
lavorare_preferisco_mare3.jpg,7,5,5,5,3,5,4,4,5,0,5,5,5,7,6
lavorare_preferisco_mare5.jpg,4,5,5,2,2,3,2,2,4,5,0,1,4,3,4
lavorare_preferisco_mare8.jpg,3,5,5,1,2,3,3,2,4,5,1,0,4,3,4
lavorare_preferisco_mare0.jpg,3,2,2,5,2,3,4,4,2,5,4,4,0,4,3
lavorare_preferisco_mare2.jpg,4,5,5,4,4,4,5,4,3,7,3,3,4,0,4
lavorare_preferisco_mare14.jpg,2,2,2,3,4,2,6,4,3,6,4,4,3,4,0
Type,R-Meta,R-Meta,R-Meta,R-Meta,R-Meta,R-Meta,R-Meta,R-Meta,R-Meta,R-Meta,R-Meta,R-Meta,R-Meta,R-Meta,R-Meta
lavorare_preferisco_mare7.jpg,0,2,3,1,3,3,1,3,3,3,1,1,2,2,3
lavorare_preferisco_mare6.jpg,2,0,1,3,1,1,3,1,1,1,3,3,0,2,1
lavorare_preferisco_mare4.jpg,3,1,0,2,0,0,2,0,0,0,2,2,1,1,0
lavorare_preferisco_mare1.jpg,1,3,2,0,2,2,0,2,2,2,0,0,3,1,2
lavorare_preferisco_mare11.jpg,3,1,0,2,0,0,2,0,0,0,2,2,1,1,0
lavorare_preferisco_mare10.jpg,3,1,0,2,0,0,2,0,0,0,2,2,1,1,0
lavorare_preferisco_mare9.jpg,1,3,2,0,2,2,0,2,2,2,0,0,3,1,2
lavorare_preferisco_mare13.jpg,3,1,0,2,0,0,2,0,0,0,2,2,1,1,0
lavorare_preferisco_mare12.jpg,3,1,0,2,0,0,2,0,0,0,2,2,1,1,0
lavorare_preferisco_mare3.jpg,3,1,0,2,0,0,2,0,0,0,2,2,1,1,0
lavorare_preferisco_mare5.jpg,1,3,2,0,2,2,0,2,2,2,0,0,3,1,2
lavorare_preferisco_mare8.jpg,1,3,2,0,2,2,0,2,2,2,0,0,3,1,2
lavorare_preferisco_mare0.jpg,2,0,1,3,1,1,3,1,1,1,3,3,0,2,1
lavorare_preferisco_mare2.jpg,2,2,1,1,1,1,1,1,1,1,1,1,2,0,1
lavorare_preferisco_mare14.jpg,3,1,0,2,0,0,2,0,0,0,2,2,1,1,0
Type,Content,Content,Content,Content,Content,Content,Content,Content,Content,Content,Content,Content,Content,Content,Content
lavorare_preferisco_mare7.jpg,0,12,12,13,13,13,13,12,13,13,13,13,13,13,13
lavorare_preferisco_mare6.jpg,12,0,12,13,13,12,12,10,11,13,12,12,11,12,11
lavorare_preferisco_mare4.jpg,12,12,0,13,13,12,13,13,13,13,13,13,13,13,11
lavorare_preferisco_mare1.jpg,13,13,13,0,13,12,12,12,13,12,12,13,13,13,12
lavorare_preferisco_mare11.jpg,13,13,13,13,0,13,13,13,13,13,13,12,12,11,12
lavorare_preferisco_mare10.jpg,13,12,12,12,13,0,13,13,11,12,11,13,13,13,13
lavorare_preferisco_mare9.jpg,13,12,13,12,13,13,0,13,13,12,13,12,12,12,13
lavorare_preferisco_mare13.jpg,12,10,13,12,13,13,13,0,13,13,13,10,12,12,12
lavorare_preferisco_mare12.jpg,13,11,13,13,13,11,13,13,0,12,12,13,13,13,13
lavorare_preferisco_mare3.jpg,13,13,13,12,13,12,12,13,12,0,12,13,13,12,13
lavorare_preferisco_mare5.jpg,13,12,13,12,13,11,13,13,12,12,0,13,13,13,11
lavorare_preferisco_mare8.jpg,13,12,13,13,12,13,12,10,13,13,13,0,11,12,10
lavorare_preferisco_mare0.jpg,13,11,13,13,12,13,12,12,13,13,13,11,0,13,12
lavorare_preferisco_mare2.jpg,13,12,13,13,11,13,12,12,13,12,13,12,13,0,13
lavorare_preferisco_mare14.jpg,13,11,11,12,12,13,13,12,13,13,11,10,12,13,0
Type,R-Content,R-Content,R-Content,R-Content,R-Content,R-Content,R-Content,R-Content,R-Content,R-Content,R-Content,R-Content,R-Content,R-Content,R-Content
lavorare_preferisco_mare7.jpg,0,4,5,6,4,5,4,4,4,5,3,2,2,4,4
lavorare_preferisco_mare6.jpg,4,0,3,2,4,3,2,2,2,3,3,2,4,4,2
lavorare_preferisco_mare4.jpg,5,3,0,3,5,2,3,3,3,0,6,3,3,1,3
lavorare_preferisco_mare1.jpg,6,2,3,0,2,3,2,2,4,3,3,4,4,4,2
lavorare_preferisco_mare11.jpg,4,4,5,2,0,5,2,2,4,5,1,4,4,6,2
lavorare_preferisco_mare10.jpg,5,3,2,3,5,0,5,5,3,2,4,3,5,3,5
lavorare_preferisco_mare9.jpg,4,2,3,2,2,5,0,2,2,3,3,2,4,4,2
lavorare_preferisco_mare13.jpg,4,2,3,2,2,5,2,0,4,3,3,4,2,4,0
lavorare_preferisco_mare12.jpg,4,2,3,4,4,3,2,4,0,3,3,2,6,4,4
lavorare_preferisco_mare3.jpg,5,3,0,3,5,2,3,3,3,0,6,3,3,1,3
lavorare_preferisco_mare5.jpg,3,3,6,3,1,4,3,3,3,6,0,3,5,7,3
lavorare_preferisco_mare8.jpg,2,2,3,4,4,3,2,4,2,3,3,0,4,4,4
lavorare_preferisco_mare0.jpg,2,4,3,4,4,5,4,2,6,3,5,4,0,2,2
lavorare_preferisco_mare2.jpg,4,4,1,4,6,3,4,4,4,1,7,4,2,0,4
lavorare_preferisco_mare14.jpg,4,2,3,2,2,5,2,0,4,3,3,4,2,4,0
Type,Final-R,Final-R,Final-R,Final-R,Final-R,Final-R,Final-R,Final-R,Final-R,Final-R,Final-R,Final-R,Final-R,Final-R,Final-R
lavorare_preferisco_mare7.jpg,0,4,5,6,4,5,4,4,4,5,3,2,2,4,4
lavorare_preferisco_mare6.jpg,4,0,3,2,4,3,2,2,2,3,3,2,4,4,2
lavorare_preferisco_mare4.jpg,5,3,0,3,5,2,3,3,3,0,6,3,3,1,3
lavorare_preferisco_mare1.jpg,6,2,3,0,2,3,2,2,4,3,3,4,4,4,2
lavorare_preferisco_mare11.jpg,4,4,5,2,0,5,2,2,4,5,1,4,4,6,2
lavorare_preferisco_mare10.jpg,5,3,2,3,5,0,5,5,3,2,4,3,5,3,5
lavorare_preferisco_mare9.jpg,4,2,3,2,2,5,0,2,2,3,3,2,4,4,2
lavorare_preferisco_mare13.jpg,4,2,3,2,2,5,2,0,4,3,3,4,2,4,0
lavorare_preferisco_mare12.jpg,4,2,3,4,4,3,2,4,0,3,3,2,6,4,4
lavorare_preferisco_mare3.jpg,5,3,0,3,5,2,3,3,3,0,6,3,3,1,3
lavorare_preferisco_mare5.jpg,3,3,6,3,1,4,3,3,3,6,0,3,5,7,3
lavorare_preferisco_mare8.jpg,2,2,3,4,4,3,2,4,2,3,3,0,4,4,4
lavorare_preferisco_mare0.jpg,2,4,3,4,4,5,4,2,6,3,5,4,0,2,2
lavorare_preferisco_mare2.jpg,4,4,1,4,6,3,4,4,4,1,7,4,2,0,4
lavorare_preferisco_mare14.jpg,4,2,3,2,2,5,2,0,4,3,3,4,2,4,0
