,altare_della_patria7.jpg,altare_della_patria13.jpg,altare_della_patria0.jpg,altare_della_patria6.jpg,altare_della_patria9.jpg,altare_della_patria4.jpg,altare_della_patria1.jpg,altare_della_patria8.jpg,altare_della_patria5.jpg,altare_della_patria12.jpg,altare_della_patria10.jpg,altare_della_patria2.jpg,altare_della_patria14.jpg,altare_della_patria11.jpg,altare_della_patria3.jpg
Type,SHA256,SHA256,SHA256,SHA256,SHA256,SHA256,SHA256,SHA256,SHA256,SHA256,SHA256,SHA256,SHA256,SHA256,SHA256
altare_della_patria7.jpg,0,60,61,60,63,59,59,60,57,60,60,62,60,60,60
altare_della_patria13.jpg,60,0,62,61,58,61,58,61,58,59,62,60,61,58,60
altare_della_patria0.jpg,61,62,0,57,63,60,59,60,59,56,54,60,59,59,59
altare_della_patria6.jpg,60,61,57,0,60,57,57,60,58,63,59,61,60,59,58
altare_della_patria9.jpg,63,58,63,60,0,60,59,62,60,59,61,59,61,60,59
altare_della_patria4.jpg,59,61,60,57,60,0,60,62,63,60,63,60,63,61,59
altare_della_patria1.jpg,59,58,59,57,59,60,0,60,58,60,62,57,62,58,59
altare_della_patria8.jpg,60,61,60,60,62,62,60,0,57,58,60,58,58,56,60
altare_della_patria5.jpg,57,58,59,58,60,63,58,57,0,63,61,61,60,61,59
altare_della_patria12.jpg,60,59,56,63,59,60,60,58,63,0,56,61,60,59,60
altare_della_patria10.jpg,60,62,54,59,61,63,62,60,61,56,0,56,58,64,59
altare_della_patria2.jpg,62,60,60,61,59,60,57,58,61,61,56,0,59,60,61
altare_della_patria14.jpg,60,61,59,60,61,63,62,58,60,60,58,59,0,59,59
altare_della_patria11.jpg,60,58,59,59,60,61,58,56,61,59,64,60,59,0,60
altare_della_patria3.jpg,60,60,59,58,59,59,59,60,59,60,59,61,59,60,0
Type,Final-R,Final-R,Final-R,Final-R,Final-R,Final-R,Final-R,Final-R,Final-R,Final-R,Final-R,Final-R,Final-R,Final-R,Final-R
altare_della_patria7.jpg,0,15,13,14,15,15,13,13,9,12,13,11,11,15,10
altare_della_patria13.jpg,15,0,16,13,14,16,12,12,14,13,14,14,12,14,15
altare_della_patria0.jpg,13,16,0,15,14,14,16,12,16,15,14,16,16,16,15
altare_della_patria6.jpg,14,13,15,0,11,11,13,15,15,14,11,11,13,13,12
altare_della_patria9.jpg,15,14,14,11,0,16,16,14,16,15,12,14,16,14,15
altare_della_patria4.jpg,15,16,14,11,16,0,16,12,16,13,16,14,16,12,11
altare_della_patria1.jpg,13,12,16,13,16,16,0,12,14,11,12,16,14,14,13
altare_della_patria8.jpg,13,12,12,15,14,12,12,0,16,13,16,16,14,16,13
altare_della_patria5.jpg,9,14,16,15,16,16,14,16,0,11,16,14,12,12,11
altare_della_patria12.jpg,12,13,15,14,15,13,11,13,11,0,13,15,15,15,14
altare_della_patria10.jpg,13,14,14,11,12,16,12,16,16,13,0,14,14,16,15
altare_della_patria2.jpg,11,14,16,11,14,14,16,16,14,15,14,0,12,14,11
altare_della_patria14.jpg,11,12,16,13,16,16,14,14,12,15,14,12,0,16,11
altare_della_patria11.jpg,15,14,16,13,14,12,14,16,12,15,16,14,16,0,9
altare_della_patria3.jpg,10,15,15,12,15,11,13,13,11,14,15,11,11,9,0
