,fontana_trevi6.jpg,fontana_trevi11.jpg,fontana_trevi5.jpg,fontana_trevi13.jpg,fontana_trevi3.jpg,fontana_trevi8.jpg,fontana_trevi2.jpg,fontana_trevi0.jpg,fontana_trevi7.jpg,fontana_trevi9.jpg,fontana_trevi10.jpg,fontana_trevi1.jpg,fontana_trevi4.jpg,fontana_trevi14.jpg,fontana_trevi12.jpg
Type,Meta,Meta,Meta,Meta,Meta,Meta,Meta,Meta,Meta,Meta,Meta,Meta,Meta,Meta,Meta
fontana_trevi6.jpg,0,5,3,5,5,3,4,6,5,4,4,4,6,4,5
fontana_trevi11.jpg,5,0,5,4,3,4,6,4,4,6,5,3,6,5,4
fontana_trevi5.jpg,3,5,0,3,6,4,2,5,4,4,4,4,5,4,3
fontana_trevi13.jpg,5,4,3,0,5,4,4,4,4,3,2,4,6,1,3
fontana_trevi3.jpg,5,3,6,5,0,3,5,4,5,5,5,4,5,5,6
fontana_trevi8.jpg,3,4,4,4,3,0,2,4,3,3,4,2,4,4,5
fontana_trevi2.jpg,4,6,2,4,5,2,0,4,4,2,4,4,3,4,4
fontana_trevi0.jpg,6,4,5,4,4,4,4,0,5,4,4,5,5,4,5
fontana_trevi7.jpg,5,4,4,4,5,3,4,5,0,5,5,2,5,5,5
fontana_trevi9.jpg,4,6,4,3,5,3,2,4,5,0,4,5,4,3,4
fontana_trevi10.jpg,4,5,4,2,5,4,4,4,5,4,0,5,6,1,4
fontana_trevi1.jpg,4,3,4,4,4,2,4,5,2,5,5,0,4,5,5
fontana_trevi4.jpg,6,6,5,6,5,4,3,5,5,4,6,4,0,6,6
fontana_trevi14.jpg,4,5,4,1,5,4,4,4,5,3,1,5,6,0,4
fontana_trevi12.jpg,5,4,3,3,6,5,4,5,5,4,4,5,6,4,0
Type,R-Meta,R-Meta,R-Meta,R-Meta,R-Meta,R-Meta,R-Meta,R-Meta,R-Meta,R-Meta,R-Meta,R-Meta,R-Meta,R-Meta,R-Meta
fontana_trevi6.jpg,0,2,2,2,2,0,2,4,2,2,4,0,4,2,4
fontana_trevi11.jpg,2,0,4,2,0,2,4,4,2,2,4,2,4,2,4
fontana_trevi5.jpg,2,4,0,2,4,2,0,2,2,2,2,2,4,2,2
fontana_trevi13.jpg,2,2,2,0,2,2,2,2,4,0,2,2,4,0,2
fontana_trevi3.jpg,2,0,4,2,0,2,4,4,2,2,4,2,4,2,4
fontana_trevi8.jpg,0,2,2,2,2,0,2,4,2,2,4,0,4,2,4
fontana_trevi2.jpg,2,4,0,2,4,2,0,2,2,2,2,2,4,2,2
fontana_trevi0.jpg,4,4,2,2,4,4,2,0,4,2,2,4,4,2,0
fontana_trevi7.jpg,2,2,2,4,2,2,2,4,0,4,4,2,4,4,4
fontana_trevi9.jpg,2,2,2,0,2,2,2,2,4,0,2,2,4,0,2
fontana_trevi10.jpg,4,4,2,2,4,4,2,2,4,2,0,4,2,2,2
fontana_trevi1.jpg,0,2,2,2,2,0,2,4,2,2,4,0,4,2,4
fontana_trevi4.jpg,4,4,4,4,4,4,4,4,4,4,2,4,0,4,4
fontana_trevi14.jpg,2,2,2,0,2,2,2,2,4,0,2,2,4,0,2
fontana_trevi12.jpg,4,4,2,2,4,4,2,0,4,2,2,4,4,2,0
Type,Content,Content,Content,Content,Content,Content,Content,Content,Content,Content,Content,Content,Content,Content,Content
fontana_trevi6.jpg,0,13,11,12,13,13,12,11,11,13,13,12,10,12,12
fontana_trevi11.jpg,13,0,13,13,13,13,13,13,12,13,13,13,12,12,13
fontana_trevi5.jpg,11,13,0,11,13,12,12,12,13,12,13,11,11,11,12
fontana_trevi13.jpg,12,13,11,0,12,12,13,12,13,12,13,10,12,13,13
fontana_trevi3.jpg,13,13,13,12,0,12,12,12,13,13,11,13,13,13,13
fontana_trevi8.jpg,13,13,12,12,12,0,13,10,12,12,13,11,13,13,11
fontana_trevi2.jpg,12,13,12,13,12,13,0,12,13,13,12,12,13,13,13
fontana_trevi0.jpg,11,13,12,12,12,10,12,0,12,12,12,13,12,13,11
fontana_trevi7.jpg,11,12,13,13,13,12,13,12,0,12,13,13,12,11,10
fontana_trevi9.jpg,13,13,12,12,13,12,13,12,12,0,12,13,13,13,12
fontana_trevi10.jpg,13,13,13,13,11,13,12,12,13,12,0,13,12,12,12
fontana_trevi1.jpg,12,13,11,10,13,11,12,13,13,13,13,0,11,12,13
fontana_trevi4.jpg,10,12,11,12,13,13,13,12,12,13,12,11,0,12,13
fontana_trevi14.jpg,12,12,11,13,13,13,13,13,11,13,12,12,12,0,12
fontana_trevi12.jpg,12,13,12,13,13,11,13,11,10,12,12,13,13,12,0
Type,R-Content,R-Content,R-Content,R-Content,R-Content,R-Content,R-Content,R-Content,R-Content,R-Content,R-Content,R-Content,R-Content,R-Content,R-Content
fontana_trevi6.jpg,0,6,5,6,5,8,6,6,7,8,6,6,4,5,4
fontana_trevi11.jpg,6,0,7,8,5,6,6,8,5,8,8,6,6,7,8
fontana_trevi5.jpg,5,7,0,7,6,5,7,5,6,7,5,5,5,4,3
fontana_trevi13.jpg,6,8,7,0,3,6,8,4,7,8,8,6,6,7,8
fontana_trevi3.jpg,5,5,6,3,0,5,5,5,6,7,7,7,7,6,7
fontana_trevi8.jpg,8,6,5,6,5,0,8,4,5,6,6,8,8,7,4
fontana_trevi2.jpg,6,6,7,8,5,8,0,8,7,4,8,8,6,7,8
fontana_trevi0.jpg,6,8,5,4,5,4,8,0,7,8,6,8,6,7,6
fontana_trevi7.jpg,7,5,6,7,6,5,7,7,0,3,5,5,5,4,5
fontana_trevi9.jpg,8,8,7,8,7,6,4,8,3,0,6,8,6,5,6
fontana_trevi10.jpg,6,8,5,8,7,6,8,6,5,6,0,6,6,3,4
fontana_trevi1.jpg,6,6,5,6,7,8,8,8,5,8,6,0,4,5,6
fontana_trevi4.jpg,4,6,5,6,7,8,6,6,5,6,6,4,0,5,6
fontana_trevi14.jpg,5,7,4,7,6,7,7,7,4,5,3,5,5,0,5
fontana_trevi12.jpg,4,8,3,8,7,4,8,6,5,6,4,6,6,5,0
Type,Final-R,Final-R,Final-R,Final-R,Final-R,Final-R,Final-R,Final-R,Final-R,Final-R,Final-R,Final-R,Final-R,Final-R,Final-R
fontana_trevi6.jpg,0,7,4,6,7,7,7,6,8,8,8,6,7,5,5
fontana_trevi11.jpg,7,0,7,7,4,6,8,7,7,7,7,7,6,6,8
fontana_trevi5.jpg,4,7,0,8,7,7,5,6,6,8,6,6,7,5,5
fontana_trevi13.jpg,6,7,8,0,3,7,9,4,10,8,10,8,9,7,9
fontana_trevi3.jpg,7,4,7,3,0,6,8,5,7,7,9,7,8,6,8
fontana_trevi8.jpg,7,6,7,7,6,0,8,7,5,7,7,7,8,8,8
fontana_trevi2.jpg,7,8,5,9,8,8,0,7,7,5,9,9,8,8,8
fontana_trevi0.jpg,6,7,6,4,5,7,7,0,8,8,6,10,7,7,5
fontana_trevi7.jpg,8,7,6,10,7,5,7,8,0,6,8,6,7,7,7
fontana_trevi9.jpg,8,7,8,8,7,7,5,8,6,0,8,10,9,5,7
fontana_trevi10.jpg,8,7,6,10,9,7,9,6,8,8,0,10,7,5,3
fontana_trevi1.jpg,6,7,6,8,7,7,9,10,6,10,10,0,7,7,9
fontana_trevi4.jpg,7,6,7,9,8,8,8,7,7,9,7,7,0,8,8
fontana_trevi14.jpg,5,6,5,7,6,8,8,7,7,5,5,7,8,0,6
fontana_trevi12.jpg,5,8,5,9,8,8,8,5,7,7,3,9,8,6,0
