,altare_della_patria7.jpg,altare_della_patria13.jpg,altare_della_patria0.jpg,altare_della_patria6.jpg,altare_della_patria9.jpg,altare_della_patria4.jpg,altare_della_patria1.jpg,altare_della_patria8.jpg,altare_della_patria5.jpg,altare_della_patria12.jpg,altare_della_patria10.jpg,altare_della_patria2.jpg,altare_della_patria14.jpg,altare_della_patria11.jpg,altare_della_patria3.jpg
Type,Meta,Meta,Meta,Meta,Meta,Meta,Meta,Meta,Meta,Meta,Meta,Meta,Meta,Meta,Meta
altare_della_patria7.jpg,0,6,3,3,2,2,3,3,1,6,4,2,4,4,3
altare_della_patria13.jpg,6,0,7,5,5,6,6,5,6,6,4,5,6,5,6
altare_della_patria0.jpg,3,7,0,5,3,2,4,4,3,6,5,4,5,3,4
altare_della_patria6.jpg,3,5,5,0,4,4,4,4,2,3,4,1,4,3,2
altare_della_patria9.jpg,2,5,3,4,0,1,4,2,2,5,3,3,3,4,4
altare_della_patria4.jpg,2,6,2,4,1,0,3,2,2,5,3,3,3,3,4
altare_della_patria1.jpg,3,6,4,4,4,3,0,4,3,5,4,4,3,3,5
altare_della_patria8.jpg,3,5,4,4,2,2,4,0,2,4,1,3,2,5,4
altare_della_patria5.jpg,1,6,3,2,2,2,3,2,0,5,3,1,3,4,2
altare_della_patria12.jpg,6,6,6,3,5,5,5,4,5,0,4,4,4,5,4
altare_della_patria10.jpg,4,4,5,4,3,3,4,1,3,4,0,4,2,5,5
altare_della_patria2.jpg,2,5,4,1,3,3,4,3,1,4,4,0,4,3,1
altare_della_patria14.jpg,4,6,5,4,3,3,3,2,3,4,2,4,0,4,5
altare_della_patria11.jpg,4,5,3,3,4,3,3,5,4,5,5,3,4,0,4
altare_della_patria3.jpg,3,6,4,2,4,4,5,4,2,4,5,1,5,4,0
Type,R-Meta,R-Meta,R-Meta,R-Meta,R-Meta,R-Meta,R-Meta,R-Meta,R-Meta,R-Meta,R-Meta,R-Meta,R-Meta,R-Meta,R-Meta
altare_della_patria7.jpg,0,6,2,2,2,2,0,2,0,5,2,2,2,2,3
altare_della_patria13.jpg,6,0,6,4,6,6,6,6,6,5,6,4,6,4,5
altare_della_patria0.jpg,2,6,0,4,2,2,2,2,2,5,2,4,2,2,5
altare_della_patria6.jpg,2,4,4,0,4,4,2,4,2,3,4,0,4,2,1
altare_della_patria9.jpg,2,6,2,4,0,0,2,0,2,3,0,4,0,2,5
altare_della_patria4.jpg,2,6,2,4,0,0,2,0,2,3,0,4,0,2,5
altare_della_patria1.jpg,0,6,2,2,2,2,0,2,0,5,2,2,2,2,3
altare_della_patria8.jpg,2,6,2,4,0,0,2,0,2,3,0,4,0,2,5
altare_della_patria5.jpg,0,6,2,2,2,2,0,2,0,5,2,2,2,2,3
altare_della_patria12.jpg,5,5,5,3,3,3,5,3,5,0,3,3,3,3,4
altare_della_patria10.jpg,2,6,2,4,0,0,2,0,2,3,0,4,0,2,5
altare_della_patria2.jpg,2,4,4,0,4,4,2,4,2,3,4,0,4,2,1
altare_della_patria14.jpg,2,6,2,4,0,0,2,0,2,3,0,4,0,2,5
altare_della_patria11.jpg,2,4,2,2,2,2,2,2,2,3,2,2,2,0,3
altare_della_patria3.jpg,3,5,5,1,5,5,3,5,3,4,5,1,5,3,0
Type,Content,Content,Content,Content,Content,Content,Content,Content,Content,Content,Content,Content,Content,Content,Content
altare_della_patria7.jpg,0,12,12,13,12,12,12,13,13,11,13,13,12,13,13
altare_della_patria13.jpg,12,0,13,13,13,11,12,13,12,13,13,13,12,13,11
altare_della_patria0.jpg,12,13,0,13,13,13,12,13,13,12,12,12,13,13,13
altare_della_patria6.jpg,13,13,13,0,13,13,13,13,12,12,11,13,13,13,13
altare_della_patria9.jpg,12,13,13,13,0,13,13,13,13,12,13,13,11,12,13
altare_della_patria4.jpg,12,11,13,13,13,0,13,12,13,12,12,13,12,11,13
altare_della_patria1.jpg,12,12,12,13,13,13,0,12,12,13,13,13,12,13,11
altare_della_patria8.jpg,13,13,13,13,13,12,12,0,12,12,13,13,12,13,12
altare_della_patria5.jpg,13,12,13,12,13,13,12,12,0,13,12,13,12,13,12
altare_della_patria12.jpg,11,13,12,12,12,12,13,12,13,0,11,13,13,13,12
altare_della_patria10.jpg,13,13,12,11,13,12,13,13,12,11,0,13,13,12,13
altare_della_patria2.jpg,13,13,12,13,13,13,13,13,13,13,13,0,13,12,13
altare_della_patria14.jpg,12,12,13,13,11,12,12,12,12,13,13,13,0,11,11
altare_della_patria11.jpg,13,13,13,13,12,11,13,13,13,13,12,12,11,0,12
altare_della_patria3.jpg,13,11,13,13,13,13,11,12,12,12,13,13,11,12,0
Type,R-Content,R-Content,R-Content,R-Content,R-Content,R-Content,R-Content,R-Content,R-Content,R-Content,R-Content,R-Content,R-Content,R-Content,R-Content
altare_della_patria7.jpg,0,7,9,10,11,9,9,10,11,9,11,12,12,12,11
altare_della_patria13.jpg,7,0,8,11,8,8,14,11,8,10,12,13,11,7,10
altare_della_patria0.jpg,9,8,0,9,12,12,12,11,6,10,10,11,11,13,12
altare_della_patria6.jpg,10,11,9,0,11,11,11,12,7,11,9,10,8,10,9
altare_della_patria9.jpg,11,8,12,11,0,14,14,11,10,10,10,9,9,7,10
altare_della_patria4.jpg,9,8,12,11,14,0,12,9,12,10,10,11,11,11,10
altare_della_patria1.jpg,9,14,12,11,14,12,0,9,12,14,12,11,11,11,10
altare_della_patria8.jpg,10,11,11,12,11,9,9,0,9,11,7,10,10,12,7
altare_della_patria5.jpg,11,8,6,7,10,12,12,9,0,12,8,9,9,9,10
altare_della_patria12.jpg,9,10,10,11,10,10,14,11,12,0,8,9,11,13,10
altare_della_patria10.jpg,11,12,10,9,10,10,12,7,8,8,0,7,9,11,10
altare_della_patria2.jpg,12,13,11,10,9,11,11,10,9,9,7,0,4,8,5
altare_della_patria14.jpg,12,11,11,8,9,11,11,10,9,11,9,4,0,6,5
altare_della_patria11.jpg,12,7,13,10,7,11,11,12,9,13,11,8,6,0,7
altare_della_patria3.jpg,11,10,12,9,10,10,10,7,10,10,10,5,5,7,0
Type,Final-R,Final-R,Final-R,Final-R,Final-R,Final-R,Final-R,Final-R,Final-R,Final-R,Final-R,Final-R,Final-R,Final-R,Final-R
altare_della_patria7.jpg,0,7,9,10,11,9,9,10,11,9,11,12,12,12,11
altare_della_patria13.jpg,7,0,8,11,8,8,14,11,8,10,12,13,11,7,10
altare_della_patria0.jpg,9,8,0,9,12,12,12,11,6,10,10,11,11,13,12
altare_della_patria6.jpg,10,11,9,0,11,11,11,12,7,11,9,10,8,10,9
altare_della_patria9.jpg,11,8,12,11,0,14,14,11,10,10,10,9,9,7,10
altare_della_patria4.jpg,9,8,12,11,14,0,12,9,12,10,10,11,11,11,10
altare_della_patria1.jpg,9,14,12,11,14,12,0,9,12,14,12,11,11,11,10
altare_della_patria8.jpg,10,11,11,12,11,9,9,0,9,11,7,10,10,12,7
altare_della_patria5.jpg,11,8,6,7,10,12,12,9,0,12,8,9,9,9,10
altare_della_patria12.jpg,9,10,10,11,10,10,14,11,12,0,8,9,11,13,10
altare_della_patria10.jpg,11,12,10,9,10,10,12,7,8,8,0,7,9,11,10
altare_della_patria2.jpg,12,13,11,10,9,11,11,10,9,9,7,0,4,8,5
altare_della_patria14.jpg,12,11,11,8,9,11,11,10,9,11,9,4,0,6,5
altare_della_patria11.jpg,12,7,13,10,7,11,11,12,9,13,11,8,6,0,7
altare_della_patria3.jpg,11,10,12,9,10,10,10,7,10,10,10,5,5,7,0
