,obelisco_wash_dc2.jpg,obelisco_wash_dc11.jpg,obelisco_wash_dc9.jpg,obelisco_wash_dc5.jpg,obelisco_wash_dc14.jpg,obelisco_wash_dc13.jpg,obelisco_wash_dc3.jpg,obelisco_wash_dc8.jpg,obelisco_wash_dc6.jpg,obelisco_wash_dc4.jpg,obelisco_wash_dc1.jpg,obelisco_wash_dc12.jpg,obelisco_wash_dc0.jpg,obelisco_wash_dc10.jpg,obelisco_wash_dc7.jpg
Type,Meta,Meta,Meta,Meta,Meta,Meta,Meta,Meta,Meta,Meta,Meta,Meta,Meta,Meta,Meta
obelisco_wash_dc2.jpg,0,4,3,4,3,3,4,3,4,4,4,4,5,6,2
obelisco_wash_dc11.jpg,4,0,4,2,5,2,4,5,3,4,2,2,4,3,5
obelisco_wash_dc9.jpg,3,4,0,3,3,3,3,3,4,3,3,3,4,6,4
obelisco_wash_dc5.jpg,4,2,3,0,4,3,3,4,4,3,1,1,3,4,5
obelisco_wash_dc14.jpg,3,5,3,4,0,4,3,1,4,3,4,4,4,5,2
obelisco_wash_dc13.jpg,3,2,3,3,4,0,2,4,2,3,3,3,3,3,3
obelisco_wash_dc3.jpg,4,4,3,3,3,2,0,2,2,2,3,3,2,4,3
obelisco_wash_dc8.jpg,3,5,3,4,1,4,2,0,3,3,4,4,4,6,3
obelisco_wash_dc6.jpg,4,3,4,4,4,2,2,3,0,3,4,4,4,4,4
obelisco_wash_dc4.jpg,4,4,3,3,3,3,2,3,3,0,3,3,2,5,4
obelisco_wash_dc1.jpg,4,2,3,1,4,3,3,4,4,3,0,0,3,4,5
obelisco_wash_dc12.jpg,4,2,3,1,4,3,3,4,4,3,0,0,3,4,5
obelisco_wash_dc0.jpg,5,4,4,3,4,3,2,4,4,2,3,3,0,4,4
obelisco_wash_dc10.jpg,6,3,6,4,5,3,4,6,4,5,4,4,4,0,4
obelisco_wash_dc7.jpg,2,5,4,5,2,3,3,3,4,4,5,5,4,4,0
Type,R-Meta,R-Meta,R-Meta,R-Meta,R-Meta,R-Meta,R-Meta,R-Meta,R-Meta,R-Meta,R-Meta,R-Meta,R-Meta,R-Meta,R-Meta
obelisco_wash_dc2.jpg,0,1,1,1,1,1,1,1,1,1,1,1,1,1,1
obelisco_wash_dc11.jpg,1,0,0,0,0,0,0,0,0,0,0,0,0,0,0
obelisco_wash_dc9.jpg,1,0,0,0,0,0,0,0,0,0,0,0,0,0,0
obelisco_wash_dc5.jpg,1,0,0,0,0,0,0,0,0,0,0,0,0,0,0
obelisco_wash_dc14.jpg,1,0,0,0,0,0,0,0,0,0,0,0,0,0,0
obelisco_wash_dc13.jpg,1,0,0,0,0,0,0,0,0,0,0,0,0,0,0
obelisco_wash_dc3.jpg,1,0,0,0,0,0,0,0,0,0,0,0,0,0,0
obelisco_wash_dc8.jpg,1,0,0,0,0,0,0,0,0,0,0,0,0,0,0
obelisco_wash_dc6.jpg,1,0,0,0,0,0,0,0,0,0,0,0,0,0,0
obelisco_wash_dc4.jpg,1,0,0,0,0,0,0,0,0,0,0,0,0,0,0
obelisco_wash_dc1.jpg,1,0,0,0,0,0,0,0,0,0,0,0,0,0,0
obelisco_wash_dc12.jpg,1,0,0,0,0,0,0,0,0,0,0,0,0,0,0
obelisco_wash_dc0.jpg,1,0,0,0,0,0,0,0,0,0,0,0,0,0,0
obelisco_wash_dc10.jpg,1,0,0,0,0,0,0,0,0,0,0,0,0,0,0
obelisco_wash_dc7.jpg,1,0,0,0,0,0,0,0,0,0,0,0,0,0,0
Type,Content,Content,Content,Content,Content,Content,Content,Content,Content,Content,Content,Content,Content,Content,Content
obelisco_wash_dc2.jpg,0,13,13,13,11,13,12,13,11,13,13,13,12,11,12
obelisco_wash_dc11.jpg,13,0,12,13,13,11,12,13,13,11,13,13,13,13,12
obelisco_wash_dc9.jpg,13,12,0,13,13,13,13,13,13,12,13,13,13,11,13
obelisco_wash_dc5.jpg,13,13,13,0,13,13,13,12,13,13,13,13,13,13,13
obelisco_wash_dc14.jpg,11,13,13,13,0,13,12,13,12,13,12,12,12,12,13
obelisco_wash_dc13.jpg,13,11,13,13,13,0,13,12,13,13,12,12,13,12,10
obelisco_wash_dc3.jpg,12,12,13,13,12,13,0,12,12,12,12,13,13,11,13
obelisco_wash_dc8.jpg,13,13,13,12,13,12,12,0,13,12,12,13,13,13,13
obelisco_wash_dc6.jpg,11,13,13,13,12,13,12,13,0,12,13,13,13,10,12
obelisco_wash_dc4.jpg,13,11,12,13,13,13,12,12,12,0,11,13,13,13,13
obelisco_wash_dc1.jpg,13,13,13,13,12,12,12,12,13,11,0,11,13,13,12
obelisco_wash_dc12.jpg,13,13,13,13,12,12,13,13,13,13,11,0,13,13,12
obelisco_wash_dc0.jpg,12,13,13,13,12,13,13,13,13,13,13,13,0,13,13
obelisco_wash_dc10.jpg,11,13,11,13,12,12,11,13,10,13,13,13,13,0,13
obelisco_wash_dc7.jpg,12,12,13,13,13,10,13,13,12,13,12,12,13,13,0
Type,R-Content,R-Content,R-Content,R-Content,R-Content,R-Content,R-Content,R-Content,R-Content,R-Content,R-Content,R-Content,R-Content,R-Content,R-Content
obelisco_wash_dc2.jpg,0,3,4,3,6,4,4,4,1,5,6,3,3,2,2
obelisco_wash_dc11.jpg,3,0,3,2,5,3,3,5,4,4,3,2,2,3,3
obelisco_wash_dc9.jpg,4,3,0,5,4,4,6,4,3,5,2,5,3,2,2
obelisco_wash_dc5.jpg,3,2,5,0,3,1,1,5,4,2,5,2,2,3,3
obelisco_wash_dc14.jpg,6,5,4,3,0,2,2,4,5,1,2,3,3,4,4
obelisco_wash_dc13.jpg,4,3,4,1,2,0,2,4,3,1,4,3,1,2,4
obelisco_wash_dc3.jpg,4,3,6,1,2,2,0,4,5,1,4,1,3,4,4
obelisco_wash_dc8.jpg,4,5,4,5,4,4,4,0,3,3,4,5,5,4,6
obelisco_wash_dc6.jpg,1,4,3,4,5,3,5,3,0,4,5,4,2,1,3
obelisco_wash_dc4.jpg,5,4,5,2,1,1,1,3,4,0,3,2,2,3,5
obelisco_wash_dc1.jpg,6,3,2,5,2,4,4,4,5,3,0,3,3,4,4
obelisco_wash_dc12.jpg,3,2,5,2,3,3,1,5,4,2,3,0,2,3,3
obelisco_wash_dc0.jpg,3,2,3,2,3,1,3,5,2,2,3,2,0,1,3
obelisco_wash_dc10.jpg,2,3,2,3,4,2,4,4,1,3,4,3,1,0,2
obelisco_wash_dc7.jpg,2,3,2,3,4,4,4,6,3,5,4,3,3,2,0
Type,Final-R,Final-R,Final-R,Final-R,Final-R,Final-R,Final-R,Final-R,Final-R,Final-R,Final-R,Final-R,Final-R,Final-R,Final-R
obelisco_wash_dc2.jpg,0,3,4,3,6,4,4,4,1,5,6,3,3,2,2
obelisco_wash_dc11.jpg,3,0,3,2,5,3,3,5,4,4,3,2,2,3,3
obelisco_wash_dc9.jpg,4,3,0,5,4,4,6,4,3,5,2,5,3,2,2
obelisco_wash_dc5.jpg,3,2,5,0,3,1,1,5,4,2,5,2,2,3,3
obelisco_wash_dc14.jpg,6,5,4,3,0,2,2,4,5,1,2,3,3,4,4
obelisco_wash_dc13.jpg,4,3,4,1,2,0,2,4,3,1,4,3,1,2,4
obelisco_wash_dc3.jpg,4,3,6,1,2,2,0,4,5,1,4,1,3,4,4
obelisco_wash_dc8.jpg,4,5,4,5,4,4,4,0,3,3,4,5,5,4,6
obelisco_wash_dc6.jpg,1,4,3,4,5,3,5,3,0,4,5,4,2,1,3
obelisco_wash_dc4.jpg,5,4,5,2,1,1,1,3,4,0,3,2,2,3,5
obelisco_wash_dc1.jpg,6,3,2,5,2,4,4,4,5,3,0,3,3,4,4
obelisco_wash_dc12.jpg,3,2,5,2,3,3,1,5,4,2,3,0,2,3,3
obelisco_wash_dc0.jpg,3,2,3,2,3,1,3,5,2,2,3,2,0,1,3
obelisco_wash_dc10.jpg,2,3,2,3,4,2,4,4,1,3,4,3,1,0,2
obelisco_wash_dc7.jpg,2,3,2,3,4,4,4,6,3,5,4,3,3,2,0
