,basilica_san_marco8.jpg,basilica_san_marco4.jpg,basilica_san_marco1.jpg,basilica_san_marco6.jpg,basilica_san_marco14.jpg,basilica_san_marco7.jpg,basilica_san_marco2.jpg,basilica_san_marco10.jpg,basilica_san_marco11.jpg,basilica_san_marco0.jpg,basilica_san_marco3.jpg,basilica_san_marco13.jpg,basilica_san_marco12.jpg,basilica_san_marco9.jpg,basilica_san_marco5.jpg
Type,Meta,Meta,Meta,Meta,Meta,Meta,Meta,Meta,Meta,Meta,Meta,Meta,Meta,Meta,Meta
basilica_san_marco8.jpg,0,5,2,6,5,4,6,5,5,4,5,5,6,5,4
basilica_san_marco4.jpg,5,0,3,1,3,4,3,4,3,3,2,2,4,6,3
basilica_san_marco1.jpg,2,3,0,4,4,4,4,4,3,2,3,3,5,5,3
basilica_san_marco6.jpg,6,1,4,0,4,3,2,3,3,4,3,3,3,5,4
basilica_san_marco14.jpg,5,3,4,4,0,4,4,5,4,3,2,3,5,7,3
basilica_san_marco7.jpg,4,4,4,3,4,0,3,4,4,5,4,4,4,6,4
basilica_san_marco2.jpg,6,3,4,2,4,3,0,4,3,4,3,3,3,5,4
basilica_san_marco10.jpg,5,4,4,3,5,4,4,0,4,4,5,4,5,5,5
basilica_san_marco11.jpg,5,3,3,3,4,4,3,4,0,4,3,2,4,6,3
basilica_san_marco0.jpg,4,3,2,4,3,5,4,4,4,0,3,3,5,5,3
basilica_san_marco3.jpg,5,2,3,3,2,4,3,5,3,3,0,1,4,6,3
basilica_san_marco13.jpg,5,2,3,3,3,4,3,4,2,3,1,0,4,6,3
basilica_san_marco12.jpg,6,4,5,3,5,4,3,5,4,5,4,4,0,5,5
basilica_san_marco9.jpg,5,6,5,5,7,6,5,5,6,5,6,6,5,0,7
basilica_san_marco5.jpg,4,3,3,4,3,4,4,5,3,3,3,3,5,7,0
Type,R-Meta,R-Meta,R-Meta,R-Meta,R-Meta,R-Meta,R-Meta,R-Meta,R-Meta,R-Meta,R-Meta,R-Meta,R-Meta,R-Meta,R-Meta
basilica_san_marco8.jpg,0,4,0,4,4,3,5,3,3,1,5,5,4,4,2
basilica_san_marco4.jpg,4,0,4,0,2,1,3,3,3,5,3,3,4,6,2
basilica_san_marco1.jpg,0,4,0,4,4,3,5,3,3,1,5,5,4,4,2
basilica_san_marco6.jpg,4,0,4,0,2,1,3,3,3,5,3,3,4,6,2
basilica_san_marco14.jpg,4,2,4,2,0,1,3,5,3,3,1,3,4,6,2
basilica_san_marco7.jpg,3,1,3,1,1,0,2,4,2,4,2,2,3,5,1
basilica_san_marco2.jpg,5,3,5,3,3,2,0,6,4,6,4,4,5,7,3
basilica_san_marco10.jpg,3,3,3,3,5,4,6,0,4,4,6,4,7,5,5
basilica_san_marco11.jpg,3,3,3,3,3,2,4,4,0,4,4,2,3,7,1
basilica_san_marco0.jpg,1,5,1,5,3,4,6,4,4,0,4,6,5,5,3
basilica_san_marco3.jpg,5,3,5,3,1,2,4,6,4,4,0,2,5,5,3
basilica_san_marco13.jpg,5,3,5,3,3,2,4,4,2,6,2,0,5,5,3
basilica_san_marco12.jpg,4,4,4,4,4,3,5,7,3,5,5,5,0,6,2
basilica_san_marco9.jpg,4,6,4,6,6,5,7,5,7,5,5,5,6,0,6
basilica_san_marco5.jpg,2,2,2,2,2,1,3,5,1,3,3,3,2,6,0
Type,Content,Content,Content,Content,Content,Content,Content,Content,Content,Content,Content,Content,Content,Content,Content
basilica_san_marco8.jpg,0,12,13,13,11,13,13,12,13,12,10,12,12,12,13
basilica_san_marco4.jpg,12,0,13,11,13,13,13,12,12,13,13,13,13,13,13
basilica_san_marco1.jpg,13,13,0,13,12,13,13,12,13,8,12,13,11,13,13
basilica_san_marco6.jpg,13,11,13,0,12,12,12,12,12,13,12,13,13,13,13
basilica_san_marco14.jpg,11,13,12,12,0,12,13,9,13,12,13,13,12,11,13
basilica_san_marco7.jpg,13,13,13,12,12,0,9,13,12,13,13,12,13,13,12
basilica_san_marco2.jpg,13,13,13,12,13,9,0,13,13,13,12,13,13,13,13
basilica_san_marco10.jpg,12,12,12,12,9,13,13,0,13,13,12,13,13,12,13
basilica_san_marco11.jpg,13,12,13,12,13,12,13,13,0,12,13,12,13,13,12
basilica_san_marco0.jpg,12,13,8,13,12,13,13,13,12,0,13,13,11,13,11
basilica_san_marco3.jpg,10,13,12,12,13,13,12,12,13,13,0,13,12,13,13
basilica_san_marco13.jpg,12,13,13,13,13,12,13,13,12,13,13,0,12,13,13
basilica_san_marco12.jpg,12,13,11,13,12,13,13,13,13,11,12,12,0,12,13
basilica_san_marco9.jpg,12,13,13,13,11,13,13,12,13,13,13,13,12,0,13
basilica_san_marco5.jpg,13,13,13,13,13,12,13,13,12,11,13,13,13,13,0
Type,R-Content,R-Content,R-Content,R-Content,R-Content,R-Content,R-Content,R-Content,R-Content,R-Content,R-Content,R-Content,R-Content,R-Content,R-Content
basilica_san_marco8.jpg,0,12,11,12,12,9,9,11,13,10,8,9,10,9,10
basilica_san_marco4.jpg,12,0,11,8,12,9,9,11,7,12,12,13,10,11,8
basilica_san_marco1.jpg,11,11,0,11,9,8,8,10,14,7,13,10,11,8,11
basilica_san_marco6.jpg,12,8,11,0,8,9,7,9,9,10,8,9,6,9,10
basilica_san_marco14.jpg,12,12,9,8,0,9,11,5,13,8,8,11,8,9,10
basilica_san_marco7.jpg,9,9,8,9,9,0,6,12,12,7,9,12,7,14,7
basilica_san_marco2.jpg,9,9,8,7,11,6,0,12,12,9,11,12,11,10,13
basilica_san_marco10.jpg,11,11,10,9,5,12,12,0,12,9,7,10,9,8,11
basilica_san_marco11.jpg,13,7,14,9,13,12,12,12,0,11,13,12,11,12,9
basilica_san_marco0.jpg,10,12,7,10,8,7,9,9,11,0,10,9,8,13,8
basilica_san_marco3.jpg,8,12,13,8,8,9,11,7,13,10,0,9,8,11,10
basilica_san_marco13.jpg,9,13,10,9,11,12,12,10,12,9,9,0,11,10,13
basilica_san_marco12.jpg,10,10,11,6,8,7,11,9,11,8,8,11,0,11,4
basilica_san_marco9.jpg,9,11,8,9,9,14,10,8,12,13,11,10,11,0,13
basilica_san_marco5.jpg,10,8,11,10,10,7,13,11,9,8,10,13,4,13,0
Type,Final-R,Final-R,Final-R,Final-R,Final-R,Final-R,Final-R,Final-R,Final-R,Final-R,Final-R,Final-R,Final-R,Final-R,Final-R
basilica_san_marco8.jpg,0,12,11,12,12,9,9,11,13,10,8,9,10,9,10
basilica_san_marco4.jpg,12,0,11,8,12,9,9,11,7,12,12,13,10,11,8
basilica_san_marco1.jpg,11,11,0,11,9,8,8,10,14,7,13,10,11,8,11
basilica_san_marco6.jpg,12,8,11,0,8,9,7,9,9,10,8,9,6,9,10
basilica_san_marco14.jpg,12,12,9,8,0,9,11,5,13,8,8,11,8,9,10
basilica_san_marco7.jpg,9,9,8,9,9,0,6,12,12,7,9,12,7,14,7
basilica_san_marco2.jpg,9,9,8,7,11,6,0,12,12,9,11,12,11,10,13
basilica_san_marco10.jpg,11,11,10,9,5,12,12,0,12,9,7,10,9,8,11
basilica_san_marco11.jpg,13,7,14,9,13,12,12,12,0,11,13,12,11,12,9
basilica_san_marco0.jpg,10,12,7,10,8,7,9,9,11,0,10,9,8,13,8
basilica_san_marco3.jpg,8,12,13,8,8,9,11,7,13,10,0,9,8,11,10
basilica_san_marco13.jpg,9,13,10,9,11,12,12,10,12,9,9,0,11,10,13
basilica_san_marco12.jpg,10,10,11,6,8,7,11,9,11,8,8,11,0,11,4
basilica_san_marco9.jpg,9,11,8,9,9,14,10,8,12,13,11,10,11,0,13
basilica_san_marco5.jpg,10,8,11,10,10,7,13,11,9,8,10,13,4,13,0
