Img-Name,SHA256,Final-R
san_luca11.jpg,b1f128e5f3fb1b476a73bd58291761dcd1d34095efc9eb89a0b46b4844e32e75,"[0, 0, 0, 0, 0, 1, 0, 1, 1, 1, 0, 0, 0, 0, 0, 0, 0, 0, 0, 0, 0, 1, 0, 0, 1, 0, 0, 0, 1, 0, 0, 0]"
san_luca14.jpg,ee3f8d42f4d7bcada1a107562cdd2e4f2aabcef6b3a859117576e7a4a366e5c1,"[0, 1, 1, 0, 1, 0, 0, 0, 0, 0, 0, 0, 0, 1, 0, 1, 0, 1, 0, 0, 0, 0, 1, 0, 0, 0, 0, 0, 0, 0, 0, 0]"
san_luca2.jpg,11b5cbe51d6869d4f161ba802bb25d83443666be71e7a322066a2c6f2447370a,"[1, 0, 1, 1, 0, 1, 0, 0, 0, 0, 1, 0, 0, 0, 0, 1, 0, 0, 0, 0, 1, 0, 0, 0, 0, 0, 0, 0, 0, 0, 1, 0]"
san_luca1.jpg,273ba5cd0bbea5713f947d5f02aa4d00d81eeaa7150842393db91a17900e4b9b,"[1, 0, 0, 0, 0, 0, 0, 1, 0, 0, 0, 0, 0, 1, 0, 0, 0, 1, 0, 0, 0, 0, 0, 1, 0, 1, 0, 1, 0, 0, 0, 1]"
san_luca12.jpg,59d1e621732c5b46e987d6540ac4a3543d51d57a80a8d4a01eb291a4fe6db46f,"[1, 1, 0, 0, 1, 0, 1, 0, 0, 0, 0, 0, 0, 0, 0, 1, 0, 0, 0, 0, 1, 0, 0, 0, 0, 0, 1, 0, 0, 0, 0, 0]"
san_luca3.jpg,0cd788df6d1ccdec43419b90c47bf3d292993aa0b87a17727c2253456a0e6263,"[1, 0, 0, 1, 0, 1, 0, 0, 0, 0, 0, 0, 1, 0, 0, 0, 1, 0, 1, 0, 0, 0, 0, 0, 0, 0, 0, 0, 0, 0, 0, 1]"
san_luca5.jpg,dc378c555d974d83da5c3bf8be761711eeb94ff47b2b9f21ab298aead5a6a704,"[0, 1, 0, 1, 1, 0, 0, 0, 0, 0, 1, 0, 0, 0, 0, 0, 0, 1, 0, 0, 1, 1, 0, 0, 1, 0, 0, 0, 0, 0, 0, 0]"
san_luca13.jpg,726b4b12a56d2c15c37fbe6d70a429eaa57739771eacfa89409c232d1e4b1798,"[0, 0, 0, 0, 0, 0, 0, 0, 0, 1, 1, 0, 0, 1, 0, 0, 0, 0, 1, 0, 0, 1, 0, 1, 1, 0, 0, 0, 0, 0, 0, 0]"
san_luca0.jpg,e2da4d0044d828ef9b030f17c968ec76513c1231f0aad7d8b6c6c6a9060ae002,"[1, 0, 1, 0, 0, 0, 0, 0, 0, 1, 0, 0, 0, 0, 0, 1, 0, 1, 0, 0, 0, 0, 1, 1, 1, 0, 0, 0, 0, 0, 0, 0]"
san_luca8.jpg,a3fe4b23dfa85feab5dc3f74795c7d7acaf163d8fe64dc28f8b1ae5f0719b515,"[0, 0, 0, 1, 0, 0, 0, 0, 1, 0, 1, 0, 0, 0, 0, 0, 0, 0, 0, 0, 1, 1, 0, 0, 1, 0, 1, 0, 0, 0, 0, 1]"
san_luca10.jpg,fc491d094af5139cae733d4771e94174cd8bb84ebb9cbb1b2557964910ef7bea,"[0, 0, 0, 0, 0, 0, 0, 1, 0, 1, 1, 0, 0, 0, 1, 0, 0, 0, 0, 0, 1, 0, 0, 0, 0, 0, 0, 1, 1, 0, 0, 0]"
san_luca9.jpg,629c1162603ad8ff1c587e0a9d88df16afc930698bcdb5bf3877c99c9fcc35ad,"[0, 0, 1, 0, 0, 0, 0, 0, 0, 1, 1, 0, 0, 1, 0, 0, 0, 0, 0, 0, 0, 0, 1, 0, 0, 0, 0, 0, 1, 0, 0, 1]"
san_luca7.jpg,55f8450ee053ba9e23eb7792f56324a5d94ae28c55f060ea2ae8b0b9d87d964d,"[0, 0, 0, 0, 0, 1, 0, 0, 0, 0, 1, 0, 1, 1, 1, 0, 0, 0, 1, 0, 0, 0, 0, 0, 0, 1, 0, 0, 0, 0, 1, 0]"
san_luca6.jpg,b938596b581b344199ddb54b25ac7a828c5e87a582e3761245d38b0c1ade0669,"[0, 1, 1, 0, 0, 1, 0, 0, 0, 1, 0, 1, 1, 0, 0, 0, 0, 0, 1, 0, 0, 0, 0, 0, 0, 0, 0, 0, 0, 0, 0, 0]"
san_luca4.jpg,bb7cb64b78bf30870e4feeb4e43a219e7f2b4e210e2e324aa353f96f9ac3bb5e,"[0, 1, 0, 0, 0, 0, 0, 1, 0, 0, 1, 1, 0, 0, 0, 1, 0, 0, 0, 0, 1, 0, 0, 0, 0, 0, 0, 0, 0, 0, 1, 0]"
