Img-Name,Meta,R-Meta,Content,R-Content,Final-R
il_bacio8.jpg,AAA777QU4YZDHO7H,"[1, 0, 0, 0, 1, 1, 0, 1]",EEAZVSTOE7CGNJLJ,"[0, 0, 1, 0, 0, 0, 0, 1]","[1, 0, 1, 0, 1, 1, 0, 1]"
il_bacio0.jpg,AAA567Q54QZDHO7H,"[1, 0, 0, 0, 1, 1, 0, 0]",EEA5UD3FGZTGMBXK,"[0, 0, 0, 1, 0, 1, 1, 1]","[1, 0, 0, 1, 1, 1, 1, 1]"
il_bacio9.jpg,AAAY77Q5MQZDHO7H,"[1, 1, 0, 0, 1, 1, 0, 0]",EEAZMQTLM5TWMRGH,"[1, 0, 1, 0, 1, 0, 0, 1]","[1, 1, 1, 0, 1, 1, 0, 1]"
il_bacio12.jpg,AAAY72Q5MUZDHO7H,"[1, 1, 0, 0, 1, 1, 0, 0]",EEA5M2TLU5TKIGIZ,"[0, 0, 1, 1, 1, 1, 0, 0]","[1, 1, 1, 1, 1, 1, 0, 0]"
il_bacio5.jpg,AAA467U54YZDHO7H,"[1, 0, 0, 0, 1, 1, 0, 0]",EEA4PZZE2IZSPUSM,"[0, 0, 0, 1, 1, 1, 0, 0]","[1, 0, 0, 1, 1, 1, 0, 0]"
il_bacio13.jpg,AAA4H3RVMYZDHO7H,"[1, 0, 0, 0, 1, 0, 1, 0]",EEA6U3LEGZTKMPCJ,"[0, 0, 1, 1, 0, 1, 1, 0]","[1, 0, 1, 1, 1, 1, 1, 0]"
il_bacio4.jpg,AAA677A5M4ZDHO7H,"[1, 0, 0, 0, 1, 1, 1, 0]",EEA54SLEEZTKMZT2,"[0, 0, 1, 1, 0, 1, 0, 0]","[1, 0, 1, 1, 1, 1, 1, 0]"
il_bacio6.jpg,AAA5W6Q5MUZDHO7H,"[1, 0, 0, 0, 1, 1, 0, 0]",EEA5FZDECZTGNFT3,"[0, 0, 0, 1, 0, 1, 0, 1]","[1, 0, 0, 1, 1, 1, 0, 1]"
il_bacio3.jpg,AAA477QV4YZDHO7H,"[1, 0, 0, 0, 1, 0, 1, 0]",EEA5V33FAZTGMBUO,"[0, 0, 0, 0, 0, 1, 1, 1]","[1, 0, 0, 0, 1, 1, 1, 1]"
il_bacio1.jpg,AAA576UVM4ZDHO7H,"[1, 0, 0, 0, 1, 1, 1, 0]",EEA3U33MEZRGMJSO,"[0, 0, 0, 1, 0, 1, 0, 1]","[1, 0, 0, 1, 1, 1, 1, 1]"
il_bacio11.jpg,AAA4P6U5MQZDHO7H,"[1, 0, 0, 0, 1, 1, 0, 0]",EEAZISTLEVT6IWPK,"[0, 0, 1, 1, 1, 0, 1, 0]","[1, 0, 1, 1, 1, 1, 1, 0]"
il_bacio10.jpg,AAA476RVNQZDHO7H,"[1, 0, 0, 0, 1, 0, 1, 0]",EEA4GC34GZTGMDD5,"[0, 0, 0, 0, 1, 1, 0, 1]","[1, 0, 0, 0, 1, 1, 1, 1]"
il_bacio2.jpg,AAA572V544ZDHO7H,"[1, 0, 0, 0, 1, 1, 0, 0]",EEA5VZ3FEZTCOBWG,"[0, 0, 0, 1, 0, 1, 1, 1]","[1, 0, 0, 1, 1, 1, 1, 1]"
il_bacio14.jpg,AAA5P7QV4UZDHO7H,"[1, 0, 0, 0, 1, 1, 1, 0]",EEAYVQXEG6DWZHKZ,"[0, 1, 1, 0, 0, 1, 0, 1]","[1, 1, 1, 0, 1, 1, 1, 1]"
il_bacio7.jpg,AAA567QV4YZDHO7H,"[1, 0, 0, 0, 1, 1, 1, 0]",EEA5FC3MC3TGNBTO,"[0, 0, 0, 0, 0, 1, 0, 1]","[1, 0, 0, 0, 1, 1, 1, 1]"
