,due_torri1.jpg,due_torri14.jpg,due_torri5.jpg,due_torri2.jpg,due_torri12.jpg,due_torri4.jpg,due_torri0.jpg,due_torri9.jpg,due_torri7.jpg,due_torri11.jpg,due_torri6.jpg,due_torri10.jpg,due_torri13.jpg,due_torri3.jpg,due_torri8.jpg
Type,SHA256,SHA256,SHA256,SHA256,SHA256,SHA256,SHA256,SHA256,SHA256,SHA256,SHA256,SHA256,SHA256,SHA256,SHA256
due_torri1.jpg,0,63,59,59,62,61,63,62,62,57,60,59,60,61,60
due_torri14.jpg,63,0,62,61,62,60,58,62,58,57,59,61,61,61,61
due_torri5.jpg,59,62,0,60,62,61,59,60,60,58,61,61,59,58,62
due_torri2.jpg,59,61,60,0,58,59,57,59,62,60,58,60,60,57,62
due_torri12.jpg,62,62,62,58,0,58,61,56,62,61,62,56,62,61,59
due_torri4.jpg,61,60,61,59,58,0,60,62,61,63,59,63,57,60,55
due_torri0.jpg,63,58,59,57,61,60,0,57,63,60,61,60,60,61,62
due_torri9.jpg,62,62,60,59,56,62,57,0,61,61,63,62,62,60,58
due_torri7.jpg,62,58,60,62,62,61,63,61,0,57,56,61,61,60,62
due_torri11.jpg,57,57,58,60,61,63,60,61,57,0,59,62,62,60,61
due_torri6.jpg,60,59,61,58,62,59,61,63,56,59,0,58,61,55,61
due_torri10.jpg,59,61,61,60,56,63,60,62,61,62,58,0,52,60,62
due_torri13.jpg,60,61,59,60,62,57,60,62,61,62,61,52,0,60,56
due_torri3.jpg,61,61,58,57,61,60,61,60,60,60,55,60,60,0,59
due_torri8.jpg,60,61,62,62,59,55,62,58,62,61,61,62,56,59,0
Type,Final-R,Final-R,Final-R,Final-R,Final-R,Final-R,Final-R,Final-R,Final-R,Final-R,Final-R,Final-R,Final-R,Final-R,Final-R
due_torri1.jpg,0,8,13,13,16,14,12,16,14,14,12,16,15,9,14
due_torri14.jpg,8,0,13,15,16,14,14,16,16,14,14,14,15,15,14
due_torri5.jpg,13,13,0,10,13,15,13,15,15,13,15,13,14,12,15
due_torri2.jpg,13,15,10,0,15,13,11,13,13,13,13,13,10,10,13
due_torri12.jpg,16,16,13,15,0,14,10,16,14,14,14,12,13,13,14
due_torri4.jpg,14,14,15,13,14,0,12,12,16,14,14,12,11,15,12
due_torri0.jpg,12,14,13,11,10,12,0,14,8,14,14,12,11,11,14
due_torri9.jpg,16,16,15,13,16,12,14,0,16,10,12,12,13,15,14
due_torri7.jpg,14,16,15,13,14,16,8,16,0,16,16,16,11,9,16
due_torri11.jpg,14,14,13,13,14,14,14,10,16,0,14,10,15,15,14
due_torri6.jpg,12,14,15,13,14,14,14,12,16,14,0,16,13,13,16
due_torri10.jpg,16,14,13,13,12,12,12,12,16,10,16,0,15,15,8
due_torri13.jpg,15,15,14,10,13,11,11,13,11,15,13,15,0,14,15
due_torri3.jpg,9,15,12,10,13,15,11,15,9,15,13,15,14,0,15
due_torri8.jpg,14,14,15,13,14,12,14,14,16,14,16,8,15,15,0
