Img-Name,Meta,R-Meta,Content,R-Content,Final-R
reggia_caserta11.jpg,AAA3CVK4PBJTABDB,"[0, 0, 1, 1, 1, 0, 0, 0]",EEA5L64AJXRQXNAH,"[1, 1, 0, 0, 0, 1, 0, 0]","[1, 1, 0, 0, 0, 1, 0, 0]"
reggia_caserta2.jpg,AAA3C5257VJTABDB,"[0, 0, 1, 1, 1, 1, 0, 0]",EEAZTVHA6OHL2ZBC,"[0, 1, 1, 1, 1, 0, 0, 0]","[0, 1, 1, 1, 1, 0, 0, 0]"
reggia_caserta14.jpg,AAA3KXCU7RJTABDB,"[0, 0, 1, 1, 1, 1, 0, 0]",EEA45RFT2OQ45DFQ,"[0, 1, 0, 0, 1, 0, 0, 0]","[0, 1, 0, 0, 1, 0, 0, 0]"
reggia_caserta9.jpg,AAA3DVLVPBJTABDB,"[0, 0, 1, 1, 1, 0, 1, 0]",EEA4MGPG42I77KAB,"[0, 0, 1, 0, 1, 0, 0, 1]","[0, 0, 1, 0, 1, 0, 0, 1]"
reggia_caserta10.jpg,AAA3KVCXPRJTABDB,"[1, 0, 1, 1, 1, 0, 0, 0]",EEAZWWHV4KSBESXZ,"[0, 0, 1, 0, 0, 0, 1, 0]","[0, 0, 1, 0, 0, 0, 1, 0]"
reggia_caserta7.jpg,AAA3CVKV5RJTABDB,"[0, 0, 1, 1, 1, 0, 1, 0]",EEA5RJFTZUGHKQV5,"[1, 0, 0, 0, 1, 1, 0, 0]","[1, 0, 0, 0, 1, 1, 0, 0]"
reggia_caserta8.jpg,AAA3IXL45BJTABDB,"[0, 0, 1, 1, 1, 0, 0, 0]",EEAZTRPK46HJSYIS,"[0, 0, 1, 1, 0, 0, 0, 0]","[0, 0, 1, 1, 0, 0, 0, 0]"
reggia_caserta6.jpg,AAA3CVKVPVJTABDB,"[0, 0, 1, 1, 1, 0, 1, 0]",EEA4K66D2CQB46GV,"[0, 0, 1, 0, 1, 0, 1, 0]","[0, 0, 1, 0, 1, 0, 1, 0]"
reggia_caserta1.jpg,AAA3KVK4PBJTABDB,"[0, 0, 1, 1, 1, 0, 0, 0]",EEAY26UHLQQZ52IH,"[1, 1, 1, 0, 0, 0, 0, 0]","[1, 1, 1, 0, 0, 0, 0, 0]"
reggia_caserta0.jpg,AAA3KVK57RJTABDB,"[0, 0, 1, 1, 1, 1, 0, 0]",EEA4DYEKFQSJ746X,"[1, 0, 1, 1, 1, 0, 0, 0]","[1, 0, 1, 1, 1, 0, 0, 0]"
reggia_caserta5.jpg,AAA3C5KUPRJTABDB,"[0, 0, 1, 1, 1, 1, 0, 0]",EEAYT5GGTFZS4EFP,"[1, 1, 0, 1, 0, 0, 0, 1]","[1, 1, 0, 1, 0, 0, 0, 1]"
reggia_caserta3.jpg,AAA3K5JV7BJTABDB,"[0, 0, 1, 1, 1, 0, 1, 0]",EEAY35QMMQD7ZRS4,"[0, 1, 0, 0, 1, 1, 0, 1]","[0, 1, 0, 0, 1, 1, 0, 1]"
reggia_caserta12.jpg,AAA3KVCJPBJTABDB,"[0, 0, 1, 1, 1, 0, 0, 0]",EEA4LBFTZIXHUUMX,"[1, 0, 0, 0, 1, 0, 0, 0]","[1, 0, 0, 0, 1, 0, 0, 0]"
reggia_caserta13.jpg,AAA3CVAV7BJTABDB,"[0, 0, 1, 1, 1, 0, 1, 0]",EEA4DYU4U2OKHCXN,"[0, 0, 0, 1, 1, 0, 1, 0]","[0, 0, 0, 1, 1, 0, 1, 0]"
reggia_caserta4.jpg,AAA3KVC5PRJTABDB,"[0, 0, 1, 1, 1, 1, 0, 0]",EEAZWWHV4KSBESXZ,"[0, 0, 1, 0, 0, 0, 1, 0]","[0, 0, 1, 0, 0, 0, 1, 0]"
