,il_bacio8.jpg,il_bacio0.jpg,il_bacio9.jpg,il_bacio12.jpg,il_bacio5.jpg,il_bacio13.jpg,il_bacio4.jpg,il_bacio6.jpg,il_bacio3.jpg,il_bacio1.jpg,il_bacio11.jpg,il_bacio10.jpg,il_bacio2.jpg,il_bacio14.jpg,il_bacio7.jpg
Type,Meta,Meta,Meta,Meta,Meta,Meta,Meta,Meta,Meta,Meta,Meta,Meta,Meta,Meta,Meta
il_bacio8.jpg,0,4,4,5,4,6,5,6,2,6,7,6,5,4,3
il_bacio0.jpg,4,0,3,5,3,7,5,4,4,6,5,6,4,3,2
il_bacio9.jpg,4,3,0,2,5,6,3,4,4,5,4,5,5,5,5
il_bacio12.jpg,5,5,2,0,6,6,4,3,5,5,5,6,4,5,6
il_bacio5.jpg,4,3,5,6,0,5,5,6,3,6,4,6,5,5,3
il_bacio13.jpg,6,7,6,6,5,0,6,6,4,5,5,4,7,6,5
il_bacio4.jpg,5,5,3,4,5,6,0,5,5,4,5,6,4,6,6
il_bacio6.jpg,6,4,4,3,6,6,5,0,6,4,4,6,5,4,5
il_bacio3.jpg,2,4,4,5,3,4,5,6,0,5,6,4,5,3,2
il_bacio1.jpg,6,6,5,5,6,5,4,4,5,0,4,4,4,5,5
il_bacio11.jpg,7,5,4,5,4,5,5,4,6,4,0,4,6,6,7
il_bacio10.jpg,6,6,5,6,6,4,6,6,4,4,4,0,6,6,6
il_bacio2.jpg,5,4,5,4,5,7,4,5,5,4,6,6,0,5,5
il_bacio14.jpg,4,3,5,5,5,6,6,4,3,5,6,6,5,0,2
il_bacio7.jpg,3,2,5,6,3,5,6,5,2,5,7,6,5,2,0
Type,R-Meta,R-Meta,R-Meta,R-Meta,R-Meta,R-Meta,R-Meta,R-Meta,R-Meta,R-Meta,R-Meta,R-Meta,R-Meta,R-Meta,R-Meta
il_bacio8.jpg,0,4,3,3,3,5,5,4,3,7,7,7,6,3,3
il_bacio0.jpg,4,0,1,5,3,7,3,4,5,5,3,5,4,3,3
il_bacio9.jpg,3,1,0,4,2,6,4,5,4,6,4,6,5,4,2
il_bacio12.jpg,3,5,4,0,4,6,6,3,6,6,6,8,3,4,4
il_bacio5.jpg,3,3,2,4,0,4,2,5,2,4,4,6,3,4,2
il_bacio13.jpg,5,7,6,6,4,0,6,7,2,4,6,4,5,6,4
il_bacio4.jpg,5,3,4,6,2,6,0,3,4,2,2,4,3,4,4
il_bacio6.jpg,4,4,5,3,5,7,3,0,7,3,3,5,4,3,5
il_bacio3.jpg,3,5,4,6,2,2,4,7,0,4,6,4,5,4,2
il_bacio1.jpg,7,5,6,6,4,4,2,3,4,0,2,2,3,4,4
il_bacio11.jpg,7,3,4,6,4,6,2,3,6,2,0,2,3,6,6
il_bacio10.jpg,7,5,6,8,6,4,4,5,4,2,2,0,5,6,6
il_bacio2.jpg,6,4,5,3,3,5,3,4,5,3,3,5,0,5,5
il_bacio14.jpg,3,3,4,4,4,6,4,3,4,4,6,6,5,0,2
il_bacio7.jpg,3,3,2,4,2,4,4,5,2,4,6,6,5,2,0
Type,Content,Content,Content,Content,Content,Content,Content,Content,Content,Content,Content,Content,Content,Content,Content
il_bacio8.jpg,0,12,11,12,13,12,11,11,11,10,9,12,11,12,11
il_bacio0.jpg,12,0,11,11,13,8,9,9,5,8,11,7,7,12,8
il_bacio9.jpg,11,11,0,8,13,11,11,12,11,12,9,11,12,11,12
il_bacio12.jpg,12,11,8,0,13,11,10,11,11,13,9,12,11,12,11
il_bacio5.jpg,13,13,13,13,0,12,12,11,13,12,13,12,12,12,13
il_bacio13.jpg,12,8,11,11,12,0,7,10,9,9,12,9,11,11,12
il_bacio4.jpg,11,9,11,10,12,7,0,8,9,10,10,10,9,12,10
il_bacio6.jpg,11,9,12,11,11,10,8,0,9,11,12,10,9,12,6
il_bacio3.jpg,11,5,11,11,13,9,9,9,0,7,12,8,6,12,7
il_bacio1.jpg,10,8,12,13,12,9,10,11,7,0,12,9,10,13,9
il_bacio11.jpg,9,11,9,9,13,12,10,12,12,12,0,12,11,13,12
il_bacio10.jpg,12,7,11,12,12,9,10,10,8,9,12,0,10,12,9
il_bacio2.jpg,11,7,12,11,12,11,9,9,6,10,11,10,0,12,9
il_bacio14.jpg,12,12,11,12,12,11,12,12,12,13,13,12,12,0,13
il_bacio7.jpg,11,8,12,11,13,12,10,6,7,9,12,9,9,13,0
Type,R-Content,R-Content,R-Content,R-Content,R-Content,R-Content,R-Content,R-Content,R-Content,R-Content,R-Content,R-Content,R-Content,R-Content,R-Content
il_bacio8.jpg,0,9,11,8,8,8,7,7,7,4,9,8,8,10,9
il_bacio0.jpg,9,0,10,5,11,9,6,4,4,9,10,5,3,11,8
il_bacio9.jpg,11,10,0,7,11,11,8,8,10,11,8,9,9,5,12
il_bacio12.jpg,8,5,7,0,10,8,3,5,7,8,7,6,6,10,9
il_bacio5.jpg,8,11,11,10,0,10,7,9,11,8,9,8,10,10,11
il_bacio13.jpg,8,9,11,8,10,0,7,7,9,6,7,10,10,8,11
il_bacio4.jpg,7,6,8,3,7,7,0,6,8,9,6,7,7,9,10
il_bacio6.jpg,7,4,8,5,9,7,6,0,2,5,10,5,3,9,6
il_bacio3.jpg,7,4,10,7,11,9,8,2,0,5,12,7,3,11,4
il_bacio1.jpg,4,9,11,8,8,6,9,5,5,0,11,8,8,10,5
il_bacio11.jpg,9,10,8,7,9,7,6,10,12,11,0,11,11,7,14
il_bacio10.jpg,8,5,9,6,8,10,7,5,7,8,11,0,4,10,7
il_bacio2.jpg,8,3,9,6,10,10,7,3,3,8,11,4,0,10,5
il_bacio14.jpg,10,11,5,10,10,8,9,9,11,10,7,10,10,0,13
il_bacio7.jpg,9,8,12,9,11,11,10,6,4,5,14,7,5,13,0
Type,Final-R,Final-R,Final-R,Final-R,Final-R,Final-R,Final-R,Final-R,Final-R,Final-R,Final-R,Final-R,Final-R,Final-R,Final-R
il_bacio8.jpg,0,4,3,3,3,5,5,4,3,7,7,7,6,3,3
il_bacio0.jpg,4,0,1,5,3,7,3,4,5,5,3,5,4,3,3
il_bacio9.jpg,3,1,0,4,2,6,4,5,4,6,4,6,5,4,2
il_bacio12.jpg,3,5,4,0,4,6,6,3,6,6,6,8,3,4,4
il_bacio5.jpg,3,3,2,4,0,4,2,5,2,4,4,6,3,4,2
il_bacio13.jpg,5,7,6,6,4,0,6,7,2,4,6,4,5,6,4
il_bacio4.jpg,5,3,4,6,2,6,0,3,4,2,2,4,3,4,4
il_bacio6.jpg,4,4,5,3,5,7,3,0,7,3,3,5,4,3,5
il_bacio3.jpg,3,5,4,6,2,2,4,7,0,4,6,4,5,4,2
il_bacio1.jpg,7,5,6,6,4,4,2,3,4,0,2,2,3,4,4
il_bacio11.jpg,7,3,4,6,4,6,2,3,6,2,0,2,3,6,6
il_bacio10.jpg,7,5,6,8,6,4,4,5,4,2,2,0,5,6,6
il_bacio2.jpg,6,4,5,3,3,5,3,4,5,3,3,5,0,5,5
il_bacio14.jpg,3,3,4,4,4,6,4,3,4,4,6,6,5,0,2
il_bacio7.jpg,3,3,2,4,2,4,4,5,2,4,6,6,5,2,0
