,arco_trionfo1.jpg,arco_trionfo12.jpg,arco_trionfo9.jpg,arco_trionfo8.jpg,arco_trionfo11.jpg,arco_trionfo3.jpg,arco_trionfo6.jpg,arco_trionfo13.jpg,arco_trionfo4.jpg,arco_trionfo10.jpg,arco_trionfo5.jpg,arco_trionfo2.jpg,arco_trionfo7.jpg,arco_trionfo14.jpg,arco_trionfo0.jpg
Type,Meta,Meta,Meta,Meta,Meta,Meta,Meta,Meta,Meta,Meta,Meta,Meta,Meta,Meta,Meta
arco_trionfo1.jpg,0,4,5,5,4,5,7,5,4,3,5,7,5,5,6
arco_trionfo12.jpg,4,0,5,4,5,4,6,6,4,3,5,7,6,5,7
arco_trionfo9.jpg,5,5,0,6,4,6,5,6,4,4,5,6,6,5,5
arco_trionfo8.jpg,5,4,6,0,5,3,4,6,4,4,4,6,5,5,6
arco_trionfo11.jpg,4,5,4,5,0,5,5,5,4,4,4,7,5,4,6
arco_trionfo3.jpg,5,4,6,3,5,0,5,5,4,4,4,7,6,5,5
arco_trionfo6.jpg,7,6,5,4,5,5,0,6,5,6,4,6,6,5,5
arco_trionfo13.jpg,5,6,6,6,5,5,6,0,6,6,6,7,6,6,7
arco_trionfo4.jpg,4,4,4,4,4,4,5,6,0,3,3,6,5,3,5
arco_trionfo10.jpg,3,3,4,4,4,4,6,6,3,0,4,7,4,4,6
arco_trionfo5.jpg,5,5,5,4,4,4,4,6,3,4,0,5,4,3,4
arco_trionfo2.jpg,7,7,6,6,7,7,6,7,6,7,5,0,7,5,4
arco_trionfo7.jpg,5,6,6,5,5,6,6,6,5,4,4,7,0,5,6
arco_trionfo14.jpg,5,5,5,5,4,5,5,6,3,4,3,5,5,0,4
arco_trionfo0.jpg,6,7,5,6,6,5,5,7,5,6,4,4,6,4,0
Type,R-Meta,R-Meta,R-Meta,R-Meta,R-Meta,R-Meta,R-Meta,R-Meta,R-Meta,R-Meta,R-Meta,R-Meta,R-Meta,R-Meta,R-Meta
arco_trionfo1.jpg,0,3,7,3,3,3,5,4,3,2,5,7,4,5,6
arco_trionfo12.jpg,3,0,6,2,4,2,6,5,2,1,4,6,3,4,5
arco_trionfo9.jpg,7,6,0,4,4,4,2,5,4,5,2,2,5,4,3
arco_trionfo8.jpg,3,2,4,0,4,0,4,5,2,1,2,4,3,2,3
arco_trionfo11.jpg,3,4,4,4,0,4,2,3,4,3,4,4,5,4,5
arco_trionfo3.jpg,3,2,4,0,4,0,4,5,2,1,2,4,3,2,3
arco_trionfo6.jpg,5,6,2,4,2,4,0,5,6,5,4,2,7,4,3
arco_trionfo13.jpg,4,5,5,5,3,5,5,0,5,4,5,5,6,5,6
arco_trionfo4.jpg,3,2,4,2,4,2,6,5,0,1,2,6,1,4,5
arco_trionfo10.jpg,2,1,5,1,3,1,5,4,1,0,3,5,2,3,4
arco_trionfo5.jpg,5,4,2,2,4,2,4,5,2,3,0,4,3,2,3
arco_trionfo2.jpg,7,6,2,4,4,4,2,5,6,5,4,0,7,4,3
arco_trionfo7.jpg,4,3,5,3,5,3,7,6,1,2,3,7,0,5,6
arco_trionfo14.jpg,5,4,4,2,4,2,4,5,4,3,2,4,5,0,3
arco_trionfo0.jpg,6,5,3,3,5,3,3,6,5,4,3,3,6,3,0
Type,Content,Content,Content,Content,Content,Content,Content,Content,Content,Content,Content,Content,Content,Content,Content
arco_trionfo1.jpg,0,13,13,13,13,13,12,13,13,13,13,12,12,13,13
arco_trionfo12.jpg,13,0,13,12,13,13,13,13,13,13,13,11,12,13,13
arco_trionfo9.jpg,13,13,0,12,13,13,11,13,12,13,11,10,13,13,12
arco_trionfo8.jpg,13,12,12,0,13,13,13,13,12,12,13,12,12,13,9
arco_trionfo11.jpg,13,13,13,13,0,13,12,10,13,13,13,12,12,12,12
arco_trionfo3.jpg,13,13,13,13,13,0,12,13,12,12,13,13,12,12,12
arco_trionfo6.jpg,12,13,11,13,12,12,0,11,13,12,12,12,11,13,13
arco_trionfo13.jpg,13,13,13,13,10,13,11,0,13,13,13,12,12,12,13
arco_trionfo4.jpg,13,13,12,12,13,12,13,13,0,11,13,13,13,13,12
arco_trionfo10.jpg,13,13,13,12,13,12,12,13,11,0,13,13,13,13,13
arco_trionfo5.jpg,13,13,11,13,13,13,12,13,13,13,0,11,13,13,13
arco_trionfo2.jpg,12,11,10,12,12,13,12,12,13,13,11,0,12,13,12
arco_trionfo7.jpg,12,12,13,12,12,12,11,12,13,13,13,12,0,13,13
arco_trionfo14.jpg,13,13,13,13,12,12,13,12,13,13,13,13,13,0,11
arco_trionfo0.jpg,13,13,12,9,12,12,13,13,12,13,13,12,13,11,0
Type,R-Content,R-Content,R-Content,R-Content,R-Content,R-Content,R-Content,R-Content,R-Content,R-Content,R-Content,R-Content,R-Content,R-Content,R-Content
arco_trionfo1.jpg,0,9,14,9,11,11,14,14,12,10,13,11,9,10,8
arco_trionfo12.jpg,9,0,13,8,8,8,11,9,11,9,10,8,6,11,9
arco_trionfo9.jpg,14,13,0,11,13,9,6,10,8,8,7,11,11,12,10
arco_trionfo8.jpg,9,8,11,0,4,10,11,11,9,11,8,8,8,11,5
arco_trionfo11.jpg,11,8,13,4,0,8,9,7,9,13,10,8,6,11,5
arco_trionfo3.jpg,11,8,9,10,8,0,9,9,9,9,8,10,8,11,7
arco_trionfo6.jpg,14,11,6,11,9,9,0,10,10,10,7,11,7,10,10
arco_trionfo13.jpg,14,9,10,11,7,9,10,0,10,10,13,9,9,12,10
arco_trionfo4.jpg,12,11,8,9,9,9,10,10,0,12,9,5,9,8,4
arco_trionfo10.jpg,10,9,8,11,13,9,10,10,12,0,9,9,11,12,10
arco_trionfo5.jpg,13,10,7,8,10,8,7,13,9,9,0,8,8,13,9
arco_trionfo2.jpg,11,8,11,8,8,10,11,9,5,9,8,0,8,9,7
arco_trionfo7.jpg,9,6,11,8,6,8,7,9,9,11,8,8,0,7,7
arco_trionfo14.jpg,10,11,12,11,11,11,10,12,8,12,13,9,7,0,6
arco_trionfo0.jpg,8,9,10,5,5,7,10,10,4,10,9,7,7,6,0
Type,Final-R,Final-R,Final-R,Final-R,Final-R,Final-R,Final-R,Final-R,Final-R,Final-R,Final-R,Final-R,Final-R,Final-R,Final-R
arco_trionfo1.jpg,0,3,7,3,3,3,5,4,3,2,5,7,4,5,6
arco_trionfo12.jpg,3,0,6,2,4,2,6,5,2,1,4,6,3,4,5
arco_trionfo9.jpg,7,6,0,4,4,4,2,5,4,5,2,2,5,4,3
arco_trionfo8.jpg,3,2,4,0,4,0,4,5,2,1,2,4,3,2,3
arco_trionfo11.jpg,3,4,4,4,0,4,2,3,4,3,4,4,5,4,5
arco_trionfo3.jpg,3,2,4,0,4,0,4,5,2,1,2,4,3,2,3
arco_trionfo6.jpg,5,6,2,4,2,4,0,5,6,5,4,2,7,4,3
arco_trionfo13.jpg,4,5,5,5,3,5,5,0,5,4,5,5,6,5,6
arco_trionfo4.jpg,3,2,4,2,4,2,6,5,0,1,2,6,1,4,5
arco_trionfo10.jpg,2,1,5,1,3,1,5,4,1,0,3,5,2,3,4
arco_trionfo5.jpg,5,4,2,2,4,2,4,5,2,3,0,4,3,2,3
arco_trionfo2.jpg,7,6,2,4,4,4,2,5,6,5,4,0,7,4,3
arco_trionfo7.jpg,4,3,5,3,5,3,7,6,1,2,3,7,0,5,6
arco_trionfo14.jpg,5,4,4,2,4,2,4,5,4,3,2,4,5,0,3
arco_trionfo0.jpg,6,5,3,3,5,3,3,6,5,4,3,3,6,3,0
