,urlo_munch7.jpg,urlo_munch14.jpg,urlo_munch9.jpg,urlo_munch3.jpg,urlo_munch1.jpg,urlo_munch6.jpg,urlo_munch10.jpg,urlo_munch4.jpg,urlo_munch13.jpg,urlo_munch8.jpg,urlo_munch12.jpg,urlo_munch11.jpg,urlo_munch2.jpg,urlo_munch5.jpg,urlo_munch0.jpg
Type,SHA256,SHA256,SHA256,SHA256,SHA256,SHA256,SHA256,SHA256,SHA256,SHA256,SHA256,SHA256,SHA256,SHA256,SHA256
urlo_munch7.jpg,0,63,61,59,61,62,60,61,64,61,60,58,62,61,59
urlo_munch14.jpg,63,0,61,62,60,61,60,62,62,64,59,57,60,59,60
urlo_munch9.jpg,61,61,0,59,60,59,60,56,58,62,61,60,60,62,61
urlo_munch3.jpg,59,62,59,0,63,57,60,58,58,60,62,62,62,60,60
urlo_munch1.jpg,61,60,60,63,0,61,62,61,60,62,60,61,60,61,60
urlo_munch6.jpg,62,61,59,57,61,0,62,58,60,60,55,60,62,62,59
urlo_munch10.jpg,60,60,60,60,62,62,0,61,60,59,60,60,58,60,58
urlo_munch4.jpg,61,62,56,58,61,58,61,0,63,59,58,62,61,60,58
urlo_munch13.jpg,64,62,58,58,60,60,60,63,0,59,61,59,63,63,52
urlo_munch8.jpg,61,64,62,60,62,60,59,59,59,0,59,59,60,59,59
urlo_munch12.jpg,60,59,61,62,60,55,60,58,61,59,0,57,59,56,61
urlo_munch11.jpg,58,57,60,62,61,60,60,62,59,59,57,0,63,56,62
urlo_munch2.jpg,62,60,60,62,60,62,58,61,63,60,59,63,0,61,62
urlo_munch5.jpg,61,59,62,60,61,62,60,60,63,59,56,56,61,0,60
urlo_munch0.jpg,59,60,61,60,60,59,58,58,52,59,61,62,62,60,0
Type,Final-R,Final-R,Final-R,Final-R,Final-R,Final-R,Final-R,Final-R,Final-R,Final-R,Final-R,Final-R,Final-R,Final-R,Final-R
urlo_munch7.jpg,0,8,8,8,8,8,8,8,8,8,8,8,8,8,8
urlo_munch14.jpg,8,0,8,8,8,8,8,8,8,8,8,8,8,8,8
urlo_munch9.jpg,8,8,0,8,8,8,8,8,8,8,8,8,8,8,8
urlo_munch3.jpg,8,8,8,0,8,8,8,8,8,8,8,8,8,8,8
urlo_munch1.jpg,8,8,8,8,0,8,8,8,8,8,8,8,8,8,8
urlo_munch6.jpg,8,8,8,8,8,0,8,8,8,8,8,8,8,8,8
urlo_munch10.jpg,8,8,8,8,8,8,0,8,8,8,8,8,8,8,8
urlo_munch4.jpg,8,8,8,8,8,8,8,0,8,8,8,8,8,8,8
urlo_munch13.jpg,8,8,8,8,8,8,8,8,0,8,8,8,8,8,8
urlo_munch8.jpg,8,8,8,8,8,8,8,8,8,0,8,8,8,8,8
urlo_munch12.jpg,8,8,8,8,8,8,8,8,8,8,0,8,8,8,8
urlo_munch11.jpg,8,8,8,8,8,8,8,8,8,8,8,0,8,8,8
urlo_munch2.jpg,8,8,8,8,8,8,8,8,8,8,8,8,0,8,8
urlo_munch5.jpg,8,8,8,8,8,8,8,8,8,8,8,8,8,0,8
urlo_munch0.jpg,8,8,8,8,8,8,8,8,8,8,8,8,8,8,0
