,torre_pisa0.jpg,torre_pisa5.jpg,torre_pisa11.jpg,torre_pisa13.jpg,torre_pisa12.jpg,torre_pisa3.jpg,torre_pisa4.jpg,torre_pisa10.jpg,torre_pisa7.jpg,torre_pisa1.jpg,torre_pisa6.jpg,torre_pisa9.jpg,torre_pisa8.jpg,torre_pisa2.jpg,torre_pisa14.jpg
Type,Meta,Meta,Meta,Meta,Meta,Meta,Meta,Meta,Meta,Meta,Meta,Meta,Meta,Meta,Meta
torre_pisa0.jpg,0,5,4,7,4,5,5,5,5,4,5,5,5,5,4
torre_pisa5.jpg,5,0,6,6,6,3,6,5,5,6,3,3,3,5,5
torre_pisa11.jpg,4,6,0,6,4,6,5,3,5,5,5,5,6,6,4
torre_pisa13.jpg,7,6,6,0,6,5,6,5,5,6,5,6,5,6,6
torre_pisa12.jpg,4,6,4,6,0,6,6,4,6,6,4,6,7,4,4
torre_pisa3.jpg,5,3,6,5,6,0,6,4,4,7,3,4,5,4,4
torre_pisa4.jpg,5,6,5,6,6,6,0,6,6,5,6,4,5,6,5
torre_pisa10.jpg,5,5,3,5,4,4,6,0,5,6,5,6,6,6,4
torre_pisa7.jpg,5,5,5,5,6,4,6,5,0,6,5,4,5,5,6
torre_pisa1.jpg,4,6,5,6,6,7,5,6,6,0,7,6,3,7,6
torre_pisa6.jpg,5,3,5,5,4,3,6,5,5,7,0,4,5,5,3
torre_pisa9.jpg,5,3,5,6,6,4,4,6,4,6,4,0,4,4,6
torre_pisa8.jpg,5,3,6,5,7,5,5,6,5,3,5,4,0,6,7
torre_pisa2.jpg,5,5,6,6,4,4,6,6,5,7,5,4,6,0,6
torre_pisa14.jpg,4,5,4,6,4,4,5,4,6,6,3,6,7,6,0
Type,Content,Content,Content,Content,Content,Content,Content,Content,Content,Content,Content,Content,Content,Content,Content
torre_pisa0.jpg,0,13,13,13,11,13,11,12,12,13,12,13,12,11,12
torre_pisa5.jpg,13,0,13,13,13,12,12,12,13,12,12,13,12,13,13
torre_pisa11.jpg,13,13,0,12,13,13,13,13,13,13,12,12,9,12,13
torre_pisa13.jpg,13,13,12,0,13,13,13,13,12,13,13,13,13,12,13
torre_pisa12.jpg,11,13,13,13,0,13,11,13,13,12,13,13,12,12,13
torre_pisa3.jpg,13,12,13,13,13,0,13,13,11,13,11,12,13,11,13
torre_pisa4.jpg,11,12,13,13,11,13,0,12,13,13,12,12,12,13,13
torre_pisa10.jpg,12,12,13,13,13,13,12,0,13,13,11,11,13,13,13
torre_pisa7.jpg,12,13,13,12,13,11,13,13,0,13,13,13,13,12,11
torre_pisa1.jpg,13,12,13,13,12,13,13,13,13,0,13,13,13,13,13
torre_pisa6.jpg,12,12,12,13,13,11,12,11,13,13,0,12,12,13,12
torre_pisa9.jpg,13,13,12,13,13,12,12,11,13,13,12,0,11,12,13
torre_pisa8.jpg,12,12,9,13,12,13,12,13,13,13,12,11,0,13,13
torre_pisa2.jpg,11,13,12,12,12,11,13,13,12,13,13,12,13,0,12
torre_pisa14.jpg,12,13,13,13,13,13,13,13,11,13,12,13,13,12,0
Type,Final-R,Final-R,Final-R,Final-R,Final-R,Final-R,Final-R,Final-R,Final-R,Final-R,Final-R,Final-R,Final-R,Final-R,Final-R
torre_pisa0.jpg,0,24,22,24,20,26,20,20,24,24,24,22,24,20,22
torre_pisa5.jpg,24,0,26,24,26,22,24,22,26,22,24,26,24,26,26
torre_pisa11.jpg,22,26,0,24,22,26,26,24,22,26,24,24,18,22,26
torre_pisa13.jpg,24,24,24,0,24,26,26,26,24,26,26,26,26,20,24
torre_pisa12.jpg,20,26,22,24,0,24,22,26,24,24,26,26,22,24,26
torre_pisa3.jpg,26,22,26,26,24,0,26,26,18,26,20,24,26,22,26
torre_pisa4.jpg,20,24,26,26,22,26,0,24,26,24,22,24,24,26,26
torre_pisa10.jpg,20,22,24,26,26,26,24,0,26,26,22,18,26,26,26
torre_pisa7.jpg,24,26,22,24,24,18,26,26,0,26,26,24,24,24,20
torre_pisa1.jpg,24,22,26,26,24,26,24,26,26,0,22,26,24,24,24
torre_pisa6.jpg,24,24,24,26,26,20,22,22,26,22,0,24,24,24,24
torre_pisa9.jpg,22,26,24,26,26,24,24,18,24,26,24,0,22,24,24
torre_pisa8.jpg,24,24,18,26,22,26,24,26,24,24,24,22,0,26,24
torre_pisa2.jpg,20,26,22,20,24,22,26,26,24,24,24,24,26,0,24
torre_pisa14.jpg,22,26,26,24,26,26,26,26,20,24,24,24,24,24,0
