,colosseo13.jpg,colosseo4.jpg,colosseo9.jpg,colosseo3.jpg,colosseo12.jpg,colosseo7.jpg,colosseo14.jpg,colosseo2.jpg,colosseo0.jpg,colosseo5.jpg,colosseo8.jpg,colosseo6.jpg,colosseo10.jpg,colosseo11.jpg,colosseo1.jpg
Type,Meta,Meta,Meta,Meta,Meta,Meta,Meta,Meta,Meta,Meta,Meta,Meta,Meta,Meta,Meta
colosseo13.jpg,0,5,5,3,3,5,4,4,5,5,5,6,4,4,5
colosseo4.jpg,5,0,3,4,3,3,5,5,5,3,4,4,4,5,5
colosseo9.jpg,5,3,0,5,4,4,4,5,3,6,5,5,3,4,6
colosseo3.jpg,3,4,5,0,3,5,4,4,4,3,5,6,4,4,6
colosseo12.jpg,3,3,4,3,0,5,3,4,5,5,4,6,4,3,4
colosseo7.jpg,5,3,4,5,5,0,4,4,4,5,2,3,3,4,4
colosseo14.jpg,4,5,4,4,3,4,0,4,3,6,3,6,3,1,4
colosseo2.jpg,4,5,5,4,4,4,4,0,4,5,4,6,4,4,4
colosseo0.jpg,5,5,3,4,5,4,3,4,0,6,5,4,3,3,6
colosseo5.jpg,5,3,6,3,5,5,6,5,6,0,5,6,6,6,5
colosseo8.jpg,5,4,5,5,4,2,3,4,5,5,0,4,4,3,3
colosseo6.jpg,6,4,5,6,6,3,6,6,4,6,4,0,5,6,6
colosseo10.jpg,4,4,3,4,4,3,3,4,3,6,4,5,0,3,5
colosseo11.jpg,4,5,4,4,3,4,1,4,3,6,3,6,3,0,3
colosseo1.jpg,5,5,6,6,4,4,4,4,6,5,3,6,5,3,0
Type,R-Meta,R-Meta,R-Meta,R-Meta,R-Meta,R-Meta,R-Meta,R-Meta,R-Meta,R-Meta,R-Meta,R-Meta,R-Meta,R-Meta,R-Meta
colosseo13.jpg,0,1,1,0,0,2,1,2,1,1,2,2,1,1,2
colosseo4.jpg,1,0,2,1,1,1,2,3,2,0,1,1,2,2,1
colosseo9.jpg,1,2,0,1,1,1,0,1,0,2,1,1,0,0,1
colosseo3.jpg,0,1,1,0,0,2,1,2,1,1,2,2,1,1,2
colosseo12.jpg,0,1,1,0,0,2,1,2,1,1,2,2,1,1,2
colosseo7.jpg,2,1,1,2,2,0,1,2,1,1,0,0,1,1,0
colosseo14.jpg,1,2,0,1,1,1,0,1,0,2,1,1,0,0,1
colosseo2.jpg,2,3,1,2,2,2,1,0,1,3,2,2,1,1,2
colosseo0.jpg,1,2,0,1,1,1,0,1,0,2,1,1,0,0,1
colosseo5.jpg,1,0,2,1,1,1,2,3,2,0,1,1,2,2,1
colosseo8.jpg,2,1,1,2,2,0,1,2,1,1,0,0,1,1,0
colosseo6.jpg,2,1,1,2,2,0,1,2,1,1,0,0,1,1,0
colosseo10.jpg,1,2,0,1,1,1,0,1,0,2,1,1,0,0,1
colosseo11.jpg,1,2,0,1,1,1,0,1,0,2,1,1,0,0,1
colosseo1.jpg,2,1,1,2,2,0,1,2,1,1,0,0,1,1,0
Type,Content,Content,Content,Content,Content,Content,Content,Content,Content,Content,Content,Content,Content,Content,Content
colosseo13.jpg,0,13,13,12,12,13,12,13,13,13,13,11,10,11,13
colosseo4.jpg,13,0,12,13,12,13,13,13,12,13,12,13,12,13,13
colosseo9.jpg,13,12,0,12,11,13,13,12,13,13,12,12,11,13,12
colosseo3.jpg,12,13,12,0,13,13,12,13,13,11,13,13,13,13,13
colosseo12.jpg,12,12,11,13,0,12,13,12,12,12,12,13,10,13,13
colosseo7.jpg,13,13,13,13,12,0,11,12,10,13,13,11,13,13,12
colosseo14.jpg,12,13,13,12,13,11,0,13,13,12,13,13,13,13,12
colosseo2.jpg,13,13,12,13,12,12,13,0,12,13,13,11,12,13,12
colosseo0.jpg,13,12,13,13,12,10,13,12,0,13,13,12,13,13,12
colosseo5.jpg,13,13,13,11,12,13,12,13,13,0,12,13,13,11,12
colosseo8.jpg,13,12,12,13,12,13,13,13,13,12,0,13,13,11,12
colosseo6.jpg,11,13,12,13,13,11,13,11,12,13,13,0,12,12,12
colosseo10.jpg,10,12,11,13,10,13,13,12,13,13,13,12,0,12,12
colosseo11.jpg,11,13,13,13,13,13,13,13,13,11,11,12,12,0,13
colosseo1.jpg,13,13,12,13,13,12,12,12,12,12,12,12,12,13,0
Type,R-Content,R-Content,R-Content,R-Content,R-Content,R-Content,R-Content,R-Content,R-Content,R-Content,R-Content,R-Content,R-Content,R-Content,R-Content
colosseo13.jpg,0,2,4,3,2,4,2,1,2,1,4,2,4,4,4
colosseo4.jpg,2,0,2,5,2,4,4,3,4,3,2,4,2,4,4
colosseo9.jpg,4,2,0,3,4,2,6,3,4,3,4,4,2,2,2
colosseo3.jpg,3,5,3,0,5,1,3,2,1,2,5,3,5,1,3
colosseo12.jpg,2,2,4,5,0,4,4,3,4,3,4,4,4,6,4
colosseo7.jpg,4,4,2,1,4,0,4,3,2,3,4,4,4,2,2
colosseo14.jpg,2,4,6,3,4,4,0,3,2,3,2,2,4,4,4
colosseo2.jpg,1,3,3,2,3,3,3,0,1,0,5,1,3,3,3
colosseo0.jpg,2,4,4,1,4,2,2,1,0,1,4,2,4,2,4
colosseo5.jpg,1,3,3,2,3,3,3,0,1,0,5,1,3,3,3
colosseo8.jpg,4,2,4,5,4,4,2,5,4,5,0,4,2,4,4
colosseo6.jpg,2,4,4,3,4,4,2,1,2,1,4,0,2,4,2
colosseo10.jpg,4,2,2,5,4,4,4,3,4,3,2,2,0,4,2
colosseo11.jpg,4,4,2,1,6,2,4,3,2,3,4,4,4,0,4
colosseo1.jpg,4,4,2,3,4,2,4,3,4,3,4,2,2,4,0
Type,Final-R,Final-R,Final-R,Final-R,Final-R,Final-R,Final-R,Final-R,Final-R,Final-R,Final-R,Final-R,Final-R,Final-R,Final-R
colosseo13.jpg,0,1,2,1,1,2,1,2,1,0,2,1,2,1,2
colosseo4.jpg,1,0,1,2,0,1,2,1,2,1,1,2,1,2,1
colosseo9.jpg,2,1,0,1,1,0,1,0,1,2,0,1,0,1,0
colosseo3.jpg,1,2,1,0,2,1,0,1,0,1,1,0,1,0,1
colosseo12.jpg,1,0,1,2,0,1,2,1,2,1,1,2,1,2,1
colosseo7.jpg,2,1,0,1,1,0,1,0,1,2,0,1,0,1,0
colosseo14.jpg,1,2,1,0,2,1,0,1,0,1,1,0,1,0,1
colosseo2.jpg,2,1,0,1,1,0,1,0,1,2,0,1,0,1,0
colosseo0.jpg,1,2,1,0,2,1,0,1,0,1,1,0,1,0,1
colosseo5.jpg,0,1,2,1,1,2,1,2,1,0,2,1,2,1,2
colosseo8.jpg,2,1,0,1,1,0,1,0,1,2,0,1,0,1,0
colosseo6.jpg,1,2,1,0,2,1,0,1,0,1,1,0,1,0,1
colosseo10.jpg,2,1,0,1,1,0,1,0,1,2,0,1,0,1,0
colosseo11.jpg,1,2,1,0,2,1,0,1,0,1,1,0,1,0,1
colosseo1.jpg,2,1,0,1,1,0,1,0,1,2,0,1,0,1,0
