,due_torri1.jpg,due_torri14.jpg,due_torri5.jpg,due_torri2.jpg,due_torri12.jpg,due_torri4.jpg,due_torri0.jpg,due_torri9.jpg,due_torri7.jpg,due_torri11.jpg,due_torri6.jpg,due_torri10.jpg,due_torri13.jpg,due_torri3.jpg,due_torri8.jpg
Type,SHA256,SHA256,SHA256,SHA256,SHA256,SHA256,SHA256,SHA256,SHA256,SHA256,SHA256,SHA256,SHA256,SHA256,SHA256
due_torri1.jpg,0,63,59,59,62,61,63,62,62,57,60,59,60,61,60
due_torri14.jpg,63,0,62,61,62,60,58,62,58,57,59,61,61,61,61
due_torri5.jpg,59,62,0,60,62,61,59,60,60,58,61,61,59,58,62
due_torri2.jpg,59,61,60,0,58,59,57,59,62,60,58,60,60,57,62
due_torri12.jpg,62,62,62,58,0,58,61,56,62,61,62,56,62,61,59
due_torri4.jpg,61,60,61,59,58,0,60,62,61,63,59,63,57,60,55
due_torri0.jpg,63,58,59,57,61,60,0,57,63,60,61,60,60,61,62
due_torri9.jpg,62,62,60,59,56,62,57,0,61,61,63,62,62,60,58
due_torri7.jpg,62,58,60,62,62,61,63,61,0,57,56,61,61,60,62
due_torri11.jpg,57,57,58,60,61,63,60,61,57,0,59,62,62,60,61
due_torri6.jpg,60,59,61,58,62,59,61,63,56,59,0,58,61,55,61
due_torri10.jpg,59,61,61,60,56,63,60,62,61,62,58,0,52,60,62
due_torri13.jpg,60,61,59,60,62,57,60,62,61,62,61,52,0,60,56
due_torri3.jpg,61,61,58,57,61,60,61,60,60,60,55,60,60,0,59
due_torri8.jpg,60,61,62,62,59,55,62,58,62,61,61,62,56,59,0
Type,Final-R,Final-R,Final-R,Final-R,Final-R,Final-R,Final-R,Final-R,Final-R,Final-R,Final-R,Final-R,Final-R,Final-R,Final-R
due_torri1.jpg,0,6,5,1,5,6,8,8,4,6,8,5,6,4,6
due_torri14.jpg,6,0,7,7,5,4,6,4,6,6,4,5,8,6,8
due_torri5.jpg,5,7,0,4,4,3,7,7,7,5,7,6,3,7,5
due_torri2.jpg,1,7,4,0,4,7,7,7,5,5,7,6,5,3,5
due_torri12.jpg,5,5,4,4,0,7,3,7,7,5,7,4,7,7,7
due_torri4.jpg,6,4,3,7,7,0,8,6,6,4,6,5,4,8,6
due_torri0.jpg,8,6,7,7,3,8,0,6,6,6,6,5,8,8,6
due_torri9.jpg,8,4,7,7,7,6,6,0,8,6,4,7,8,4,4
due_torri7.jpg,4,6,7,5,7,6,6,8,0,6,6,5,6,6,6
due_torri11.jpg,6,6,5,5,5,4,6,6,6,0,6,5,6,6,4
due_torri6.jpg,8,4,7,7,7,6,6,4,6,6,0,5,8,6,8
due_torri10.jpg,5,5,6,6,4,5,5,7,5,5,5,0,7,7,7
due_torri13.jpg,6,8,3,5,7,4,8,8,6,6,8,7,0,6,6
due_torri3.jpg,4,6,7,3,7,8,8,4,6,6,6,7,6,0,4
due_torri8.jpg,6,8,5,5,7,6,6,4,6,4,8,7,6,4,0
