,reggia_caserta2.jpg,reggia_caserta9.jpg,reggia_caserta5.jpg,reggia_caserta1.jpg,reggia_caserta6.jpg,reggia_caserta13.jpg,reggia_caserta12.jpg,reggia_caserta0.jpg,reggia_caserta8.jpg,reggia_caserta14.jpg,reggia_caserta10.jpg,reggia_caserta7.jpg,reggia_caserta3.jpg,reggia_caserta4.jpg,reggia_caserta11.jpg
Type,SHA256,SHA256,SHA256,SHA256,SHA256,SHA256,SHA256,SHA256,SHA256,SHA256,SHA256,SHA256,SHA256,SHA256,SHA256
reggia_caserta2.jpg,0,60,59,64,62,57,61,63,58,61,63,59,62,62,64
reggia_caserta9.jpg,60,0,63,58,57,61,59,62,60,61,56,53,64,59,60
reggia_caserta5.jpg,59,63,0,60,61,59,61,61,62,58,61,57,63,57,62
reggia_caserta1.jpg,64,58,60,0,59,59,59,58,60,61,61,63,61,63,63
reggia_caserta6.jpg,62,57,61,59,0,64,54,61,62,59,57,61,58,58,58
reggia_caserta13.jpg,57,61,59,59,64,0,61,60,59,60,58,61,63,63,59
reggia_caserta12.jpg,61,59,61,59,54,61,0,54,59,58,58,63,60,61,57
reggia_caserta0.jpg,63,62,61,58,61,60,54,0,61,60,59,59,60,64,58
reggia_caserta8.jpg,58,60,62,60,62,59,59,61,0,60,60,62,60,62,59
reggia_caserta14.jpg,61,61,58,61,59,60,58,60,60,0,60,59,59,58,61
reggia_caserta10.jpg,63,56,61,61,57,58,58,59,60,60,0,60,61,62,57
reggia_caserta7.jpg,59,53,57,63,61,61,63,59,62,59,60,0,64,59,61
reggia_caserta3.jpg,62,64,63,61,58,63,60,60,60,59,61,64,0,61,59
reggia_caserta4.jpg,62,59,57,63,58,63,61,64,62,58,62,59,61,0,59
reggia_caserta11.jpg,64,60,62,63,58,59,57,58,59,61,57,61,59,59,0
Type,Final-R,Final-R,Final-R,Final-R,Final-R,Final-R,Final-R,Final-R,Final-R,Final-R,Final-R,Final-R,Final-R,Final-R,Final-R
reggia_caserta2.jpg,0,30,29,32,28,25,29,31,28,26,31,27,31,29,29
reggia_caserta9.jpg,30,0,27,32,30,29,27,29,30,32,27,29,25,29,31
reggia_caserta5.jpg,29,27,0,31,31,28,28,30,29,31,26,30,28,28,30
reggia_caserta1.jpg,32,32,31,0,32,27,29,31,32,30,29,31,31,25,23
reggia_caserta6.jpg,28,30,31,32,0,29,25,29,30,28,31,29,31,31,31
reggia_caserta13.jpg,25,29,28,27,29,0,26,26,29,27,28,24,30,28,26
reggia_caserta12.jpg,29,27,28,29,25,26,0,26,29,29,30,26,30,30,30
reggia_caserta0.jpg,31,29,30,31,29,26,26,0,31,31,30,22,30,30,28
reggia_caserta8.jpg,28,30,29,32,30,29,29,31,0,28,31,31,31,29,31
reggia_caserta14.jpg,26,32,31,30,28,27,29,31,28,0,31,29,31,29,31
reggia_caserta10.jpg,31,27,26,29,31,28,30,30,31,31,0,30,24,28,30
reggia_caserta7.jpg,27,29,30,31,29,24,26,22,31,29,30,0,30,26,24
reggia_caserta3.jpg,31,25,28,31,31,30,30,30,31,31,24,30,0,26,30
reggia_caserta4.jpg,29,29,28,25,31,28,30,30,29,29,28,26,26,0,26
reggia_caserta11.jpg,29,31,30,23,31,26,30,28,31,31,30,24,30,26,0
