,nettuno9.jpg,nettuno3.jpg,nettuno2.jpg,nettuno11.jpg,nettuno0.jpg,nettuno5.jpg,nettuno4.jpg,nettuno12.jpg,nettuno6.jpg,nettuno10.jpg,nettuno7.jpg,nettuno8.jpg,nettuno1.jpg,nettuno13.jpg,nettuno14.jpg
Type,SHA256,SHA256,SHA256,SHA256,SHA256,SHA256,SHA256,SHA256,SHA256,SHA256,SHA256,SHA256,SHA256,SHA256,SHA256
nettuno9.jpg,0,58,61,61,60,61,61,59,58,59,58,59,63,58,59
nettuno3.jpg,58,0,60,61,61,61,60,62,62,59,60,61,59,61,58
nettuno2.jpg,61,60,0,59,60,59,58,57,58,56,61,61,60,58,62
nettuno11.jpg,61,61,59,0,60,60,61,61,57,55,57,60,62,60,60
nettuno0.jpg,60,61,60,60,0,57,59,62,63,58,60,55,63,59,60
nettuno5.jpg,61,61,59,60,57,0,57,61,61,63,59,60,62,55,61
nettuno4.jpg,61,60,58,61,59,57,0,61,60,57,59,63,61,60,61
nettuno12.jpg,59,62,57,61,62,61,61,0,62,60,60,60,60,64,55
nettuno6.jpg,58,62,58,57,63,61,60,62,0,56,58,59,62,59,64
nettuno10.jpg,59,59,56,55,58,63,57,60,56,0,58,60,62,60,60
nettuno7.jpg,58,60,61,57,60,59,59,60,58,58,0,61,63,61,61
nettuno8.jpg,59,61,61,60,55,60,63,60,59,60,61,0,61,63,57
nettuno1.jpg,63,59,60,62,63,62,61,60,62,62,63,61,0,59,61
nettuno13.jpg,58,61,58,60,59,55,60,64,59,60,61,63,59,0,57
nettuno14.jpg,59,58,62,60,60,61,61,55,64,60,61,57,61,57,0
Type,Final-R,Final-R,Final-R,Final-R,Final-R,Final-R,Final-R,Final-R,Final-R,Final-R,Final-R,Final-R,Final-R,Final-R,Final-R
nettuno9.jpg,0,2,3,4,3,4,0,4,2,5,3,1,4,2,3
nettuno3.jpg,2,0,3,4,3,2,2,2,4,5,3,3,4,4,5
nettuno2.jpg,3,3,0,7,4,3,3,5,5,6,0,4,5,5,4
nettuno11.jpg,4,4,7,0,5,4,4,4,2,3,7,3,4,4,3
nettuno0.jpg,3,3,4,5,0,3,3,1,5,4,4,4,5,3,4
nettuno5.jpg,4,2,3,4,3,0,4,2,6,3,3,5,4,6,3
nettuno4.jpg,0,2,3,4,3,4,0,4,2,5,3,1,4,2,3
nettuno12.jpg,4,2,5,4,1,2,4,0,6,3,5,5,4,4,5
nettuno6.jpg,2,4,5,2,5,6,2,6,0,5,5,1,4,2,3
nettuno10.jpg,5,5,6,3,4,3,5,3,5,0,6,6,1,3,2
nettuno7.jpg,3,3,0,7,4,3,3,5,5,6,0,4,5,5,4
nettuno8.jpg,1,3,4,3,4,5,1,5,1,6,4,0,5,3,4
nettuno1.jpg,4,4,5,4,5,4,4,4,4,1,5,5,0,2,3
nettuno13.jpg,2,4,5,4,3,6,2,4,2,3,5,3,2,0,3
nettuno14.jpg,3,5,4,3,4,3,3,5,3,2,4,4,3,3,0
