,cinque_terre10.jpg,cinque_terre2.jpg,cinque_terre7.jpg,cinque_terre4.jpg,cinque_terre0.jpg,cinque_terre8.jpg,cinque_terre1.jpg,cinque_terre9.jpg,cinque_terre3.jpg,cinque_terre5.jpg,cinque_terre6.jpg,cinque_terre14.jpg,cinque_terre12.jpg,cinque_terre11.jpg,cinque_terre13.jpg
Type,SHA256,SHA256,SHA256,SHA256,SHA256,SHA256,SHA256,SHA256,SHA256,SHA256,SHA256,SHA256,SHA256,SHA256,SHA256
cinque_terre10.jpg,0,60,60,63,58,56,60,58,61,58,58,62,59,59,58
cinque_terre2.jpg,60,0,62,61,61,61,62,60,59,60,62,62,63,60,61
cinque_terre7.jpg,60,62,0,57,62,62,61,59,59,64,59,58,63,56,61
cinque_terre4.jpg,63,61,57,0,61,63,61,60,58,59,57,59,59,63,58
cinque_terre0.jpg,58,61,62,61,0,58,61,60,64,59,61,62,59,61,61
cinque_terre8.jpg,56,61,62,63,58,0,57,62,61,61,61,63,60,62,57
cinque_terre1.jpg,60,62,61,61,61,57,0,62,63,59,60,55,60,61,61
cinque_terre9.jpg,58,60,59,60,60,62,62,0,58,57,57,60,59,59,59
cinque_terre3.jpg,61,59,59,58,64,61,63,58,0,63,59,61,59,59,58
cinque_terre5.jpg,58,60,64,59,59,61,59,57,63,0,60,61,61,62,60
cinque_terre6.jpg,58,62,59,57,61,61,60,57,59,60,0,62,60,60,64
cinque_terre14.jpg,62,62,58,59,62,63,55,60,61,61,62,0,60,61,60
cinque_terre12.jpg,59,63,63,59,59,60,60,59,59,61,60,60,0,59,56
cinque_terre11.jpg,59,60,56,63,61,62,61,59,59,62,60,61,59,0,61
cinque_terre13.jpg,58,61,61,58,61,57,61,59,58,60,64,60,56,61,0
Type,Final-R,Final-R,Final-R,Final-R,Final-R,Final-R,Final-R,Final-R,Final-R,Final-R,Final-R,Final-R,Final-R,Final-R,Final-R
cinque_terre10.jpg,0,15,14,16,15,11,13,16,14,14,15,15,11,12,13
cinque_terre2.jpg,15,0,11,11,14,10,14,11,15,13,14,14,14,11,10
cinque_terre7.jpg,14,11,0,10,11,11,11,10,10,14,11,7,13,12,11
cinque_terre4.jpg,16,11,10,0,13,13,11,10,16,14,13,13,13,12,13
cinque_terre0.jpg,15,14,11,13,0,14,14,15,15,15,10,10,12,11,10
cinque_terre8.jpg,11,10,11,13,14,0,12,15,11,11,14,14,12,7,14
cinque_terre1.jpg,13,14,11,11,14,12,0,13,13,15,14,12,10,11,12
cinque_terre9.jpg,16,11,10,10,15,15,13,0,14,14,11,15,13,12,15
cinque_terre3.jpg,14,15,10,16,15,11,13,14,0,16,15,11,13,14,15
cinque_terre5.jpg,14,13,14,14,15,11,15,14,16,0,13,15,13,12,9
cinque_terre6.jpg,15,14,11,13,10,14,14,11,15,13,0,12,14,9,8
cinque_terre14.jpg,15,14,7,13,10,14,12,15,11,15,12,0,12,13,12
cinque_terre12.jpg,11,14,13,13,12,12,10,13,13,13,14,12,0,11,14
cinque_terre11.jpg,12,11,12,12,11,7,11,12,14,12,9,13,11,0,11
cinque_terre13.jpg,13,10,11,13,10,14,12,15,15,9,8,12,14,11,0
