Img-Name,Meta,R-Meta,Content,R-Content,Final-R
pantheon8.jpg,AAA2I6UK7UZLHRDD,"[0, 1, 1, 1, 1, 1, 1, 0]",EEA6X7MQYBHFIDZV,"[0, 1, 1, 0, 1, 1, 1, 1]","[0, 1, 1, 1, 1, 1, 1, 0]"
pantheon4.jpg,AAA2Z6AN7UZLHRDD,"[0, 1, 1, 0, 1, 1, 1, 0]",EEAY6VDKNUS3LHCK,"[1, 1, 0, 1, 0, 1, 1, 0]","[0, 1, 1, 0, 1, 1, 1, 0]"
pantheon1.jpg,AAA3I4UH7UZLHRDD,"[1, 1, 1, 1, 1, 1, 0, 0]",EEAZISZNGYZRB6M7,"[0, 1, 1, 1, 0, 1, 1, 1]","[1, 1, 1, 1, 1, 1, 0, 0]"
pantheon12.jpg,AAA326XL7UZLHRDD,"[0, 1, 1, 1, 1, 1, 1, 0]",EEA6XFMS4RNMOCTM,"[0, 0, 1, 1, 0, 1, 1, 0]","[0, 1, 1, 1, 1, 1, 1, 0]"
pantheon0.jpg,AAA324UF7QZLHRDD,"[0, 1, 1, 1, 1, 0, 1, 0]",EEAYEEK7NNWTJPSG,"[1, 1, 0, 0, 1, 1, 1, 1]","[0, 1, 1, 1, 1, 0, 1, 0]"
pantheon2.jpg,AAA2L6UP7UZLHRDD,"[1, 1, 1, 0, 1, 1, 1, 0]",EEA3LEYXFRUFOK2Z,"[1, 0, 1, 1, 0, 1, 1, 0]","[1, 1, 1, 0, 1, 1, 1, 0]"
pantheon9.jpg,AAA2T6UH6QZLHRDD,"[1, 1, 1, 0, 1, 0, 1, 0]",EEA6PPOQIHUFB6UM,"[1, 1, 0, 0, 0, 1, 1, 0]","[1, 1, 1, 0, 1, 0, 1, 0]"
pantheon14.jpg,AAA337UP7UZLHRDD,"[1, 1, 1, 1, 1, 1, 0, 1]",EEA6V2UFY6YQNV4E,"[0, 1, 1, 0, 0, 1, 1, 0]","[1, 1, 1, 1, 1, 1, 0, 1]"
pantheon7.jpg,AAA226UH7UZLHRDD,"[1, 1, 1, 0, 1, 1, 1, 0]",EEA23KMEOKASLV63,"[0, 0, 1, 1, 0, 1, 1, 0]","[1, 1, 1, 0, 1, 1, 1, 0]"
pantheon13.jpg,AAA7K5VH7UZLHRDD,"[1, 1, 1, 0, 1, 1, 0, 1]",EEA6VAYUP4VI34BN,"[0, 1, 0, 0, 1, 1, 1, 0]","[1, 1, 1, 0, 1, 1, 0, 1]"
pantheon10.jpg,AAA327VL7UZLHRDD,"[0, 1, 1, 1, 1, 1, 0, 1]",EEA6DX26BVRRENLB,"[1, 0, 1, 0, 0, 1, 1, 0]","[0, 1, 1, 1, 1, 1, 0, 1]"
pantheon3.jpg,AAA724UN6UZLHRDD,"[0, 1, 1, 0, 1, 1, 1, 1]",EEAZWGJCMMXYNWK5,"[0, 1, 1, 1, 0, 1, 0, 1]","[0, 1, 1, 0, 1, 1, 1, 1]"
pantheon11.jpg,AAA3P5VH7UZLHRDD,"[1, 1, 1, 1, 1, 1, 0, 0]",EEA7VJMWHLRQLKFF,"[0, 1, 1, 1, 1, 1, 1, 1]","[1, 1, 1, 1, 1, 1, 0, 0]"
pantheon6.jpg,AAA3C6AP7UZLHRDD,"[1, 1, 1, 1, 1, 1, 1, 0]",EEAYTUC7F4WTLMHQ,"[0, 1, 0, 0, 1, 1, 0, 1]","[1, 1, 1, 1, 1, 1, 1, 0]"
pantheon5.jpg,AAA235QN6UZLHRDD,"[0, 1, 1, 0, 1, 1, 1, 0]",EEA6VX4FUASNNFY2,"[1, 1, 1, 0, 0, 1, 1, 0]","[0, 1, 1, 0, 1, 1, 1, 0]"
