,duomo_milano2.jpg,duomo_milano3.jpg,duomo_milano5.jpg,duomo_milano6.jpg,duomo_milano12.jpg,duomo_milano7.jpg,duomo_milano14.jpg,duomo_milano1.jpg,duomo_milano8.jpg,duomo_milano10.jpg,duomo_milano13.jpg,duomo_milano4.jpg,duomo_milano0.jpg,duomo_milano9.jpg,duomo_milano11.jpg
Type,Meta,Meta,Meta,Meta,Meta,Meta,Meta,Meta,Meta,Meta,Meta,Meta,Meta,Meta,Meta
duomo_milano2.jpg,0,4,6,6,4,6,5,5,4,5,3,6,5,5,5
duomo_milano3.jpg,4,0,7,6,5,6,6,6,6,7,5,6,6,6,4
duomo_milano5.jpg,6,7,0,5,7,7,2,5,7,6,6,7,5,4,6
duomo_milano6.jpg,6,6,5,0,6,6,6,7,4,4,4,7,5,5,6
duomo_milano12.jpg,4,5,7,6,0,4,6,4,3,3,3,3,6,6,3
duomo_milano7.jpg,6,6,7,6,4,0,7,5,3,4,5,5,6,6,4
duomo_milano14.jpg,5,6,2,6,6,7,0,5,7,6,5,7,4,4,5
duomo_milano1.jpg,5,6,5,7,4,5,5,0,5,5,6,3,5,7,4
duomo_milano8.jpg,4,6,7,4,3,3,7,5,0,2,2,5,6,4,4
duomo_milano10.jpg,5,7,6,4,3,4,6,5,2,0,4,5,5,3,5
duomo_milano13.jpg,3,5,6,4,3,5,5,6,2,4,0,6,7,4,4
duomo_milano4.jpg,6,6,7,7,3,5,7,3,5,5,6,0,6,7,5
duomo_milano0.jpg,5,6,5,5,6,6,4,5,6,5,7,6,0,6,6
duomo_milano9.jpg,5,6,4,5,6,6,4,7,4,3,4,7,6,0,7
duomo_milano11.jpg,5,4,6,6,3,4,5,4,4,5,4,5,6,7,0
Type,R-Meta,R-Meta,R-Meta,R-Meta,R-Meta,R-Meta,R-Meta,R-Meta,R-Meta,R-Meta,R-Meta,R-Meta,R-Meta,R-Meta,R-Meta
duomo_milano2.jpg,0,2,8,6,3,4,4,5,3,5,2,5,5,6,3
duomo_milano3.jpg,2,0,8,8,3,4,4,5,5,7,4,5,5,8,1
duomo_milano5.jpg,8,8,0,4,7,6,4,5,7,5,6,7,5,4,7
duomo_milano6.jpg,6,8,4,0,7,6,6,5,5,3,6,7,5,4,7
duomo_milano12.jpg,3,3,7,7,0,3,3,4,4,6,3,2,4,7,2
duomo_milano7.jpg,4,4,6,6,3,0,4,3,1,3,4,3,3,4,3
duomo_milano14.jpg,4,4,4,6,3,4,0,5,5,5,2,5,3,4,3
duomo_milano1.jpg,5,5,5,5,4,3,5,0,4,6,5,2,4,7,4
duomo_milano8.jpg,3,5,7,5,4,1,5,4,0,2,3,4,4,3,4
duomo_milano10.jpg,5,7,5,3,6,3,5,6,2,0,5,6,4,1,6
duomo_milano13.jpg,2,4,6,6,3,4,2,5,3,5,0,5,5,4,3
duomo_milano4.jpg,5,5,7,7,2,3,5,2,4,6,5,0,4,7,4
duomo_milano0.jpg,5,5,5,5,4,3,3,4,4,4,5,4,0,5,4
duomo_milano9.jpg,6,8,4,4,7,4,4,7,3,1,4,7,5,0,7
duomo_milano11.jpg,3,1,7,7,2,3,3,4,4,6,3,4,4,7,0
Type,Content,Content,Content,Content,Content,Content,Content,Content,Content,Content,Content,Content,Content,Content,Content
duomo_milano2.jpg,0,13,13,13,11,11,12,13,13,13,13,11,13,11,13
duomo_milano3.jpg,13,0,11,12,13,12,13,12,13,13,12,12,13,13,13
duomo_milano5.jpg,13,11,0,12,12,12,12,12,13,13,13,13,12,12,13
duomo_milano6.jpg,13,12,12,0,13,13,12,13,13,13,13,12,12,13,11
duomo_milano12.jpg,11,13,12,13,0,13,11,13,11,12,12,13,13,11,13
duomo_milano7.jpg,11,12,12,13,13,0,13,13,13,12,13,13,13,12,12
duomo_milano14.jpg,12,13,12,12,11,13,0,12,11,13,12,11,13,11,12
duomo_milano1.jpg,13,12,12,13,13,13,12,0,13,12,11,12,13,12,13
duomo_milano8.jpg,13,13,13,13,11,13,11,13,0,13,13,12,13,12,13
duomo_milano10.jpg,13,13,13,13,12,12,13,12,13,0,11,13,13,13,11
duomo_milano13.jpg,13,12,13,13,12,13,12,11,13,11,0,12,13,13,12
duomo_milano4.jpg,11,12,13,12,13,13,11,12,12,13,12,0,13,13,13
duomo_milano0.jpg,13,13,12,12,13,13,13,13,13,13,13,13,0,13,13
duomo_milano9.jpg,11,13,12,13,11,12,11,12,12,13,13,13,13,0,13
duomo_milano11.jpg,13,13,13,11,13,12,12,13,13,11,12,13,13,13,0
Type,R-Content,R-Content,R-Content,R-Content,R-Content,R-Content,R-Content,R-Content,R-Content,R-Content,R-Content,R-Content,R-Content,R-Content,R-Content
duomo_milano2.jpg,0,6,11,12,11,8,11,11,13,9,9,5,10,8,10
duomo_milano3.jpg,6,0,11,10,13,8,11,9,11,11,7,9,12,10,10
duomo_milano5.jpg,11,11,0,11,6,11,6,8,8,10,4,12,13,9,7
duomo_milano6.jpg,12,10,11,0,9,10,9,11,13,11,11,11,12,12,8
duomo_milano12.jpg,11,13,6,9,0,11,10,12,10,8,8,10,13,9,9
duomo_milano7.jpg,8,8,11,10,11,0,13,11,11,7,7,9,12,12,8
duomo_milano14.jpg,11,11,6,9,10,13,0,8,8,12,10,10,11,9,7
duomo_milano1.jpg,11,9,8,11,12,11,8,0,10,10,8,10,9,9,9
duomo_milano8.jpg,13,11,8,13,10,11,8,10,0,12,10,12,11,11,11
duomo_milano10.jpg,9,11,10,11,8,7,12,10,12,0,10,10,13,11,7
duomo_milano13.jpg,9,7,4,11,8,7,10,8,10,10,0,10,11,9,9
duomo_milano4.jpg,5,9,12,11,10,9,10,10,12,10,10,0,9,9,9
duomo_milano0.jpg,10,12,13,12,13,12,11,9,11,13,11,9,0,8,10
duomo_milano9.jpg,8,10,9,12,9,12,9,9,11,11,9,9,8,0,12
duomo_milano11.jpg,10,10,7,8,9,8,7,9,11,7,9,9,10,12,0
Type,Final-R,Final-R,Final-R,Final-R,Final-R,Final-R,Final-R,Final-R,Final-R,Final-R,Final-R,Final-R,Final-R,Final-R,Final-R
duomo_milano2.jpg,0,7,12,11,8,11,9,8,11,10,7,8,9,11,10
duomo_milano3.jpg,7,0,11,14,9,10,8,9,8,13,8,13,12,12,9
duomo_milano5.jpg,12,11,0,11,8,11,9,10,11,8,7,12,13,9,6
duomo_milano6.jpg,11,14,11,0,13,12,10,11,14,11,12,11,14,10,11
duomo_milano12.jpg,8,9,8,13,0,11,9,6,11,10,7,10,13,11,6
duomo_milano7.jpg,11,10,11,12,11,0,12,9,10,7,8,11,14,14,9
duomo_milano14.jpg,9,8,9,10,9,12,0,9,8,11,10,9,8,10,3
duomo_milano1.jpg,8,9,10,11,6,9,9,0,9,8,7,8,11,9,8
duomo_milano8.jpg,11,8,11,14,11,10,8,9,0,11,8,13,12,12,9
duomo_milano10.jpg,10,13,8,11,10,7,11,8,11,0,9,6,11,9,8
duomo_milano13.jpg,7,8,7,12,7,8,10,7,8,9,0,11,10,12,7
duomo_milano4.jpg,8,13,12,11,10,11,9,8,13,6,11,0,11,9,10
duomo_milano0.jpg,9,12,13,14,13,14,8,11,12,11,10,11,0,10,7
duomo_milano9.jpg,11,12,9,10,11,14,10,9,12,9,12,9,10,0,11
duomo_milano11.jpg,10,9,6,11,6,9,3,8,9,8,7,10,7,11,0
