,san_petronio1.jpg,san_petronio6.jpg,san_petronio5.jpg,san_petronio0.jpg,san_petronio8.jpg,san_petronio11.jpg,san_petronio13.jpg,san_petronio12.jpg,san_petronio3.jpg,san_petronio9.jpg,san_petronio2.jpg,san_petronio7.jpg,san_petronio4.jpg,san_petronio10.jpg,san_petronio14.jpg
Type,Meta,Meta,Meta,Meta,Meta,Meta,Meta,Meta,Meta,Meta,Meta,Meta,Meta,Meta,Meta
san_petronio1.jpg,0,4,3,5,4,1,4,3,4,6,3,3,3,3,4
san_petronio6.jpg,4,0,3,4,2,4,4,4,2,6,4,1,2,4,4
san_petronio5.jpg,3,3,0,2,3,2,4,5,3,5,2,3,4,4,3
san_petronio0.jpg,5,4,2,0,4,4,5,6,4,3,4,4,5,4,3
san_petronio8.jpg,4,2,3,4,0,4,3,4,3,6,4,2,3,4,4
san_petronio11.jpg,1,4,2,4,4,0,4,4,4,6,3,3,3,3,3
san_petronio13.jpg,4,4,4,5,3,4,0,5,4,6,4,4,4,4,4
san_petronio12.jpg,3,4,5,6,4,4,5,0,5,5,5,3,3,4,5
san_petronio3.jpg,4,2,3,4,3,4,4,5,0,6,4,2,3,4,4
san_petronio9.jpg,6,6,5,3,6,6,6,5,6,0,4,6,5,4,5
san_petronio2.jpg,3,4,2,4,4,3,4,5,4,4,0,4,4,4,4
san_petronio7.jpg,3,1,3,4,2,3,4,3,2,6,4,0,1,3,4
san_petronio4.jpg,3,2,4,5,3,3,4,3,3,5,4,1,0,2,4
san_petronio10.jpg,3,4,4,4,4,3,4,4,4,4,4,3,2,0,3
san_petronio14.jpg,4,4,3,3,4,3,4,5,4,5,4,4,4,3,0
Type,R-Meta,R-Meta,R-Meta,R-Meta,R-Meta,R-Meta,R-Meta,R-Meta,R-Meta,R-Meta,R-Meta,R-Meta,R-Meta,R-Meta,R-Meta
san_petronio1.jpg,0,0,0,2,0,0,2,2,2,4,0,0,0,2,2
san_petronio6.jpg,0,0,0,2,0,0,2,2,2,4,0,0,0,2,2
san_petronio5.jpg,0,0,0,2,0,0,2,2,2,4,0,0,0,2,2
san_petronio0.jpg,2,2,2,0,2,2,2,4,2,2,2,2,2,2,2
san_petronio8.jpg,0,0,0,2,0,0,2,2,2,4,0,0,0,2,2
san_petronio11.jpg,0,0,0,2,0,0,2,2,2,4,0,0,0,2,2
san_petronio13.jpg,2,2,2,2,2,2,0,4,0,4,2,2,2,2,2
san_petronio12.jpg,2,2,2,4,2,2,4,0,4,2,2,2,2,4,4
san_petronio3.jpg,2,2,2,2,2,2,0,4,0,4,2,2,2,2,2
san_petronio9.jpg,4,4,4,2,4,4,4,2,4,0,4,4,4,4,4
san_petronio2.jpg,0,0,0,2,0,0,2,2,2,4,0,0,0,2,2
san_petronio7.jpg,0,0,0,2,0,0,2,2,2,4,0,0,0,2,2
san_petronio4.jpg,0,0,0,2,0,0,2,2,2,4,0,0,0,2,2
san_petronio10.jpg,2,2,2,2,2,2,2,4,2,4,2,2,2,0,0
san_petronio14.jpg,2,2,2,2,2,2,2,4,2,4,2,2,2,0,0
Type,Content,Content,Content,Content,Content,Content,Content,Content,Content,Content,Content,Content,Content,Content,Content
san_petronio1.jpg,0,13,13,11,13,13,12,12,13,12,12,13,11,13,12
san_petronio6.jpg,13,0,11,11,12,11,13,11,12,12,12,12,13,13,13
san_petronio5.jpg,13,11,0,10,12,10,12,12,12,12,10,11,13,12,11
san_petronio0.jpg,11,11,10,0,13,12,13,11,12,11,12,12,11,13,11
san_petronio8.jpg,13,12,12,13,0,12,11,13,13,13,13,12,12,11,13
san_petronio11.jpg,13,11,10,12,12,0,13,12,13,11,11,12,12,12,12
san_petronio13.jpg,12,13,12,13,11,13,0,12,12,13,13,13,13,11,12
san_petronio12.jpg,12,11,12,11,13,12,12,0,13,9,12,13,11,12,13
san_petronio3.jpg,13,12,12,12,13,13,12,13,0,13,12,13,13,12,12
san_petronio9.jpg,12,12,12,11,13,11,13,9,13,0,11,12,10,13,12
san_petronio2.jpg,12,12,10,12,13,11,13,12,12,11,0,12,12,13,13
san_petronio7.jpg,13,12,11,12,12,12,13,13,13,12,12,0,12,13,12
san_petronio4.jpg,11,13,13,11,12,12,13,11,13,10,12,12,0,13,12
san_petronio10.jpg,13,13,12,13,11,12,11,12,12,13,13,13,13,0,11
san_petronio14.jpg,12,13,11,11,13,12,12,13,12,12,13,12,12,11,0
Type,R-Content,R-Content,R-Content,R-Content,R-Content,R-Content,R-Content,R-Content,R-Content,R-Content,R-Content,R-Content,R-Content,R-Content,R-Content
san_petronio1.jpg,0,8,8,4,8,8,6,6,6,6,8,8,6,8,8
san_petronio6.jpg,8,0,6,8,8,6,6,8,6,8,6,6,8,8,8
san_petronio5.jpg,8,6,0,8,8,6,6,8,8,8,6,6,8,8,8
san_petronio0.jpg,4,8,8,0,8,6,8,6,6,6,8,8,6,8,8
san_petronio8.jpg,8,8,8,8,0,8,6,8,8,8,8,8,8,6,8
san_petronio11.jpg,8,6,6,6,8,0,6,8,8,8,6,6,8,8,8
san_petronio13.jpg,6,6,6,8,6,6,0,8,8,8,6,6,6,6,8
san_petronio12.jpg,6,8,8,6,8,8,8,0,8,6,8,8,6,8,8
san_petronio3.jpg,6,6,8,6,8,8,8,8,0,6,8,8,8,8,8
san_petronio9.jpg,6,8,8,6,8,8,8,6,6,0,8,8,6,8,8
san_petronio2.jpg,8,6,6,8,8,6,6,8,8,8,0,6,8,8,8
san_petronio7.jpg,8,6,6,8,8,6,6,8,8,8,6,0,8,8,8
san_petronio4.jpg,6,8,8,6,8,8,6,6,8,6,8,8,0,8,8
san_petronio10.jpg,8,8,8,8,6,8,6,8,8,8,8,8,8,0,8
san_petronio14.jpg,8,8,8,8,8,8,8,8,8,8,8,8,8,8,0
Type,Final-R,Final-R,Final-R,Final-R,Final-R,Final-R,Final-R,Final-R,Final-R,Final-R,Final-R,Final-R,Final-R,Final-R,Final-R
san_petronio1.jpg,0,8,8,4,8,8,6,6,6,6,8,8,6,8,8
san_petronio6.jpg,8,0,6,8,8,6,6,8,6,8,6,6,8,8,8
san_petronio5.jpg,8,6,0,8,8,6,6,8,8,8,6,6,8,8,8
san_petronio0.jpg,4,8,8,0,8,6,8,6,6,6,8,8,6,8,8
san_petronio8.jpg,8,8,8,8,0,8,6,8,8,8,8,8,8,6,8
san_petronio11.jpg,8,6,6,6,8,0,6,8,8,8,6,6,8,8,8
san_petronio13.jpg,6,6,6,8,6,6,0,8,8,8,6,6,6,6,8
san_petronio12.jpg,6,8,8,6,8,8,8,0,8,6,8,8,6,8,8
san_petronio3.jpg,6,6,8,6,8,8,8,8,0,6,8,8,8,8,8
san_petronio9.jpg,6,8,8,6,8,8,8,6,6,0,8,8,6,8,8
san_petronio2.jpg,8,6,6,8,8,6,6,8,8,8,0,6,8,8,8
san_petronio7.jpg,8,6,6,8,8,6,6,8,8,8,6,0,8,8,8
san_petronio4.jpg,6,8,8,6,8,8,6,6,8,6,8,8,0,8,8
san_petronio10.jpg,8,8,8,8,6,8,6,8,8,8,8,8,8,0,8
san_petronio14.jpg,8,8,8,8,8,8,8,8,8,8,8,8,8,8,0
