Img-Name,Meta,R-Meta,Content,R-Content,Final-R
arco_trionfo1.jpg,AAA6MUHV6IZDFWHD,"[0, 0, 0, 0, 1, 0, 1, 0]",EEA4CPV6IHHC4QNW,"[0, 0, 0, 1, 1, 0, 1, 1]","[0, 0, 0, 1, 1, 0, 1, 1]"
arco_trionfo12.jpg,AAA6ASDV6AZDFWHD,"[0, 0, 0, 0, 1, 0, 1, 0]",EEA6N4OUD2NOSJIU,"[0, 0, 0, 0, 0, 1, 1, 1]","[0, 0, 0, 0, 0, 1, 1, 1]"
arco_trionfo9.jpg,AAA4Q7H56AZDFWHD,"[0, 0, 0, 0, 1, 1, 0, 0]",EEAYGXJMONWDRF7I,"[0, 1, 0, 0, 1, 1, 0, 0]","[0, 1, 0, 0, 1, 1, 0, 0]"
arco_trionfo8.jpg,AAA6U5XVUAZDFWHD,"[0, 0, 0, 0, 1, 0, 1, 0]",EEA6DZQWSOPFRGJZ,"[0, 0, 1, 0, 0, 0, 1, 1]","[0, 0, 1, 0, 0, 0, 1, 1]"
arco_trionfo11.jpg,AAA4EUHVGAZDFWHD,"[0, 0, 0, 0, 1, 0, 1, 0]",EEAZMWDJE5UG3E6O,"[0, 0, 1, 0, 0, 0, 0, 1]","[0, 0, 1, 0, 0, 0, 0, 1]"
arco_trionfo3.jpg,AAA6W5BV4AZDFWHD,"[0, 0, 0, 0, 1, 0, 1, 0]",EEA2VJCV3JRMEWWX,"[1, 0, 1, 0, 0, 1, 1, 0]","[1, 0, 1, 0, 0, 1, 1, 0]"
arco_trionfo6.jpg,AAA4U5GUWAZDFWHD,"[0, 0, 0, 0, 1, 1, 0, 0]",EEA5C3TJWNTMJFRY,"[0, 1, 1, 0, 0, 1, 0, 0]","[0, 1, 1, 0, 0, 1, 0, 0]"
arco_trionfo13.jpg,AAA4CZFV4IZDFWHD,"[0, 0, 0, 0, 1, 0, 1, 0]",EEA5MDZJ6IU7Q2YG,"[0, 0, 1, 0, 0, 1, 0, 1]","[0, 0, 1, 0, 0, 1, 0, 1]"
arco_trionfo4.jpg,AAA647HVWAZDFWHD,"[0, 0, 0, 0, 1, 0, 1, 0]",EEA7BB2YTELXEB7Z,"[1, 1, 1, 0, 0, 0, 0, 1]","[1, 1, 1, 0, 0, 0, 0, 1]"
arco_trionfo10.jpg,AAA6S6HV6AZDFWHD,"[0, 0, 0, 0, 1, 0, 1, 0]",EEA2PQY4TDLFJM3S,"[0, 0, 1, 1, 1, 0, 1, 0]","[0, 0, 1, 1, 1, 0, 1, 0]"
arco_trionfo5.jpg,AAA765HVWAZDFWHD,"[0, 0, 0, 0, 1, 0, 1, 1]",EEAYWOTMUF7KKVUK,"[0, 1, 0, 1, 0, 1, 0, 0]","[0, 1, 0, 1, 0, 1, 0, 0]"
arco_trionfo2.jpg,AAA564X5WEZDFWHD,"[0, 0, 0, 0, 1, 1, 0, 0]",EEAYIOJ7W2NZRQYO,"[0, 1, 1, 0, 0, 0, 0, 1]","[0, 1, 1, 0, 0, 0, 0, 1]"
arco_trionfo7.jpg,AAA7U6HVYYZDFWHD,"[0, 0, 0, 0, 1, 0, 1, 1]",EEA35PCJWOVETJDE,"[0, 0, 1, 1, 0, 1, 0, 0]","[0, 0, 1, 1, 0, 1, 0, 0]"
arco_trionfo14.jpg,AAA5IXHVWAZDFWHD,"[0, 0, 0, 0, 1, 1, 1, 0]",EEAZJNK33CZBH2AP,"[1, 0, 1, 1, 0, 0, 0, 0]","[1, 0, 1, 1, 0, 0, 0, 0]"
arco_trionfo0.jpg,AAA5W5H5WQZDFWHD,"[0, 0, 0, 0, 1, 1, 0, 0]",EEAZTZRERZPBRWLZ,"[0, 0, 1, 0, 0, 1, 0, 0]","[0, 0, 1, 0, 0, 1, 0, 0]"
