,altare_della_patria6.jpg,altare_della_patria4.jpg,altare_della_patria11.jpg,altare_della_patria12.jpg,altare_della_patria3.jpg,altare_della_patria1.jpg,altare_della_patria14.jpg,altare_della_patria10.jpg,altare_della_patria9.jpg,altare_della_patria5.jpg,altare_della_patria7.jpg,altare_della_patria0.jpg,altare_della_patria13.jpg,altare_della_patria2.jpg,altare_della_patria8.jpg
Type,Meta,Meta,Meta,Meta,Meta,Meta,Meta,Meta,Meta,Meta,Meta,Meta,Meta,Meta,Meta
altare_della_patria6.jpg,0,5,4,2,4,3,5,5,4,2,5,4,5,2,2
altare_della_patria4.jpg,5,0,2,6,5,3,3,2,2,4,4,3,5,4,4
altare_della_patria11.jpg,4,2,0,5,4,1,3,3,3,5,5,3,4,3,3
altare_della_patria12.jpg,2,6,5,0,5,5,6,6,5,4,7,6,5,3,4
altare_della_patria3.jpg,4,5,4,5,0,3,3,5,5,4,4,4,3,5,2
altare_della_patria1.jpg,3,3,1,5,3,0,2,3,4,4,4,2,4,4,2
altare_della_patria14.jpg,5,3,3,6,3,2,0,3,4,4,4,4,4,6,4
altare_della_patria10.jpg,5,2,3,6,5,3,3,0,3,4,4,4,4,5,4
altare_della_patria9.jpg,4,2,3,5,5,4,4,3,0,3,4,5,4,4,3
altare_della_patria5.jpg,2,4,5,4,4,4,4,4,3,0,3,5,6,4,2
altare_della_patria7.jpg,5,4,5,7,4,4,4,4,4,3,0,4,6,6,3
altare_della_patria0.jpg,4,3,3,6,4,2,4,4,5,5,4,0,5,5,3
altare_della_patria13.jpg,5,5,4,5,3,4,4,4,4,6,6,5,0,4,4
altare_della_patria2.jpg,2,4,3,3,5,4,6,5,4,4,6,5,4,0,4
altare_della_patria8.jpg,2,4,3,4,2,2,4,4,3,2,3,3,4,4,0
Type,Content,Content,Content,Content,Content,Content,Content,Content,Content,Content,Content,Content,Content,Content,Content
altare_della_patria6.jpg,0,13,13,12,13,13,13,11,13,12,13,13,13,13,13
altare_della_patria4.jpg,13,0,11,12,13,13,12,12,13,13,12,13,11,13,12
altare_della_patria11.jpg,13,11,0,13,12,13,11,12,12,13,13,13,13,12,13
altare_della_patria12.jpg,12,12,13,0,12,13,13,11,12,13,11,12,13,13,12
altare_della_patria3.jpg,13,13,12,12,0,11,11,13,13,12,13,13,11,13,12
altare_della_patria1.jpg,13,13,13,13,11,0,12,13,13,12,12,12,12,13,12
altare_della_patria14.jpg,13,12,11,13,11,12,0,13,11,12,12,13,12,13,12
altare_della_patria10.jpg,11,12,12,11,13,13,13,0,13,12,13,12,13,13,13
altare_della_patria9.jpg,13,13,12,12,13,13,11,13,0,13,12,13,13,13,13
altare_della_patria5.jpg,12,13,13,13,12,12,12,12,13,0,13,13,12,13,12
altare_della_patria7.jpg,13,12,13,11,13,12,12,13,12,13,0,12,12,13,13
altare_della_patria0.jpg,13,13,13,12,13,12,13,12,13,13,12,0,13,12,13
altare_della_patria13.jpg,13,11,13,13,11,12,12,13,13,12,12,13,0,13,13
altare_della_patria2.jpg,13,13,12,13,13,13,13,13,13,13,13,12,13,0,13
altare_della_patria8.jpg,13,12,13,12,12,12,12,13,13,12,13,13,13,13,0
Type,Final-R,Final-R,Final-R,Final-R,Final-R,Final-R,Final-R,Final-R,Final-R,Final-R,Final-R,Final-R,Final-R,Final-R,Final-R
altare_della_patria6.jpg,0,10,8,4,8,6,10,10,8,4,10,8,10,4,4
altare_della_patria4.jpg,10,0,4,12,10,6,6,4,4,8,8,6,10,8,8
altare_della_patria11.jpg,8,4,0,10,8,2,6,6,6,10,10,6,8,6,6
altare_della_patria12.jpg,4,12,10,0,10,10,12,12,10,8,14,12,10,6,8
altare_della_patria3.jpg,8,10,8,10,0,6,6,10,10,8,8,8,6,10,4
altare_della_patria1.jpg,6,6,2,10,6,0,4,6,8,8,8,4,8,8,4
altare_della_patria14.jpg,10,6,6,12,6,4,0,6,8,8,8,8,8,12,8
altare_della_patria10.jpg,10,4,6,12,10,6,6,0,6,8,8,8,8,10,8
altare_della_patria9.jpg,8,4,6,10,10,8,8,6,0,6,8,10,8,8,6
altare_della_patria5.jpg,4,8,10,8,8,8,8,8,6,0,6,10,12,8,4
altare_della_patria7.jpg,10,8,10,14,8,8,8,8,8,6,0,8,12,12,6
altare_della_patria0.jpg,8,6,6,12,8,4,8,8,10,10,8,0,10,10,6
altare_della_patria13.jpg,10,10,8,10,6,8,8,8,8,12,12,10,0,8,8
altare_della_patria2.jpg,4,8,6,6,10,8,12,10,8,8,12,10,8,0,8
altare_della_patria8.jpg,4,8,6,8,4,4,8,8,6,4,6,6,8,8,0
