Img-Name,Meta,R-Meta,Content,R-Content,Final-R
lavorare_preferisco_mare7.jpg,AAA3NWLA5SRSFB3B,"[0, 1, 1, 1, 0, 0, 0, 1, 0, 0, 0, 0, 0, 0, 0, 0]",EEA65CAXNFGOMC3N,"[0, 0, 0, 1, 0, 1, 1, 0, 1, 0, 0, 0, 0, 0, 1, 1]","[0, 0, 0, 1, 0, 1, 1, 0, 1, 0, 0, 0, 0, 0, 1, 1]"
lavorare_preferisco_mare6.jpg,AAASN6LA7SRSFB3B,"[0, 1, 1, 1, 0, 0, 1, 0, 0, 0, 0, 0, 0, 0, 0, 0]",EEA7IGFPKL4HMA7I,"[1, 1, 0, 0, 0, 1, 0, 1, 1, 1, 0, 0, 1, 0, 0, 0]","[1, 1, 0, 0, 0, 1, 0, 1, 1, 1, 0, 0, 1, 0, 0, 0]"
lavorare_preferisco_mare4.jpg,AAARN6LA7SRSFB3B,"[0, 1, 1, 1, 0, 0, 1, 0, 0, 0, 0, 0, 0, 0, 0, 0]",EEA2VVBVFNRLOA3O,"[0, 1, 1, 0, 0, 1, 1, 0, 0, 0, 0, 0, 1, 0, 1, 1]","[0, 1, 1, 0, 0, 1, 1, 0, 0, 0, 0, 0, 1, 0, 1, 1]"
lavorare_preferisco_mare1.jpg,AAAYNWLA5CRSFB3B,"[0, 1, 1, 1, 0, 0, 0, 1, 0, 1, 0, 0, 0, 0, 0, 0]",EEA5LDRZLIUXSZMY,"[0, 0, 0, 0, 1, 1, 0, 0, 1, 1, 1, 0, 0, 0, 0, 0]","[0, 0, 0, 0, 1, 1, 0, 0, 1, 1, 1, 0, 0, 0, 0, 0]"
lavorare_preferisco_mare11.jpg,AAAYN63A7CRSFB3B,"[0, 1, 1, 1, 0, 0, 1, 0, 0, 1, 0, 0, 0, 0, 0, 0]",EEA3XLHTEXZCJETB,"[0, 0, 1, 1, 1, 1, 0, 0, 1, 0, 0, 0, 1, 0, 0, 0]","[0, 0, 1, 1, 1, 1, 0, 0, 1, 0, 0, 0, 1, 0, 0, 0]"
lavorare_preferisco_mare10.jpg,AAAYN6TA5SRSFB3B,"[0, 1, 1, 1, 0, 0, 1, 0, 0, 1, 0, 0, 0, 0, 0, 0]",EEA4VD24PUQ5QN4I,"[0, 0, 0, 0, 1, 1, 0, 0, 0, 1, 0, 0, 0, 0, 1, 0]","[0, 0, 0, 0, 1, 1, 0, 0, 0, 1, 0, 0, 0, 0, 1, 0]"
lavorare_preferisco_mare9.jpg,AAAYPG3A7CRSFB3B,"[0, 1, 1, 1, 0, 0, 0, 1, 0, 1, 0, 0, 0, 0, 0, 0]",EEA5D7FBCPWWATZR,"[1, 0, 1, 0, 1, 1, 0, 1, 0, 0, 0, 0, 0, 0, 0, 0]","[1, 0, 1, 0, 1, 1, 0, 1, 0, 0, 0, 0, 0, 0, 0, 0]"
lavorare_preferisco_mare13.jpg,AAAYF63A5CRSFB3B,"[0, 1, 1, 1, 0, 0, 1, 0, 0, 1, 0, 0, 0, 0, 0, 0]",EEA7ZIUHKLNBPCHY,"[0, 0, 1, 1, 0, 1, 0, 1, 1, 1, 0, 0, 1, 0, 0, 0]","[0, 0, 1, 1, 0, 1, 0, 1, 1, 1, 0, 0, 1, 0, 0, 0]"
lavorare_preferisco_mare12.jpg,AAAZN63A7GRSFB3B,"[0, 1, 1, 1, 0, 0, 1, 1, 0, 0, 1, 0, 0, 0, 0, 0]",EEA4IWZOPM4TB5JE,"[0, 0, 0, 0, 1, 1, 0, 1, 0, 0, 0, 0, 0, 1, 0, 1]","[0, 0, 0, 0, 1, 1, 0, 1, 0, 0, 0, 0, 0, 1, 0, 1]"
lavorare_preferisco_mare3.jpg,AAAYH6ZQ7CRSFB3B,"[0, 1, 1, 1, 0, 0, 1, 0, 0, 1, 0, 0, 0, 0, 0, 0]",EEAZPDTIHA7GTVZE,"[0, 1, 0, 0, 1, 1, 1, 1, 0, 1, 1, 0, 0, 0, 0, 0]","[0, 1, 0, 0, 1, 1, 1, 1, 0, 1, 1, 0, 0, 0, 0, 0]"
lavorare_preferisco_mare5.jpg,AAAYNG3A5CRSFB3B,"[0, 1, 1, 1, 0, 0, 0, 1, 0, 1, 0, 0, 0, 0, 0, 0]",EEA4AT6PLUPSTKEK,"[1, 0, 0, 1, 1, 1, 0, 0, 0, 0, 0, 1, 0, 0, 0, 0]","[1, 0, 0, 1, 1, 1, 0, 0, 0, 0, 0, 1, 0, 0, 0, 0]"
lavorare_preferisco_mare8.jpg,AAAYNW3A5CRSFB3B,"[0, 1, 1, 1, 0, 0, 0, 1, 0, 1, 0, 0, 0, 0, 0, 0]",EEA7R5EHAPNF4EGL,"[1, 0, 0, 0, 0, 1, 1, 1, 1, 0, 0, 0, 1, 0, 0, 0]","[1, 0, 0, 0, 0, 1, 1, 1, 1, 0, 0, 0, 1, 0, 0, 0]"
lavorare_preferisco_mare0.jpg,AAA3N63A7SRSFB3B,"[0, 1, 1, 1, 0, 0, 1, 0, 0, 0, 0, 0, 0, 0, 0, 0]",EEA7JANCEPOHNBL6,"[1, 1, 1, 1, 0, 1, 1, 1, 1, 0, 0, 0, 0, 0, 0, 0]","[1, 1, 1, 1, 0, 1, 1, 1, 1, 0, 0, 0, 0, 0, 0, 0]"
lavorare_preferisco_mare2.jpg,AAA2NO3A5GRSFB3B,"[0, 1, 1, 1, 0, 0, 0, 1, 0, 0, 0, 0, 0, 0, 0, 1]",EEAZB7UFBJZN4Y7B,"[0, 0, 1, 0, 0, 1, 1, 1, 0, 1, 1, 0, 0, 0, 1, 0]","[0, 0, 1, 0, 0, 1, 1, 1, 0, 1, 1, 0, 0, 0, 1, 0]"
lavorare_preferisco_mare14.jpg,AAAZN6LA5SRSFB3B,"[0, 1, 1, 1, 0, 0, 1, 0, 0, 0, 1, 0, 0, 0, 0, 0]",EEA7R2MDAXPPOAMK,"[1, 1, 1, 0, 1, 1, 0, 1, 1, 0, 0, 1, 0, 0, 0, 0]","[1, 1, 1, 0, 1, 1, 0, 1, 1, 0, 0, 1, 0, 0, 0, 0]"
