Img-Name,SHA256,Final-R
notte_stellata_vangog2.jpg,4f12a472ca23c98abb9d8556ff10ce45c0fe35b1344eebe6b0865292d6ff3ce1,"[0, 1, 1, 0, 0, 1, 1, 0]"
notte_stellata_vangog0.jpg,4e870e03cec37764bfb2e426162a5dd0104e63f45f1dc750c888bf83f4cfaf71,"[1, 1, 0, 1, 1, 0, 1, 0]"
notte_stellata_vangog7.jpg,5b237caf9f995a3833e51311dea6aadc1f29342f3a999a182828e6603766ec50,"[1, 1, 0, 0, 1, 0, 0, 1]"
notte_stellata_vangog3.jpg,9c57092d8a211248285c98ccd4edb602a7337e6b34a42dd2f1de6ba9ac282948,"[1, 1, 1, 1, 1, 1, 0, 0]"
notte_stellata_vangog10.jpg,3bed80765fcc6a4a8a9ab954badb69ecbf4b0110c9f3d9b8d33679a0263b325b,"[1, 0, 1, 1, 1, 0, 1, 0]"
notte_stellata_vangog5.jpg,517e3bc560aa13154eb8171f5b84094fbe094a37123ca4156a91dedc7abad2e2,"[0, 0, 1, 0, 1, 1, 0, 1]"
notte_stellata_vangog13.jpg,00d71aabe5ac250f3985b21b8b5d5cb03bd1ca7a4172e9e07e0c3dfa156b9833,"[1, 0, 1, 1, 0, 0, 0, 1]"
notte_stellata_vangog14.jpg,9022b824aa2fbdc13b2fc936b738594e0a40cefa12f5ebcd516823981562c462,"[1, 1, 1, 0, 1, 1, 1, 0]"
notte_stellata_vangog4.jpg,a58a8b0e48c09d3d86c5a35401c9b4e10c70b57faa09b09effcd50c5aca4655b,"[0, 1, 0, 1, 1, 1, 1, 1]"
notte_stellata_vangog6.jpg,84e444eaa4b5bb26e8efc4a0431d06b93340c67dca9024b493880241a1152323,"[1, 1, 1, 1, 1, 1, 1, 0]"
notte_stellata_vangog11.jpg,bc1ad0bc19fb6a2106b9809648d369b3ecc1701c04e077fd6a8fa0e89d3e0942,"[1, 1, 1, 1, 1, 1, 1, 0]"
notte_stellata_vangog8.jpg,e981705ef0456dd3909efdeeaf5d290758aba6b4959d8ee02f10a18696689c9f,"[1, 0, 0, 1, 1, 0, 1, 1]"
notte_stellata_vangog12.jpg,644c070e0a9fc398f6199e978e4fe9729d2f63299c41720c3eafb5b911b15f05,"[1, 1, 1, 0, 1, 1, 1, 1]"
notte_stellata_vangog9.jpg,5765aa28fa3830c06fcfe5c841fca31844c8a78bed38e7c523f7d142457e7ef4,"[1, 0, 1, 1, 1, 1, 0, 0]"
notte_stellata_vangog1.jpg,4ac38405a0233f0268c3b0212f21b36aba5e2986a93d2835a72eea6ea798eafc,"[0, 1, 1, 0, 1, 1, 1, 0]"
