,pietà_mic14.jpg,pietà_mic6.jpg,pietà_mic9.jpg,pietà_mic7.jpg,pietà_mic2.jpg,pietà_mic4.jpg,pietà_mic1.jpg,pietà_mic13.jpg,pietà_mic10.jpg,pietà_mic11.jpg,pietà_mic3.jpg,pietà_mic5.jpg,pietà_mic0.jpg,pietà_mic8.jpg,pietà_mic12.jpg
Type,SHA256,SHA256,SHA256,SHA256,SHA256,SHA256,SHA256,SHA256,SHA256,SHA256,SHA256,SHA256,SHA256,SHA256,SHA256
pietà_mic14.jpg,0,57,62,62,60,62,63,59,60,61,61,62,60,63,61
pietà_mic6.jpg,57,0,57,61,63,59,62,59,62,60,63,63,59,62,62
pietà_mic9.jpg,62,57,0,60,61,59,61,60,60,57,62,60,59,62,59
pietà_mic7.jpg,62,61,60,0,58,59,58,58,64,59,63,62,64,59,60
pietà_mic2.jpg,60,63,61,58,0,61,60,60,58,60,60,57,60,60,59
pietà_mic4.jpg,62,59,59,59,61,0,59,61,61,61,57,62,56,60,60
pietà_mic1.jpg,63,62,61,58,60,59,0,62,61,60,58,59,61,59,59
pietà_mic13.jpg,59,59,60,58,60,61,62,0,61,62,62,59,62,61,63
pietà_mic10.jpg,60,62,60,64,58,61,61,61,0,59,61,60,59,60,60
pietà_mic11.jpg,61,60,57,59,60,61,60,62,59,0,63,60,61,60,55
pietà_mic3.jpg,61,63,62,63,60,57,58,62,61,63,0,64,58,61,62
pietà_mic5.jpg,62,63,60,62,57,62,59,59,60,60,64,0,58,62,58
pietà_mic0.jpg,60,59,59,64,60,56,61,62,59,61,58,58,0,62,62
pietà_mic8.jpg,63,62,62,59,60,60,59,61,60,60,61,62,62,0,60
pietà_mic12.jpg,61,62,59,60,59,60,59,63,60,55,62,58,62,60,0
Type,Final-R,Final-R,Final-R,Final-R,Final-R,Final-R,Final-R,Final-R,Final-R,Final-R,Final-R,Final-R,Final-R,Final-R,Final-R
pietà_mic14.jpg,0,4,6,8,4,7,8,5,7,8,9,6,8,7,8
pietà_mic6.jpg,4,0,8,8,6,9,6,5,7,10,7,8,8,9,10
pietà_mic9.jpg,6,8,0,6,6,7,6,7,5,10,11,6,8,9,10
pietà_mic7.jpg,8,8,6,0,8,11,6,11,11,8,11,8,10,9,10
pietà_mic2.jpg,4,6,6,8,0,5,8,5,9,6,5,2,8,7,8
pietà_mic4.jpg,7,9,7,11,5,0,7,6,8,5,4,5,7,10,5
pietà_mic1.jpg,8,6,6,6,8,7,0,9,7,10,7,8,8,13,8
pietà_mic13.jpg,5,5,7,11,5,6,9,0,6,7,8,7,7,8,9
pietà_mic10.jpg,7,7,5,11,9,8,7,6,0,9,10,7,9,8,11
pietà_mic11.jpg,8,10,10,8,6,5,10,7,9,0,7,6,10,7,8
pietà_mic3.jpg,9,7,11,11,5,4,7,8,10,7,0,5,7,8,5
pietà_mic5.jpg,6,8,6,8,2,5,8,7,7,6,5,0,10,5,8
pietà_mic0.jpg,8,8,8,10,8,7,8,7,9,10,7,10,0,7,4
pietà_mic8.jpg,7,9,9,9,7,10,13,8,8,7,8,5,7,0,7
pietà_mic12.jpg,8,10,10,10,8,5,8,9,11,8,5,8,4,7,0
