,taj_mahal10.jpg,taj_mahal7.jpg,taj_mahal9.jpg,taj_mahal2.jpg,taj_mahal0.jpg,taj_mahal8.jpg,taj_mahal12.jpg,taj_mahal1.jpg,taj_mahal11.jpg,taj_mahal5.jpg,taj_mahal13.jpg,taj_mahal14.jpg,taj_mahal6.jpg,taj_mahal4.jpg,taj_mahal3.jpg
Type,SHA256,SHA256,SHA256,SHA256,SHA256,SHA256,SHA256,SHA256,SHA256,SHA256,SHA256,SHA256,SHA256,SHA256,SHA256
taj_mahal10.jpg,0,63,59,61,61,62,60,57,58,58,64,61,61,58,61
taj_mahal7.jpg,63,0,57,63,59,60,60,59,59,60,57,61,61,61,64
taj_mahal9.jpg,59,57,0,61,61,56,63,60,59,63,59,57,61,59,63
taj_mahal2.jpg,61,63,61,0,59,63,57,58,61,59,64,62,55,59,63
taj_mahal0.jpg,61,59,61,59,0,61,57,61,59,60,60,58,61,64,57
taj_mahal8.jpg,62,60,56,63,61,0,62,59,60,62,61,60,60,62,60
taj_mahal12.jpg,60,60,63,57,57,62,0,59,60,59,59,62,60,63,63
taj_mahal1.jpg,57,59,60,58,61,59,59,0,60,61,64,62,62,60,62
taj_mahal11.jpg,58,59,59,61,59,60,60,60,0,64,61,59,58,59,57
taj_mahal5.jpg,58,60,63,59,60,62,59,61,64,0,61,62,60,56,60
taj_mahal13.jpg,64,57,59,64,60,61,59,64,61,61,0,62,57,61,62
taj_mahal14.jpg,61,61,57,62,58,60,62,62,59,62,62,0,60,58,56
taj_mahal6.jpg,61,61,61,55,61,60,60,62,58,60,57,60,0,60,58
taj_mahal4.jpg,58,61,59,59,64,62,63,60,59,56,61,58,60,0,61
taj_mahal3.jpg,61,64,63,63,57,60,63,62,57,60,62,56,58,61,0
Type,Final-R,Final-R,Final-R,Final-R,Final-R,Final-R,Final-R,Final-R,Final-R,Final-R,Final-R,Final-R,Final-R,Final-R,Final-R
taj_mahal10.jpg,0,4,8,6,4,5,6,7,8,8,7,6,8,5,5
taj_mahal7.jpg,4,0,6,4,4,7,6,5,8,8,7,6,8,5,5
taj_mahal9.jpg,8,6,0,8,6,5,6,7,8,4,5,6,6,5,5
taj_mahal2.jpg,6,4,8,0,6,7,4,5,6,8,7,4,6,5,5
taj_mahal0.jpg,4,4,6,6,0,3,6,7,6,6,7,6,8,7,5
taj_mahal8.jpg,5,7,5,7,3,0,7,6,5,5,6,7,7,6,6
taj_mahal12.jpg,6,6,6,4,6,7,0,7,6,8,7,6,6,5,7
taj_mahal1.jpg,7,5,7,5,7,6,7,0,5,5,4,7,5,6,4
taj_mahal11.jpg,8,8,8,6,6,5,6,5,0,6,3,4,2,7,5
taj_mahal5.jpg,8,8,4,8,6,5,8,5,6,0,5,6,6,5,5
taj_mahal13.jpg,7,7,5,7,7,6,7,4,3,5,0,3,1,4,4
taj_mahal14.jpg,6,6,6,4,6,7,6,7,4,6,3,0,2,5,5
taj_mahal6.jpg,8,8,6,6,8,7,6,5,2,6,1,2,0,5,5
taj_mahal4.jpg,5,5,5,5,7,6,5,6,7,5,4,5,5,0,6
taj_mahal3.jpg,5,5,5,5,5,6,7,4,5,5,4,5,5,6,0
