,monalisa11.jpg,monalisa13.jpg,monalisa2.jpg,monalisa12.jpg,monalisa6.jpg,monalisa1.jpg,monalisa4.jpg,monalisa0.jpg,monalisa10.jpg,monalisa7.jpg,monalisa14.jpg,monalisa5.jpg,monalisa3.jpg,monalisa8.jpg,monalisa9.jpg
Type,Meta,Meta,Meta,Meta,Meta,Meta,Meta,Meta,Meta,Meta,Meta,Meta,Meta,Meta,Meta
monalisa11.jpg,0,4,6,6,5,0,5,3,4,6,3,6,5,6,5
monalisa13.jpg,4,0,5,4,6,4,4,3,4,6,4,6,5,6,6
monalisa2.jpg,6,5,0,5,6,6,5,5,5,6,6,6,5,5,6
monalisa12.jpg,6,4,5,0,5,6,4,6,2,5,5,4,5,5,5
monalisa6.jpg,5,6,6,5,0,5,5,4,4,4,5,5,4,5,5
monalisa1.jpg,0,4,6,6,5,0,5,3,4,6,3,6,5,6,5
monalisa4.jpg,5,4,5,4,5,5,0,4,4,5,5,5,6,4,5
monalisa0.jpg,3,3,5,6,4,3,4,0,4,6,4,6,4,5,6
monalisa10.jpg,4,4,5,2,4,4,4,4,0,5,3,5,5,5,5
monalisa7.jpg,6,6,6,5,4,6,5,6,5,0,6,5,5,5,4
monalisa14.jpg,3,4,6,5,5,3,5,4,3,6,0,5,5,5,5
monalisa5.jpg,6,6,6,4,5,6,5,6,5,5,5,0,4,5,5
monalisa3.jpg,5,5,5,5,4,5,6,4,5,5,5,4,0,6,6
monalisa8.jpg,6,6,5,5,5,6,4,5,5,5,5,5,6,0,4
monalisa9.jpg,5,6,6,5,5,5,5,6,5,4,5,5,6,4,0
Type,R-Meta,R-Meta,R-Meta,R-Meta,R-Meta,R-Meta,R-Meta,R-Meta,R-Meta,R-Meta,R-Meta,R-Meta,R-Meta,R-Meta,R-Meta
monalisa11.jpg,0,4,4,4,2,0,4,2,2,4,2,4,2,4,2
monalisa13.jpg,4,0,4,2,4,4,2,4,4,2,4,4,4,4,4
monalisa2.jpg,4,4,0,4,4,4,4,4,4,4,4,4,4,2,4
monalisa12.jpg,4,2,4,0,4,4,2,4,2,4,4,4,4,4,4
monalisa6.jpg,2,4,4,4,0,2,4,2,2,4,2,4,2,4,4
monalisa1.jpg,0,4,4,4,2,0,4,2,2,4,2,4,2,4,2
monalisa4.jpg,4,2,4,2,4,4,0,4,4,4,4,4,4,2,4
monalisa0.jpg,2,4,4,4,2,2,4,0,2,4,2,4,2,4,4
monalisa10.jpg,2,4,4,2,2,2,4,2,0,4,2,4,2,4,4
monalisa7.jpg,4,2,4,4,4,4,4,4,4,0,4,4,4,4,4
monalisa14.jpg,2,4,4,4,2,2,4,2,2,4,0,2,2,4,4
monalisa5.jpg,4,4,4,4,4,4,4,4,4,4,2,0,4,4,4
monalisa3.jpg,2,4,4,4,2,2,4,2,2,4,2,4,0,4,4
monalisa8.jpg,4,4,2,4,4,4,2,4,4,4,4,4,4,0,4
monalisa9.jpg,2,4,4,4,4,2,4,4,4,4,4,4,4,4,0
Type,Content,Content,Content,Content,Content,Content,Content,Content,Content,Content,Content,Content,Content,Content,Content
monalisa11.jpg,0,10,13,10,10,6,5,5,12,7,13,7,11,5,11
monalisa13.jpg,10,0,11,12,10,9,7,8,13,9,13,10,11,9,11
monalisa2.jpg,13,11,0,13,12,12,12,13,9,12,13,13,12,12,12
monalisa12.jpg,10,12,13,0,12,11,10,10,11,12,11,11,12,11,13
monalisa6.jpg,10,10,12,12,0,10,10,10,12,11,13,12,13,10,13
monalisa1.jpg,6,9,12,11,10,0,5,7,12,7,13,5,11,2,11
monalisa4.jpg,5,7,12,10,10,5,0,2,12,6,13,5,11,5,11
monalisa0.jpg,5,8,13,10,10,7,2,0,12,8,13,4,11,7,11
monalisa10.jpg,12,13,9,11,12,12,12,12,0,12,13,12,13,12,13
monalisa7.jpg,7,9,12,12,11,7,6,8,12,0,13,9,9,7,12
monalisa14.jpg,13,13,13,11,13,13,13,13,13,13,0,13,13,13,13
monalisa5.jpg,7,10,13,11,12,5,5,4,12,9,13,0,11,5,10
monalisa3.jpg,11,11,12,12,13,11,11,11,13,9,13,11,0,11,10
monalisa8.jpg,5,9,12,11,10,2,5,7,12,7,13,5,11,0,11
monalisa9.jpg,11,11,12,13,13,11,11,11,13,12,13,10,10,11,0
Type,R-Content,R-Content,R-Content,R-Content,R-Content,R-Content,R-Content,R-Content,R-Content,R-Content,R-Content,R-Content,R-Content,R-Content,R-Content
monalisa11.jpg,0,8,8,6,6,1,4,4,6,6,7,5,8,1,8
monalisa13.jpg,8,0,6,8,8,7,8,8,8,8,7,7,8,7,4
monalisa2.jpg,8,6,0,8,8,7,8,8,6,8,7,7,8,7,6
monalisa12.jpg,6,8,8,0,6,5,6,6,6,8,7,5,8,5,8
monalisa6.jpg,6,8,8,6,0,5,6,6,6,8,7,5,8,5,8
monalisa1.jpg,1,7,7,5,5,0,5,5,5,5,6,4,7,0,7
monalisa4.jpg,4,8,8,6,6,5,0,2,6,6,7,3,8,5,8
monalisa0.jpg,4,8,8,6,6,5,2,0,6,8,7,3,8,5,8
monalisa10.jpg,6,8,6,6,6,5,6,6,0,8,7,5,8,5,8
monalisa7.jpg,6,8,8,8,8,5,6,8,8,0,7,7,4,5,8
monalisa14.jpg,7,7,7,7,7,6,7,7,7,7,0,6,7,6,7
monalisa5.jpg,5,7,7,5,5,4,3,3,5,7,6,0,7,4,7
monalisa3.jpg,8,8,8,8,8,7,8,8,8,4,7,7,0,7,8
monalisa8.jpg,1,7,7,5,5,0,5,5,5,5,6,4,7,0,7
monalisa9.jpg,8,4,6,8,8,7,8,8,8,8,7,7,8,7,0
Type,Final-R,Final-R,Final-R,Final-R,Final-R,Final-R,Final-R,Final-R,Final-R,Final-R,Final-R,Final-R,Final-R,Final-R,Final-R
monalisa11.jpg,0,4,4,4,2,0,4,2,2,4,2,4,2,4,2
monalisa13.jpg,4,0,4,2,4,4,2,4,4,2,4,4,4,4,4
monalisa2.jpg,4,4,0,4,4,4,4,4,4,4,4,4,4,2,4
monalisa12.jpg,4,2,4,0,4,4,2,4,2,4,4,4,4,4,4
monalisa6.jpg,2,4,4,4,0,2,4,2,2,4,2,4,2,4,4
monalisa1.jpg,0,4,4,4,2,0,4,2,2,4,2,4,2,4,2
monalisa4.jpg,4,2,4,2,4,4,0,4,4,4,4,4,4,2,4
monalisa0.jpg,2,4,4,4,2,2,4,0,2,4,2,4,2,4,4
monalisa10.jpg,2,4,4,2,2,2,4,2,0,4,2,4,2,4,4
monalisa7.jpg,4,2,4,4,4,4,4,4,4,0,4,4,4,4,4
monalisa14.jpg,2,4,4,4,2,2,4,2,2,4,0,2,2,4,4
monalisa5.jpg,4,4,4,4,4,4,4,4,4,4,2,0,4,4,4
monalisa3.jpg,2,4,4,4,2,2,4,2,2,4,2,4,0,4,4
monalisa8.jpg,4,4,2,4,4,4,2,4,4,4,4,4,4,0,4
monalisa9.jpg,2,4,4,4,4,2,4,4,4,4,4,4,4,4,0
