Img-Name,Meta,R-Meta,Content,R-Content,Final-R
taj_mahal10.jpg,AAA777B7KQZLGBLT,"[0, 1, 1, 0, 1, 0, 0, 1]",EEA2N52NBDSRVI4W,"[0, 1, 1, 0, 1, 1, 1, 1]","[0, 1, 1, 0, 1, 1, 1, 1]"
taj_mahal7.jpg,AAA7A7JTLUZLGBLT,"[0, 1, 1, 0, 1, 1, 0, 1]",EEA5RM2NU3RHTQYY,"[1, 1, 0, 1, 0, 1, 1, 0]","[1, 1, 0, 1, 0, 1, 1, 0]"
taj_mahal9.jpg,AAA7F7B56QZLGBLT,"[0, 1, 1, 0, 1, 1, 0, 1]",EEA5LZ4ADTYPCONU,"[1, 1, 1, 0, 1, 1, 0, 1]","[1, 1, 1, 0, 1, 1, 0, 1]"
taj_mahal2.jpg,AAA6U7LTOQZLGBLT,"[0, 1, 1, 0, 1, 0, 1, 1]",EEA2RP2DBTZMM6FF,"[1, 0, 1, 0, 1, 1, 1, 0]","[1, 0, 1, 0, 1, 1, 1, 0]"
taj_mahal0.jpg,AAA6G7B3LQZLGBLT,"[0, 1, 1, 1, 1, 0, 1, 1]",EEA3QEKPG3SRX4YM,"[1, 0, 1, 1, 1, 1, 0, 0]","[1, 0, 1, 1, 1, 1, 0, 0]"
taj_mahal8.jpg,AAA7F7JROUZLGBLT,"[0, 1, 1, 0, 1, 1, 0, 1]",EEAZBAY5XF3S7ATZ,"[0, 1, 1, 1, 0, 1, 1, 0]","[0, 1, 1, 1, 0, 1, 1, 0]"
taj_mahal12.jpg,AAA7H6LPOUZLGBLT,"[1, 1, 1, 0, 1, 1, 1, 1]",EEAZQO2E4YPXDC24,"[1, 1, 1, 1, 1, 1, 0, 1]","[1, 1, 1, 1, 1, 1, 0, 1]"
taj_mahal1.jpg,AAA7E4L7KQZLGBLT,"[0, 1, 1, 0, 1, 0, 0, 1]",EEA3LI22BW2GQN4T,"[0, 1, 1, 1, 1, 1, 1, 1]","[0, 1, 1, 1, 1, 1, 1, 1]"
taj_mahal11.jpg,AAA7F5L7KUZLGBLT,"[0, 1, 1, 0, 1, 1, 0, 1]",EEA43ZQY6MEMMX4M,"[1, 1, 1, 0, 1, 1, 0, 0]","[1, 1, 1, 0, 1, 1, 0, 0]"
taj_mahal5.jpg,AAA4B5BZOQZLGBLT,"[0, 1, 1, 0, 1, 1, 0, 0]",EEA2FLWXJEGNFKLV,"[1, 0, 1, 1, 1, 1, 1, 0]","[1, 0, 1, 1, 1, 1, 1, 0]"
taj_mahal13.jpg,AAA6H7B76QZLGBLT,"[0, 1, 1, 0, 1, 0, 1, 1]",EEA43RR4YM6MGNGK,"[0, 0, 1, 1, 1, 1, 1, 0]","[0, 0, 1, 1, 1, 1, 1, 0]"
taj_mahal14.jpg,AAA7N7B73QZLGBLT,"[0, 1, 1, 0, 1, 0, 0, 1]",EEAZRI2WJ22OUTNY,"[0, 1, 1, 0, 1, 1, 0, 1]","[0, 1, 1, 0, 1, 1, 0, 1]"
taj_mahal6.jpg,AAA6C7JZKUZLGBLT,"[0, 1, 1, 0, 1, 1, 1, 1]",EEAYDJ5LLYCJL6TY,"[0, 1, 1, 0, 1, 1, 1, 0]","[0, 1, 1, 0, 1, 1, 1, 0]"
taj_mahal4.jpg,AAA7F7B57QZLGBLT,"[0, 1, 1, 0, 1, 1, 0, 1]",EEA4N6GHLAUPE2I6,"[1, 1, 1, 0, 1, 1, 1, 0]","[1, 1, 1, 0, 1, 1, 1, 0]"
taj_mahal3.jpg,AAA7G7BXOUZLGBLT,"[1, 1, 1, 0, 1, 1, 0, 1]",EEA5TIJO2YVCTVRZ,"[0, 1, 1, 1, 0, 1, 1, 1]","[0, 1, 1, 1, 0, 1, 1, 1]"
