,due_torri1.jpg,due_torri14.jpg,due_torri5.jpg,due_torri2.jpg,due_torri12.jpg,due_torri4.jpg,due_torri0.jpg,due_torri9.jpg,due_torri7.jpg,due_torri11.jpg,due_torri6.jpg,due_torri10.jpg,due_torri13.jpg,due_torri3.jpg,due_torri8.jpg
Type,SHA256,SHA256,SHA256,SHA256,SHA256,SHA256,SHA256,SHA256,SHA256,SHA256,SHA256,SHA256,SHA256,SHA256,SHA256
due_torri1.jpg,0,63,59,59,62,61,63,62,62,57,60,59,60,61,60
due_torri14.jpg,63,0,62,61,62,60,58,62,58,57,59,61,61,61,61
due_torri5.jpg,59,62,0,60,62,61,59,60,60,58,61,61,59,58,62
due_torri2.jpg,59,61,60,0,58,59,57,59,62,60,58,60,60,57,62
due_torri12.jpg,62,62,62,58,0,58,61,56,62,61,62,56,62,61,59
due_torri4.jpg,61,60,61,59,58,0,60,62,61,63,59,63,57,60,55
due_torri0.jpg,63,58,59,57,61,60,0,57,63,60,61,60,60,61,62
due_torri9.jpg,62,62,60,59,56,62,57,0,61,61,63,62,62,60,58
due_torri7.jpg,62,58,60,62,62,61,63,61,0,57,56,61,61,60,62
due_torri11.jpg,57,57,58,60,61,63,60,61,57,0,59,62,62,60,61
due_torri6.jpg,60,59,61,58,62,59,61,63,56,59,0,58,61,55,61
due_torri10.jpg,59,61,61,60,56,63,60,62,61,62,58,0,52,60,62
due_torri13.jpg,60,61,59,60,62,57,60,62,61,62,61,52,0,60,56
due_torri3.jpg,61,61,58,57,61,60,61,60,60,60,55,60,60,0,59
due_torri8.jpg,60,61,62,62,59,55,62,58,62,61,61,62,56,59,0
Type,Final-R,Final-R,Final-R,Final-R,Final-R,Final-R,Final-R,Final-R,Final-R,Final-R,Final-R,Final-R,Final-R,Final-R,Final-R
due_torri1.jpg,0,6,4,1,4,4,5,4,4,4,6,3,4,2,1
due_torri14.jpg,6,0,6,7,4,4,5,2,4,4,4,3,6,4,5
due_torri5.jpg,4,6,0,3,2,2,3,6,4,4,4,5,2,6,3
due_torri2.jpg,1,7,3,0,3,5,4,5,5,3,5,4,3,3,2
due_torri12.jpg,4,4,2,3,0,4,3,6,6,2,6,3,4,6,3
due_torri4.jpg,4,4,2,5,4,0,5,4,2,4,4,5,2,6,3
due_torri0.jpg,5,5,3,4,3,5,0,5,3,3,5,4,5,5,4
due_torri9.jpg,4,2,6,5,6,4,5,0,2,4,4,5,6,2,3
due_torri7.jpg,4,4,4,5,6,2,3,2,0,4,4,5,4,4,3
due_torri11.jpg,4,4,4,3,2,4,3,4,4,0,6,5,4,6,3
due_torri6.jpg,6,4,4,5,6,4,5,4,4,6,0,5,2,4,7
due_torri10.jpg,3,3,5,4,3,5,4,5,5,5,5,0,5,3,4
due_torri13.jpg,4,6,2,3,4,2,5,6,4,4,2,5,0,6,5
due_torri3.jpg,2,4,6,3,6,6,5,2,4,6,4,3,6,0,3
due_torri8.jpg,1,5,3,2,3,3,4,3,3,3,7,4,5,3,0
