,nettuno9.jpg,nettuno3.jpg,nettuno2.jpg,nettuno11.jpg,nettuno0.jpg,nettuno5.jpg,nettuno4.jpg,nettuno12.jpg,nettuno6.jpg,nettuno10.jpg,nettuno7.jpg,nettuno8.jpg,nettuno1.jpg,nettuno13.jpg,nettuno14.jpg
Type,Meta,Meta,Meta,Meta,Meta,Meta,Meta,Meta,Meta,Meta,Meta,Meta,Meta,Meta,Meta
nettuno9.jpg,0,5,3,7,4,5,3,4,3,2,6,3,6,5,4
nettuno3.jpg,5,0,3,5,6,5,4,6,3,6,5,3,5,6,6
nettuno2.jpg,3,3,0,6,5,6,3,4,4,4,5,2,5,4,5
nettuno11.jpg,7,5,6,0,6,5,6,6,7,7,5,6,4,6,5
nettuno0.jpg,4,6,5,6,0,3,5,6,4,3,4,5,6,5,4
nettuno5.jpg,5,5,6,5,3,0,5,7,5,4,4,6,6,6,5
nettuno4.jpg,3,4,3,6,5,5,0,4,4,5,5,3,5,5,5
nettuno12.jpg,4,6,4,6,6,7,4,0,6,5,6,4,6,2,6
nettuno6.jpg,3,3,4,7,4,5,4,6,0,4,6,3,6,6,4
nettuno10.jpg,2,6,4,7,3,4,5,5,4,0,5,4,6,3,3
nettuno7.jpg,6,5,5,5,4,4,5,6,6,5,0,5,5,5,6
nettuno8.jpg,3,3,2,6,5,6,3,4,3,4,5,0,5,4,5
nettuno1.jpg,6,5,5,4,6,6,5,6,6,6,5,5,0,6,4
nettuno13.jpg,5,6,4,6,5,6,5,2,6,3,5,4,6,0,5
nettuno14.jpg,4,6,5,5,4,5,5,6,4,3,6,5,4,5,0
Type,R-Meta,R-Meta,R-Meta,R-Meta,R-Meta,R-Meta,R-Meta,R-Meta,R-Meta,R-Meta,R-Meta,R-Meta,R-Meta,R-Meta,R-Meta
nettuno9.jpg,0,1,1,3,1,2,0,2,1,2,3,1,2,2,2
nettuno3.jpg,1,0,2,2,2,1,1,3,2,3,2,2,1,3,3
nettuno2.jpg,1,2,0,4,2,3,1,3,2,3,4,0,3,3,3
nettuno11.jpg,3,2,4,0,2,1,3,3,2,1,2,4,1,1,1
nettuno0.jpg,1,2,2,2,0,1,1,1,2,1,2,2,3,1,1
nettuno5.jpg,2,1,3,1,1,0,2,2,3,2,1,3,2,2,2
nettuno4.jpg,0,1,1,3,1,2,0,2,1,2,3,1,2,2,2
nettuno12.jpg,2,3,3,3,1,2,2,0,3,2,3,3,4,2,2
nettuno6.jpg,1,2,2,2,2,3,1,3,0,1,4,2,1,1,1
nettuno10.jpg,2,3,3,1,1,2,2,2,1,0,3,3,2,0,0
nettuno7.jpg,3,2,4,2,2,1,3,3,4,3,0,4,3,3,3
nettuno8.jpg,1,2,0,4,2,3,1,3,2,3,4,0,3,3,3
nettuno1.jpg,2,1,3,1,3,2,2,4,1,2,3,3,0,2,2
nettuno13.jpg,2,3,3,1,1,2,2,2,1,0,3,3,2,0,0
nettuno14.jpg,2,3,3,1,1,2,2,2,1,0,3,3,2,0,0
Type,Content,Content,Content,Content,Content,Content,Content,Content,Content,Content,Content,Content,Content,Content,Content
nettuno9.jpg,0,12,12,13,13,13,12,13,13,13,13,12,13,12,12
nettuno3.jpg,12,0,12,13,11,11,11,13,13,13,13,12,12,11,13
nettuno2.jpg,12,12,0,13,12,13,12,12,13,13,13,13,10,13,13
nettuno11.jpg,13,13,13,0,12,13,12,13,12,13,13,13,13,13,13
nettuno0.jpg,13,11,12,12,0,10,12,12,13,13,13,12,11,11,12
nettuno5.jpg,13,11,13,13,10,0,13,13,13,12,12,11,13,11,13
nettuno4.jpg,12,11,12,12,12,13,0,13,13,13,13,13,11,13,12
nettuno12.jpg,13,13,12,13,12,13,13,0,13,13,11,13,13,12,13
nettuno6.jpg,13,13,13,12,13,13,13,13,0,13,12,12,13,7,13
nettuno10.jpg,13,13,13,13,13,12,13,13,13,0,13,13,13,13,10
nettuno7.jpg,13,13,13,13,13,12,13,11,12,13,0,12,13,12,12
nettuno8.jpg,12,12,13,13,12,11,13,13,12,13,12,0,13,12,12
nettuno1.jpg,13,12,10,13,11,13,11,13,13,13,13,13,0,12,13
nettuno13.jpg,12,11,13,13,11,11,13,12,7,13,12,12,12,0,13
nettuno14.jpg,12,13,13,13,12,13,12,13,13,10,12,12,13,13,0
Type,R-Content,R-Content,R-Content,R-Content,R-Content,R-Content,R-Content,R-Content,R-Content,R-Content,R-Content,R-Content,R-Content,R-Content,R-Content
nettuno9.jpg,0,4,6,7,7,4,5,8,8,6,8,6,8,4,7
nettuno3.jpg,4,0,8,9,7,6,5,8,6,8,8,8,4,6,3
nettuno2.jpg,6,8,0,3,3,8,5,6,4,4,6,10,4,2,9
nettuno11.jpg,7,9,3,0,6,5,4,5,3,1,3,7,5,3,8
nettuno0.jpg,7,7,3,6,0,9,8,5,5,5,7,7,5,3,6
nettuno5.jpg,4,6,8,5,9,0,5,8,6,4,4,4,8,6,7
nettuno4.jpg,5,5,5,4,8,5,0,7,7,5,7,7,5,5,6
nettuno12.jpg,8,8,6,5,5,8,7,0,4,6,6,6,6,6,9
nettuno6.jpg,8,6,4,3,5,6,7,4,0,4,2,8,2,4,7
nettuno10.jpg,6,8,4,1,5,4,5,6,4,0,4,6,6,2,7
nettuno7.jpg,8,8,6,3,7,4,7,6,2,4,0,6,4,6,7
nettuno8.jpg,6,8,10,7,7,4,7,6,8,6,6,0,10,8,7
nettuno1.jpg,8,4,4,5,5,8,5,6,2,6,4,10,0,4,5
nettuno13.jpg,4,6,2,3,3,6,5,6,4,2,6,8,4,0,7
nettuno14.jpg,7,3,9,8,6,7,6,9,7,7,7,7,5,7,0
Type,Final-R,Final-R,Final-R,Final-R,Final-R,Final-R,Final-R,Final-R,Final-R,Final-R,Final-R,Final-R,Final-R,Final-R,Final-R
nettuno9.jpg,0,1,1,3,1,2,0,2,1,2,3,1,2,2,2
nettuno3.jpg,1,0,2,2,2,1,1,3,2,3,2,2,1,3,3
nettuno2.jpg,1,2,0,4,2,3,1,3,2,3,4,0,3,3,3
nettuno11.jpg,3,2,4,0,2,1,3,3,2,1,2,4,1,1,1
nettuno0.jpg,1,2,2,2,0,1,1,1,2,1,2,2,3,1,1
nettuno5.jpg,2,1,3,1,1,0,2,2,3,2,1,3,2,2,2
nettuno4.jpg,0,1,1,3,1,2,0,2,1,2,3,1,2,2,2
nettuno12.jpg,2,3,3,3,1,2,2,0,3,2,3,3,4,2,2
nettuno6.jpg,1,2,2,2,2,3,1,3,0,1,4,2,1,1,1
nettuno10.jpg,2,3,3,1,1,2,2,2,1,0,3,3,2,0,0
nettuno7.jpg,3,2,4,2,2,1,3,3,4,3,0,4,3,3,3
nettuno8.jpg,1,2,0,4,2,3,1,3,2,3,4,0,3,3,3
nettuno1.jpg,2,1,3,1,3,2,2,4,1,2,3,3,0,2,2
nettuno13.jpg,2,3,3,1,1,2,2,2,1,0,3,3,2,0,0
nettuno14.jpg,2,3,3,1,1,2,2,2,1,0,3,3,2,0,0
