,colosseo9.jpg,colosseo10.jpg,colosseo3.jpg,colosseo1.jpg,colosseo14.jpg,colosseo7.jpg,colosseo12.jpg,colosseo4.jpg,colosseo6.jpg,colosseo8.jpg,colosseo11.jpg,colosseo5.jpg,colosseo0.jpg,colosseo2.jpg,colosseo13.jpg
Type,SHA256,SHA256,SHA256,SHA256,SHA256,SHA256,SHA256,SHA256,SHA256,SHA256,SHA256,SHA256,SHA256,SHA256,SHA256
colosseo9.jpg,0,58,57,60,54,60,62,61,56,63,61,58,60,54,60
colosseo10.jpg,58,0,60,61,61,60,61,57,64,57,58,60,61,57,59
colosseo3.jpg,57,60,0,61,62,61,59,58,63,60,63,61,63,61,62
colosseo1.jpg,60,61,61,0,59,61,59,59,59,58,59,61,61,58,61
colosseo14.jpg,54,61,62,59,0,61,60,58,61,58,58,59,60,55,59
colosseo7.jpg,60,60,61,61,61,0,60,61,60,57,62,60,60,60,57
colosseo12.jpg,62,61,59,59,60,60,0,61,61,62,60,62,61,62,56
colosseo4.jpg,61,57,58,59,58,61,61,0,61,56,59,61,61,59,60
colosseo6.jpg,56,64,63,59,61,60,61,61,0,58,61,58,59,60,61
colosseo8.jpg,63,57,60,58,58,57,62,56,58,0,57,58,56,60,61
colosseo11.jpg,61,58,63,59,58,62,60,59,61,57,0,61,62,57,64
colosseo5.jpg,58,60,61,61,59,60,62,61,58,58,61,0,59,62,61
colosseo0.jpg,60,61,63,61,60,60,61,61,59,56,62,59,0,63,59
colosseo2.jpg,54,57,61,58,55,60,62,59,60,60,57,62,63,0,61
colosseo13.jpg,60,59,62,61,59,57,56,60,61,61,64,61,59,61,0
Type,Final-R,Final-R,Final-R,Final-R,Final-R,Final-R,Final-R,Final-R,Final-R,Final-R,Final-R,Final-R,Final-R,Final-R,Final-R
colosseo9.jpg,0,4,2,3,3,5,3,1,4,1,3,4,4,5,3
colosseo10.jpg,4,0,4,3,3,5,5,5,6,5,3,6,4,5,3
colosseo3.jpg,2,4,0,3,5,5,3,3,4,1,5,2,4,5,5
colosseo1.jpg,3,3,3,0,4,6,6,4,5,4,6,3,5,2,4
colosseo14.jpg,3,3,5,4,0,4,4,4,5,4,4,7,5,4,0
colosseo7.jpg,5,5,5,6,4,0,4,6,3,4,4,5,1,6,4
colosseo12.jpg,3,5,3,6,4,4,0,2,1,2,2,3,3,6,4
colosseo4.jpg,1,5,3,4,4,6,2,0,3,2,2,3,5,4,4
colosseo6.jpg,4,6,4,5,5,3,1,3,0,3,3,2,2,5,5
colosseo8.jpg,1,5,1,4,4,4,2,2,3,0,4,3,3,6,4
colosseo11.jpg,3,3,5,6,4,4,2,2,3,4,0,5,3,6,4
colosseo5.jpg,4,6,2,3,7,5,3,3,2,3,5,0,4,3,7
colosseo0.jpg,4,4,4,5,5,1,3,5,2,3,3,4,0,7,5
colosseo2.jpg,5,5,5,2,4,6,6,4,5,6,6,3,7,0,4
colosseo13.jpg,3,3,5,4,0,4,4,4,5,4,4,7,5,4,0
