,arco_pace2.jpg,arco_pace4.jpg,arco_pace12.jpg,arco_pace7.jpg,arco_pace13.jpg,arco_pace9.jpg,arco_pace1.jpg,arco_pace5.jpg,arco_pace0.jpg,arco_pace14.jpg,arco_pace6.jpg,arco_pace3.jpg,arco_pace11.jpg,arco_pace8.jpg,arco_pace10.jpg
Type,Meta,Meta,Meta,Meta,Meta,Meta,Meta,Meta,Meta,Meta,Meta,Meta,Meta,Meta,Meta
arco_pace2.jpg,0,5,6,6,6,3,3,5,4,6,5,4,5,5,5
arco_pace4.jpg,5,0,4,5,6,6,4,5,4,4,5,5,5,4,6
arco_pace12.jpg,6,4,0,3,5,6,4,6,6,2,6,7,3,6,3
arco_pace7.jpg,6,5,3,0,4,6,5,6,4,3,6,7,4,6,4
arco_pace13.jpg,6,6,5,4,0,4,6,5,4,5,5,6,4,6,4
arco_pace9.jpg,3,6,6,6,4,0,5,6,5,6,5,3,5,6,5
arco_pace1.jpg,3,4,4,5,6,5,0,5,4,5,5,5,5,5,5
arco_pace5.jpg,5,5,6,6,5,6,5,0,3,7,5,5,5,3,5
arco_pace0.jpg,4,4,6,4,4,5,4,3,0,6,3,4,5,3,5
arco_pace14.jpg,6,4,2,3,5,6,5,7,6,0,5,7,4,6,3
arco_pace6.jpg,5,5,6,6,5,5,5,5,3,5,0,4,5,5,5
arco_pace3.jpg,4,5,7,7,6,3,5,5,4,7,4,0,6,5,6
arco_pace11.jpg,5,5,3,4,4,5,5,5,5,4,5,6,0,7,1
arco_pace8.jpg,5,4,6,6,6,6,5,3,3,6,5,5,7,0,7
arco_pace10.jpg,5,6,3,4,4,5,5,5,5,3,5,6,1,7,0
Type,R-Meta,R-Meta,R-Meta,R-Meta,R-Meta,R-Meta,R-Meta,R-Meta,R-Meta,R-Meta,R-Meta,R-Meta,R-Meta,R-Meta,R-Meta
arco_pace2.jpg,0,6,8,7,6,3,4,4,2,8,4,3,6,4,6
arco_pace4.jpg,6,0,2,3,6,7,4,4,4,2,6,7,4,4,4
arco_pace12.jpg,8,2,0,1,4,5,6,6,6,0,6,7,2,6,2
arco_pace7.jpg,7,3,1,0,3,4,5,7,5,1,5,6,3,7,3
arco_pace13.jpg,6,6,4,3,0,3,6,6,4,4,4,5,2,8,2
arco_pace9.jpg,3,7,5,4,3,0,5,5,3,5,3,2,3,5,3
arco_pace1.jpg,4,4,6,5,6,5,0,6,2,6,4,3,6,4,6
arco_pace5.jpg,4,4,6,7,6,5,6,0,4,6,6,5,4,2,4
arco_pace0.jpg,2,4,6,5,4,3,2,4,0,6,2,3,4,4,4
arco_pace14.jpg,8,2,0,1,4,5,6,6,6,0,6,7,2,6,2
arco_pace6.jpg,4,6,6,5,4,3,4,6,2,6,0,3,4,6,4
arco_pace3.jpg,3,7,7,6,5,2,3,5,3,7,3,0,5,5,5
arco_pace11.jpg,6,4,2,3,2,3,6,4,4,2,4,5,0,6,0
arco_pace8.jpg,4,4,6,7,8,5,4,2,4,6,6,5,6,0,6
arco_pace10.jpg,6,4,2,3,2,3,6,4,4,2,4,5,0,6,0
Type,Content,Content,Content,Content,Content,Content,Content,Content,Content,Content,Content,Content,Content,Content,Content
arco_pace2.jpg,0,11,13,11,11,13,12,13,12,12,12,13,13,10,12
arco_pace4.jpg,11,0,12,11,11,13,12,13,12,13,13,12,13,11,13
arco_pace12.jpg,13,12,0,13,12,12,11,13,12,12,13,11,11,13,13
arco_pace7.jpg,11,11,13,0,12,13,12,13,12,13,13,13,13,12,12
arco_pace13.jpg,11,11,12,12,0,12,12,11,11,13,12,13,12,12,11
arco_pace9.jpg,13,13,12,13,12,0,13,12,12,12,13,12,13,13,13
arco_pace1.jpg,12,12,11,12,12,13,0,13,11,13,13,13,12,10,11
arco_pace5.jpg,13,13,13,13,11,12,13,0,13,13,13,12,13,12,13
arco_pace0.jpg,12,12,12,12,11,12,11,13,0,13,12,13,13,11,13
arco_pace14.jpg,12,13,12,13,13,12,13,13,13,0,13,12,12,13,13
arco_pace6.jpg,12,13,13,13,12,13,13,13,12,13,0,13,13,12,13
arco_pace3.jpg,13,12,11,13,13,12,13,12,13,12,13,0,12,13,13
arco_pace11.jpg,13,13,11,13,12,13,12,13,13,12,13,12,0,13,13
arco_pace8.jpg,10,11,13,12,12,13,10,12,11,13,12,13,13,0,11
arco_pace10.jpg,12,13,13,12,11,13,11,13,13,13,13,13,13,11,0
Type,R-Content,R-Content,R-Content,R-Content,R-Content,R-Content,R-Content,R-Content,R-Content,R-Content,R-Content,R-Content,R-Content,R-Content,R-Content
arco_pace2.jpg,0,8,8,7,7,10,5,9,7,8,10,11,11,8,8
arco_pace4.jpg,8,0,8,7,9,10,7,11,9,10,12,9,9,6,12
arco_pace12.jpg,8,8,0,9,9,10,5,7,9,6,12,7,9,8,8
arco_pace7.jpg,7,7,9,0,6,13,6,12,6,9,11,10,8,11,7
arco_pace13.jpg,7,9,9,6,0,11,8,10,8,9,9,12,8,9,5
arco_pace9.jpg,10,10,10,13,11,0,11,9,11,10,10,11,11,8,12
arco_pace1.jpg,5,7,5,6,8,11,0,8,6,5,7,6,8,9,7
arco_pace5.jpg,9,11,7,12,10,9,8,0,12,5,11,8,10,9,9
arco_pace0.jpg,7,9,9,6,8,11,6,12,0,9,9,8,10,9,9
arco_pace14.jpg,8,10,6,9,9,10,5,5,9,0,10,7,7,10,6
arco_pace6.jpg,10,12,12,11,9,10,7,11,9,10,0,7,11,10,10
arco_pace3.jpg,11,9,7,10,12,11,6,8,8,7,7,0,10,9,9
arco_pace11.jpg,11,9,9,8,8,11,8,10,10,7,11,10,0,9,7
arco_pace8.jpg,8,6,8,11,9,8,9,9,9,10,10,9,9,0,12
arco_pace10.jpg,8,12,8,7,5,12,7,9,9,6,10,9,7,12,0
Type,Final-R,Final-R,Final-R,Final-R,Final-R,Final-R,Final-R,Final-R,Final-R,Final-R,Final-R,Final-R,Final-R,Final-R,Final-R
arco_pace2.jpg,0,12,11,11,5,9,8,6,7,12,9,11,13,9,8
arco_pace4.jpg,12,0,7,9,11,13,8,10,11,10,13,11,11,7,12
arco_pace12.jpg,11,7,0,8,10,10,9,9,12,5,14,10,10,10,9
arco_pace7.jpg,11,9,8,0,8,14,11,15,10,9,14,14,10,16,9
arco_pace13.jpg,5,11,10,8,0,12,9,9,6,11,10,12,8,10,5
arco_pace9.jpg,9,13,10,14,12,0,15,7,12,11,10,10,12,10,13
arco_pace1.jpg,8,8,9,11,9,15,0,10,7,10,5,7,13,7,10
arco_pace5.jpg,6,10,9,15,9,7,10,0,11,8,11,7,11,7,8
arco_pace0.jpg,7,11,12,10,6,12,7,11,0,13,6,8,12,10,9
arco_pace14.jpg,12,10,5,9,11,11,10,8,13,0,13,11,9,13,8
arco_pace6.jpg,9,13,14,14,10,10,5,11,6,13,0,8,12,10,11
arco_pace3.jpg,11,11,10,14,12,10,7,7,8,11,8,0,12,8,11
arco_pace11.jpg,13,11,10,10,8,12,13,11,12,9,12,12,0,12,7
arco_pace8.jpg,9,7,10,16,10,10,7,7,10,13,10,8,12,0,13
arco_pace10.jpg,8,12,9,9,5,13,10,8,9,8,11,11,7,13,0
