,il_bacio8.jpg,il_bacio0.jpg,il_bacio9.jpg,il_bacio12.jpg,il_bacio5.jpg,il_bacio13.jpg,il_bacio4.jpg,il_bacio6.jpg,il_bacio3.jpg,il_bacio1.jpg,il_bacio11.jpg,il_bacio10.jpg,il_bacio2.jpg,il_bacio14.jpg,il_bacio7.jpg
Type,SHA256,SHA256,SHA256,SHA256,SHA256,SHA256,SHA256,SHA256,SHA256,SHA256,SHA256,SHA256,SHA256,SHA256,SHA256
il_bacio8.jpg,0,60,59,58,61,62,60,60,60,61,61,58,56,56,59
il_bacio0.jpg,60,0,57,61,62,61,60,59,58,61,61,58,62,63,63
il_bacio9.jpg,59,57,0,62,61,58,59,59,60,60,55,59,63,61,58
il_bacio12.jpg,58,61,62,0,58,61,60,60,60,60,62,62,61,59,60
il_bacio5.jpg,61,62,61,58,0,62,61,59,60,61,58,60,60,61,60
il_bacio13.jpg,62,61,58,61,62,0,59,60,61,62,62,62,57,58,58
il_bacio4.jpg,60,60,59,60,61,59,0,60,62,60,61,62,62,62,60
il_bacio6.jpg,60,59,59,60,59,60,60,0,62,63,57,59,60,58,58
il_bacio3.jpg,60,58,60,60,60,61,62,62,0,60,62,62,58,59,60
il_bacio1.jpg,61,61,60,60,61,62,60,63,60,0,63,61,59,56,60
il_bacio11.jpg,61,61,55,62,58,62,61,57,62,63,0,61,61,62,61
il_bacio10.jpg,58,58,59,62,60,62,62,59,62,61,61,0,62,62,62
il_bacio2.jpg,56,62,63,61,60,57,62,60,58,59,61,62,0,62,62
il_bacio14.jpg,56,63,61,59,61,58,62,58,59,56,62,62,62,0,61
il_bacio7.jpg,59,63,58,60,60,58,60,58,60,60,61,62,62,61,0
Type,Final-R,Final-R,Final-R,Final-R,Final-R,Final-R,Final-R,Final-R,Final-R,Final-R,Final-R,Final-R,Final-R,Final-R,Final-R
il_bacio8.jpg,0,8,8,8,8,8,7,7,8,8,8,8,8,8,8
il_bacio0.jpg,8,0,8,8,8,8,7,7,8,6,8,6,8,8,8
il_bacio9.jpg,8,8,0,8,8,8,7,7,8,8,8,8,8,8,8
il_bacio12.jpg,8,8,8,0,8,6,7,7,8,8,8,8,8,8,8
il_bacio5.jpg,8,8,8,8,0,6,7,7,8,8,8,8,8,8,8
il_bacio13.jpg,8,8,8,6,6,0,7,7,8,8,8,8,8,8,6
il_bacio4.jpg,7,7,7,7,7,7,0,6,7,7,7,7,7,7,7
il_bacio6.jpg,7,7,7,7,7,7,6,0,7,7,7,7,5,7,7
il_bacio3.jpg,8,8,8,8,8,8,7,7,0,8,8,8,8,6,8
il_bacio1.jpg,8,6,8,8,8,8,7,7,8,0,8,8,8,8,8
il_bacio11.jpg,8,8,8,8,8,8,7,7,8,8,0,8,8,8,8
il_bacio10.jpg,8,6,8,8,8,8,7,7,8,8,8,0,8,8,8
il_bacio2.jpg,8,8,8,8,8,8,7,5,8,8,8,8,0,8,8
il_bacio14.jpg,8,8,8,8,8,8,7,7,6,8,8,8,8,0,8
il_bacio7.jpg,8,8,8,8,8,6,7,7,8,8,8,8,8,8,0
