Img-Name,Meta,R-Meta,Content,R-Content,Final-R
hamburger2.jpg,AAA6P2BOW4ZTPTLD,"[0, 1, 1, 0, 1, 0, 1, 1]",EEA77KUVIXQIBBL6,"[1, 1, 1, 1, 0, 1, 1, 1]","[1, 1, 1, 1, 1, 1, 1, 1]"
hamburger7.jpg,AAA7P2RI64ZTPTLD,"[0, 1, 1, 0, 1, 0, 0, 1]",EEA7RF4HNA3TR4CD,"[1, 1, 0, 0, 1, 1, 1, 1]","[1, 1, 1, 0, 1, 1, 1, 1]"
hamburger11.jpg,AAA6P2MOWEZTPTLD,"[0, 1, 1, 0, 1, 1, 1, 1]",EEA4DHQ4M55GCKMX,"[1, 0, 0, 1, 1, 1, 0, 1]","[1, 1, 1, 1, 1, 1, 1, 1]"
hamburger10.jpg,AAA7P2FK6QZTPTLD,"[0, 1, 1, 1, 1, 0, 0, 1]",EEA6HF6IWD7QOMED,"[0, 1, 0, 0, 1, 1, 1, 0]","[0, 1, 1, 1, 1, 1, 1, 1]"
hamburger13.jpg,AAA6P2BOWYZTPTLD,"[0, 1, 1, 0, 1, 0, 1, 1]",EEA2PVUZ7COICGC6,"[0, 1, 1, 1, 0, 1, 1, 1]","[0, 1, 1, 1, 1, 1, 1, 1]"
hamburger4.jpg,AAA7P2EMW4ZTPTLD,"[0, 1, 1, 0, 1, 1, 0, 1]",EEA6ID2LGYWM4NVY,"[0, 1, 0, 0, 1, 1, 1, 0]","[0, 1, 1, 0, 1, 1, 1, 1]"
hamburger5.jpg,AAA5P2AM64ZTPTLD,"[0, 1, 1, 0, 1, 1, 0, 0]",EEA4OQX2NMQTRURP,"[1, 1, 1, 0, 1, 1, 0, 0]","[1, 1, 1, 0, 1, 1, 0, 0]"
hamburger0.jpg,AAA7P2VOWUZTPTLD,"[0, 1, 1, 0, 1, 1, 0, 1]",EEAYZGNR6VRUYZUT,"[0, 1, 1, 0, 1, 1, 1, 1]","[0, 1, 1, 0, 1, 1, 1, 1]"
hamburger3.jpg,AAA7P2BK6MZTPTLD,"[0, 1, 1, 1, 1, 1, 0, 1]",EEA4ZQUFXZVUQDPL,"[0, 1, 1, 0, 1, 1, 1, 0]","[0, 1, 1, 1, 1, 1, 1, 1]"
hamburger6.jpg,AAA7P2FK6UZTPTLD,"[0, 1, 1, 1, 1, 1, 0, 1]",EEA3JUTINZY3NMEW,"[0, 1, 1, 1, 0, 1, 0, 1]","[0, 1, 1, 1, 1, 1, 0, 1]"
hamburger8.jpg,AAA6P6EI64ZTPTLD,"[0, 1, 0, 0, 1, 0, 1, 0]",EEA3XYGEB7GKIPU2,"[1, 1, 1, 1, 0, 1, 0, 1]","[1, 1, 1, 1, 1, 1, 1, 1]"
hamburger1.jpg,AAA7P6UO6UZTPTLD,"[0, 1, 0, 0, 1, 1, 1, 1]",EEA4KCVUOAYNXH2P,"[1, 1, 0, 1, 1, 1, 1, 0]","[1, 1, 0, 1, 1, 1, 1, 1]"
hamburger9.jpg,AAA7P2EJ64ZTPTLD,"[0, 1, 1, 0, 1, 0, 0, 1]",EEA7VEFBHLKYVQT3,"[0, 1, 1, 1, 1, 1, 0, 1]","[0, 1, 1, 1, 1, 1, 0, 1]"
hamburger14.jpg,AAA5P2AMWQZTPTLD,"[0, 1, 1, 0, 1, 1, 0, 0]",EEAZM7FDDXMCW2YJ,"[1, 0, 1, 1, 1, 1, 0, 1]","[1, 1, 1, 1, 1, 1, 0, 1]"
hamburger12.jpg,AAA5P2AK6UZTPTLD,"[0, 1, 1, 1, 1, 1, 0, 0]",EEAYLMY3HUJGNZTK,"[0, 1, 1, 1, 0, 1, 0, 1]","[0, 1, 1, 1, 1, 1, 0, 1]"
