Img-Name,SHA256,Final-R
basilica_santa_croce12.jpg,bd3ce4583425387593ab0d64f91bf015552cddcf452806c7097909c5fde5149e,"[0, 0, 0, 0, 1, 1, 0, 1, 1, 0, 0, 0, 0, 0, 1, 1]"
basilica_santa_croce9.jpg,1c42787d697943e2cb94fb3a3e66da1285ebb37f3a89e53ec994b38c749db517,"[0, 0, 1, 0, 0, 0, 0, 1, 0, 0, 1, 0, 1, 1, 1, 1]"
basilica_santa_croce5.jpg,f5859d8a6a9433f43ba3d57d7dc97f264dc14e7b4a94a3c227df3281955b0995,"[0, 1, 1, 0, 1, 1, 1, 0, 0, 0, 1, 1, 0, 1, 0, 0]"
basilica_santa_croce0.jpg,d9900d7cdb09e25101511e113914b6677ff9e652d32c98ec56b4ae3255efa4b0,"[1, 1, 1, 0, 0, 0, 0, 1, 0, 0, 0, 0, 1, 0, 0, 0]"
basilica_santa_croce8.jpg,a4f00a0ab445b072a6c6da3276ae2bb8b861e19537ef9ac3d5e777ea3a14447a,"[0, 0, 1, 1, 0, 1, 0, 0, 1, 0, 1, 0, 0, 0, 0, 0]"
basilica_santa_croce4.jpg,9fcd2e6bc46ce0053da10bf0e5516116b7e00f3f4812bacae3b7b299dd179567,"[1, 0, 0, 0, 0, 1, 1, 1, 0, 1, 1, 1, 0, 0, 0, 1]"
basilica_santa_croce13.jpg,9259affe7b00c4dd77851dfb42108a976678302ea26dbe0022273a7f9cfac720,"[1, 0, 0, 0, 0, 0, 0, 1, 0, 0, 0, 1, 0, 1, 1, 1]"
basilica_santa_croce7.jpg,1b6227b3f041d70506c781df5abf1fc97ca5c14ac919aed8bb8af54bd703d95c,"[0, 0, 0, 1, 0, 1, 0, 0, 1, 1, 1, 1, 1, 0, 0, 1]"
basilica_santa_croce1.jpg,648f46d719b75e53aded717bfcc97be35efd1478518ed7d1691e14f94270792a,"[0, 1, 0, 1, 0, 0, 0, 1, 1, 1, 1, 1, 0, 0, 0, 0]"
basilica_santa_croce10.jpg,02da4103d10b94e90948754c943d7cc1609bddbe0b149d93965ffb83d4a087a4,"[0, 1, 0, 1, 1, 0, 0, 0, 0, 1, 0, 0, 1, 0, 1, 0]"
basilica_santa_croce11.jpg,876ed96ff6c677b076b01cf3e569861e1b691d41578c49076dbdb26fd6e47ec3,"[1, 1, 0, 1, 0, 0, 0, 1, 0, 0, 0, 0, 0, 0, 1, 1]"
basilica_santa_croce6.jpg,0c1455df6746bbc6243fdfb892e0215b6450078a6c7b4923616ab8d36193bd10,"[1, 0, 0, 1, 0, 0, 1, 0, 1, 0, 1, 1, 0, 0, 0, 1]"
basilica_santa_croce3.jpg,e6a0e310fdb8fb6c50a456f8e33e92f0118df875315a39b53a083f77fe293639,"[1, 0, 0, 0, 0, 1, 0, 1, 1, 1, 0, 0, 1, 0, 0, 0]"
basilica_santa_croce2.jpg,9577823cb8fe48a65186606c6d91d7f48034a42ba783805e8cc837fd8eecafa2,"[0, 0, 1, 0, 1, 0, 1, 0, 0, 0, 0, 1, 1, 1, 1, 0]"
basilica_santa_croce14.jpg,1eee81f346b605c6a754c0eac5aa5019d76348abcfdcf4d47bd00150cc324eda,"[1, 0, 0, 1, 1, 0, 1, 0, 0, 1, 1, 1, 0, 0, 0, 0]"
