Img-Name,SHA256,Final-R
obelisco_wash_dc2.jpg,ab1bc94d856ed96dcb0708333879f42ef076fc224c2eaaef8c85cd2c8878b747,"[0, 0, 0, 0, 0, 1, 1, 1]"
obelisco_wash_dc11.jpg,75706d3fab0957cc76f1d12f79c69c3ea73df9db795e0fb67fd4fcc4227fe5c7,"[0, 0, 0, 0, 1, 0, 1, 1]"
obelisco_wash_dc9.jpg,3168a179b0d2eeb0a4ded1e5a5a3f61933d06b8317886d471857e3cdc693ce6e,"[1, 1, 0, 0, 0, 0, 1, 1]"
obelisco_wash_dc5.jpg,00908547ab274bbfe68db7a79686da8d5239492c1f250262e56da865a821545b,"[0, 0, 1, 1, 0, 1, 0, 1]"
obelisco_wash_dc14.jpg,ed08e1a29faadd305d18fc672141ed8b42a33a4790c0e5c67871f9b58f9dbee5,"[1, 0, 0, 1, 0, 1, 1, 0]"
obelisco_wash_dc13.jpg,e3a81e98723154d85ad742fc522a751d7c748c8b3651f3294bc85f3b19ce0aa0,"[1, 1, 0, 0, 0, 1, 0, 0]"
obelisco_wash_dc3.jpg,59b11938a28c15b194442b18457fb0b1004e46981fe4bc6efcfcd372be83ea2c,"[0, 1, 0, 0, 1, 0, 1, 0]"
obelisco_wash_dc8.jpg,fb629336e19f18b46433ed35ebb7cbfae906c4c9ecc74ef532dcc157f697b4ff,"[0, 0, 1, 0, 1, 1, 0, 1]"
obelisco_wash_dc6.jpg,8cdfdc88589b19991beb5c6bd19937d3049f56ba4db952a1e90ccb4612a68d44,"[0, 1, 0, 1, 1, 0, 0, 0]"
obelisco_wash_dc4.jpg,9fb4dc0d033ed6d01b76ba3a069dd222e4fa0f2deb41179935a16d02fd1517f3,"[1, 1, 1, 1, 0, 0, 0, 0]"
obelisco_wash_dc1.jpg,17a2a61425b85b1f777c70173f218d5e4bd3553210462e055bb05087e1fc106d,"[0, 0, 0, 0, 0, 1, 1, 1]"
obelisco_wash_dc12.jpg,eb3ed544935e6ed9798a30fed112c856e19ea552df53102d5fbe1722ecf812b2,"[0, 1, 1, 0, 0, 1, 1, 0]"
obelisco_wash_dc0.jpg,9fd2333702558c4a8d12ba099e33d175897b3ada8a7c163ce4004dbd796596de,"[0, 0, 1, 0, 1, 1, 1, 0]"
obelisco_wash_dc10.jpg,fd7a6855c37da594560791695812cd37615947ef8661c618818aaee517836f55,"[1, 0, 0, 0, 1, 1, 0, 1]"
obelisco_wash_dc7.jpg,c514c20b643859dba98fcd8a3066ec13194a4403321227bb67db41fecc5e7c91,"[0, 1, 0, 1, 0, 0, 0, 0]"
