,pantheon8.jpg,pantheon4.jpg,pantheon1.jpg,pantheon12.jpg,pantheon0.jpg,pantheon2.jpg,pantheon9.jpg,pantheon14.jpg,pantheon7.jpg,pantheon13.jpg,pantheon10.jpg,pantheon3.jpg,pantheon11.jpg,pantheon6.jpg,pantheon5.jpg
Type,Meta,Meta,Meta,Meta,Meta,Meta,Meta,Meta,Meta,Meta,Meta,Meta,Meta,Meta,Meta
pantheon8.jpg,0,3,3,4,5,2,4,4,2,5,5,5,5,4,5
pantheon4.jpg,3,0,5,4,6,3,5,5,3,5,5,5,5,3,4
pantheon1.jpg,3,5,0,4,3,4,5,3,3,4,4,4,3,4,6
pantheon12.jpg,4,4,4,0,4,4,6,4,3,5,2,5,4,3,6
pantheon0.jpg,5,6,3,4,0,5,5,4,4,6,4,4,5,5,7
pantheon2.jpg,2,3,4,4,5,0,4,3,2,5,5,5,5,3,5
pantheon9.jpg,4,5,5,6,5,4,0,6,3,6,7,5,6,6,5
pantheon14.jpg,4,5,3,4,4,3,6,0,4,5,3,5,4,3,5
pantheon7.jpg,2,3,3,3,4,2,3,4,0,4,4,4,4,4,5
pantheon13.jpg,5,5,4,5,6,5,6,5,4,0,4,5,2,5,5
pantheon10.jpg,5,5,4,2,4,5,7,3,4,4,0,5,3,4,6
pantheon3.jpg,5,5,4,5,4,5,5,5,4,5,5,0,6,6,4
pantheon11.jpg,5,5,3,4,5,5,6,4,4,2,3,6,0,4,5
pantheon6.jpg,4,3,4,3,5,3,6,3,4,5,4,6,4,0,6
pantheon5.jpg,5,4,6,6,7,5,5,5,5,5,6,4,5,6,0
Type,R-Meta,R-Meta,R-Meta,R-Meta,R-Meta,R-Meta,R-Meta,R-Meta,R-Meta,R-Meta,R-Meta,R-Meta,R-Meta,R-Meta,R-Meta
pantheon8.jpg,0,4,6,6,7,4,6,6,4,6,6,8,6,6,6
pantheon4.jpg,4,0,6,4,7,4,6,6,2,6,6,6,6,6,4
pantheon1.jpg,6,6,0,4,5,6,6,4,4,6,4,8,4,4,8
pantheon12.jpg,6,4,4,0,5,6,8,4,4,6,4,8,4,4,8
pantheon0.jpg,7,7,5,5,0,7,7,5,7,7,5,5,5,5,7
pantheon2.jpg,4,4,6,6,7,0,4,4,4,6,6,8,6,4,6
pantheon9.jpg,6,6,6,8,7,4,0,8,4,8,8,8,8,8,6
pantheon14.jpg,6,6,4,4,5,4,8,0,6,6,4,8,4,2,8
pantheon7.jpg,4,2,4,4,7,4,4,6,0,6,6,8,6,6,6
pantheon13.jpg,6,6,6,6,7,6,8,6,6,0,6,6,4,6,6
pantheon10.jpg,6,6,4,4,5,6,8,4,6,6,0,8,4,4,8
pantheon3.jpg,8,6,8,8,5,8,8,8,8,6,8,0,8,8,4
pantheon11.jpg,6,6,4,4,5,6,8,4,6,4,4,8,0,4,8
pantheon6.jpg,6,6,4,4,5,4,8,2,6,6,4,8,4,0,8
pantheon5.jpg,6,4,8,8,7,6,6,8,6,6,8,4,8,8,0
Type,Content,Content,Content,Content,Content,Content,Content,Content,Content,Content,Content,Content,Content,Content,Content
pantheon8.jpg,0,13,13,10,13,12,10,11,12,12,12,13,12,13,12
pantheon4.jpg,13,0,13,13,11,13,13,13,12,13,13,13,12,11,12
pantheon1.jpg,13,13,0,13,13,13,11,13,13,13,12,12,13,13,13
pantheon12.jpg,10,13,13,0,13,11,11,12,12,12,12,13,12,13,12
pantheon0.jpg,13,11,13,13,0,12,13,13,13,13,13,13,13,9,13
pantheon2.jpg,12,13,13,11,12,0,11,13,13,12,13,13,12,12,13
pantheon9.jpg,10,13,11,11,13,11,0,12,13,12,12,13,13,13,12
pantheon14.jpg,11,13,13,12,13,13,12,0,12,11,12,12,11,13,9
pantheon7.jpg,12,12,13,12,13,13,13,12,0,13,13,13,11,12,13
pantheon13.jpg,12,13,13,12,13,12,12,11,13,0,12,13,12,12,11
pantheon10.jpg,12,13,12,12,13,13,12,12,13,12,0,13,12,13,11
pantheon3.jpg,13,13,12,13,13,13,13,12,13,13,13,0,13,13,12
pantheon11.jpg,12,12,13,12,13,12,13,11,11,12,12,13,0,12,12
pantheon6.jpg,13,11,13,13,9,12,13,13,12,12,13,13,12,0,13
pantheon5.jpg,12,12,13,12,13,13,12,9,13,11,11,12,12,13,0
Type,R-Content,R-Content,R-Content,R-Content,R-Content,R-Content,R-Content,R-Content,R-Content,R-Content,R-Content,R-Content,R-Content,R-Content,R-Content
pantheon8.jpg,0,12,14,10,13,14,12,7,12,12,10,14,14,14,10
pantheon4.jpg,12,0,14,14,11,12,14,11,10,14,12,14,12,12,14
pantheon1.jpg,14,14,0,12,11,12,12,13,10,12,10,12,12,14,14
pantheon12.jpg,10,14,12,0,13,14,12,11,10,12,12,14,14,12,10
pantheon0.jpg,13,11,11,13,0,13,13,12,11,11,13,11,13,7,13
pantheon2.jpg,14,12,12,14,13,0,12,9,10,14,12,14,14,14,14
pantheon9.jpg,12,14,12,12,13,12,0,9,12,12,10,12,14,14,12
pantheon14.jpg,7,11,13,11,12,9,9,0,11,11,9,13,13,13,11
pantheon7.jpg,12,10,10,10,11,10,12,11,0,12,12,12,12,12,10
pantheon13.jpg,12,14,12,12,11,14,12,11,12,0,12,14,14,14,12
pantheon10.jpg,10,12,10,12,13,12,10,9,12,12,0,14,14,14,12
pantheon3.jpg,14,14,12,14,11,14,12,13,12,14,14,0,14,14,14
pantheon11.jpg,14,12,12,14,13,14,14,13,12,14,14,14,0,14,12
pantheon6.jpg,14,12,14,12,7,14,14,13,12,14,14,14,14,0,14
pantheon5.jpg,10,14,14,10,13,14,12,11,10,12,12,14,12,14,0
Type,Final-R,Final-R,Final-R,Final-R,Final-R,Final-R,Final-R,Final-R,Final-R,Final-R,Final-R,Final-R,Final-R,Final-R,Final-R
pantheon8.jpg,0,4,6,6,7,4,6,6,4,6,6,8,6,6,6
pantheon4.jpg,4,0,6,4,7,4,6,6,2,6,6,6,6,6,4
pantheon1.jpg,6,6,0,4,5,6,6,4,4,6,4,8,4,4,8
pantheon12.jpg,6,4,4,0,5,6,8,4,4,6,4,8,4,4,8
pantheon0.jpg,7,7,5,5,0,7,7,5,7,7,5,5,5,5,7
pantheon2.jpg,4,4,6,6,7,0,4,4,4,6,6,8,6,4,6
pantheon9.jpg,6,6,6,8,7,4,0,8,4,8,8,8,8,8,6
pantheon14.jpg,6,6,4,4,5,4,8,0,6,6,4,8,4,2,8
pantheon7.jpg,4,2,4,4,7,4,4,6,0,6,6,8,6,6,6
pantheon13.jpg,6,6,6,6,7,6,8,6,6,0,6,6,4,6,6
pantheon10.jpg,6,6,4,4,5,6,8,4,6,6,0,8,4,4,8
pantheon3.jpg,8,6,8,8,5,8,8,8,8,6,8,0,8,8,4
pantheon11.jpg,6,6,4,4,5,6,8,4,6,4,4,8,0,4,8
pantheon6.jpg,6,6,4,4,5,4,8,2,6,6,4,8,4,0,8
pantheon5.jpg,6,4,8,8,7,6,6,8,6,6,8,4,8,8,0
