,pantheon8.jpg,pantheon4.jpg,pantheon1.jpg,pantheon12.jpg,pantheon0.jpg,pantheon2.jpg,pantheon9.jpg,pantheon14.jpg,pantheon7.jpg,pantheon13.jpg,pantheon10.jpg,pantheon3.jpg,pantheon11.jpg,pantheon6.jpg,pantheon5.jpg
Type,SHA256,SHA256,SHA256,SHA256,SHA256,SHA256,SHA256,SHA256,SHA256,SHA256,SHA256,SHA256,SHA256,SHA256,SHA256
pantheon8.jpg,0,58,57,58,61,57,61,63,60,57,60,61,63,64,59
pantheon4.jpg,58,0,57,63,63,58,59,60,60,59,60,59,63,63,62
pantheon1.jpg,57,57,0,58,64,61,63,60,58,62,57,61,60,63,60
pantheon12.jpg,58,63,58,0,61,64,63,63,60,59,62,60,62,61,59
pantheon0.jpg,61,63,64,61,0,62,62,58,61,62,60,59,62,60,62
pantheon2.jpg,57,58,61,64,62,0,58,60,62,62,59,61,61,62,56
pantheon9.jpg,61,59,63,63,62,58,0,61,59,59,60,58,59,57,63
pantheon14.jpg,63,60,60,63,58,60,61,0,60,61,57,59,59,59,61
pantheon7.jpg,60,60,58,60,61,62,59,60,0,63,59,58,60,62,61
pantheon13.jpg,57,59,62,59,62,62,59,61,63,0,58,62,62,61,60
pantheon10.jpg,60,60,57,62,60,59,60,57,59,58,0,59,62,61,58
pantheon3.jpg,61,59,61,60,59,61,58,59,58,62,59,0,57,62,61
pantheon11.jpg,63,63,60,62,62,61,59,59,60,62,62,57,0,60,58
pantheon6.jpg,64,63,63,61,60,62,57,59,62,61,61,62,60,0,62
pantheon5.jpg,59,62,60,59,62,56,63,61,61,60,58,61,58,62,0
Type,Final-R,Final-R,Final-R,Final-R,Final-R,Final-R,Final-R,Final-R,Final-R,Final-R,Final-R,Final-R,Final-R,Final-R,Final-R
pantheon8.jpg,0,11,15,14,15,14,14,13,14,14,13,13,14,13,13
pantheon4.jpg,11,0,16,13,14,13,15,14,13,15,14,14,13,16,16
pantheon1.jpg,15,16,0,13,16,15,15,12,9,11,16,14,9,14,16
pantheon12.jpg,14,13,13,0,13,12,12,13,12,14,15,13,14,15,13
pantheon0.jpg,15,14,16,13,0,15,13,16,13,15,12,14,13,14,14
pantheon2.jpg,14,13,15,12,15,0,12,11,12,12,13,13,14,13,13
pantheon9.jpg,14,15,15,12,13,12,0,11,14,14,9,13,12,11,15
pantheon14.jpg,13,14,12,13,16,11,11,0,11,11,14,16,11,14,14
pantheon7.jpg,14,13,9,12,13,12,14,11,0,12,15,13,12,13,15
pantheon13.jpg,14,15,11,14,15,12,14,11,12,0,13,15,10,15,13
pantheon10.jpg,13,14,16,15,12,13,9,14,15,13,0,14,13,14,12
pantheon3.jpg,13,14,14,13,14,13,13,16,13,15,14,0,15,12,14
pantheon11.jpg,14,13,9,14,13,14,12,11,12,10,13,15,0,13,13
pantheon6.jpg,13,16,14,15,14,13,11,14,13,15,14,12,13,0,16
pantheon5.jpg,13,16,16,13,14,13,15,14,15,13,12,14,13,16,0
