Img-Name,SHA256,Final-R
arco_pace0.jpg,f7cf46e4295d96d08091bcc8534333d932625a1f8cd256ac967933b9d80e3091,"[1, 1, 0, 0, 1, 0, 0, 1]"
arco_pace12.jpg,75910ba53467b5c7adb0c59b131eb51b71bd024fe35ca6673a62444476dd78e0,"[1, 0, 0, 1, 1, 1, 0, 1]"
arco_pace11.jpg,504260d6df4a276952875b28241c3fbc0cfe8461d47cfdf58122faa210e1ec18,"[1, 1, 1, 0, 1, 1, 1, 0]"
arco_pace6.jpg,f1c421c7a7002a163b570d18f5e847bfc490511d3e2cdaa230b5798d6013d560,"[1, 0, 1, 0, 0, 1, 1, 1]"
arco_pace13.jpg,883b9c1226531bff1cbf39ea80a8432d9542e8061ea5843ec476ddf7ca57b18d,"[0, 0, 1, 0, 0, 1, 1, 1]"
arco_pace5.jpg,b4966fa641f0020b5e45c7c907e452f7e75ac4c002310792af0b04c2022e6eae,"[1, 1, 1, 1, 0, 0, 1, 1]"
arco_pace4.jpg,0eb1d9c66f7381f9f0610b8111f72ea230db81fee86e9341c16d1e198f33bc65,"[0, 1, 1, 0, 0, 1, 1, 0]"
arco_pace9.jpg,71c3e2ac0f86af7cb056fc3cb25d1caa000566ede1e1bd30e56dfb624c51e422,"[1, 0, 1, 0, 1, 1, 0, 0]"
arco_pace10.jpg,e81bcce4115ff7fa184737ce745f8f5c027f0c726ce11b98889bd0712b0015ef,"[1, 1, 1, 0, 1, 0, 1, 1]"
arco_pace1.jpg,1d6d804ea227f480c260dfd1b723169870ed872ead05377c120f9c9f3c383dd5,"[1, 1, 0, 0, 1, 1, 1, 1]"
arco_pace14.jpg,6d8d92d7c8fb480388567cd983add2541b074bc29b2229a15db293d2c4d8d21e,"[0, 1, 1, 1, 1, 0, 1, 1]"
arco_pace7.jpg,a7d4385c66d3b76d7101aa5f9b64ccfb09db46943d8bc1c2dad6124385c8b7c2,"[0, 0, 1, 1, 1, 1, 0, 1]"
arco_pace3.jpg,ba82dfc6d16d3eb0649cb0f16aee87ceed28314c308c2c1e4f36cb168a6f065c,"[1, 1, 0, 0, 1, 0, 1, 0]"
arco_pace2.jpg,6d8e19d729af93215d8701811b35fd9135783da0dbb80e51b59c5462098070ff,"[1, 1, 1, 0, 0, 0, 0, 1]"
arco_pace8.jpg,257d2ab2dbdb18a3f591784503289ae320a786571d7b6b04c5eae3c7a0338850,"[1, 0, 1, 1, 1, 1, 0, 1]"
