,il_bacio8.jpg,il_bacio0.jpg,il_bacio9.jpg,il_bacio12.jpg,il_bacio5.jpg,il_bacio13.jpg,il_bacio4.jpg,il_bacio6.jpg,il_bacio3.jpg,il_bacio1.jpg,il_bacio11.jpg,il_bacio10.jpg,il_bacio2.jpg,il_bacio14.jpg,il_bacio7.jpg
Type,Meta,Meta,Meta,Meta,Meta,Meta,Meta,Meta,Meta,Meta,Meta,Meta,Meta,Meta,Meta
il_bacio8.jpg,0,4,4,5,4,6,5,6,2,6,7,6,5,4,3
il_bacio0.jpg,4,0,3,5,3,7,5,4,4,6,5,6,4,3,2
il_bacio9.jpg,4,3,0,2,5,6,3,4,4,5,4,5,5,5,5
il_bacio12.jpg,5,5,2,0,6,6,4,3,5,5,5,6,4,5,6
il_bacio5.jpg,4,3,5,6,0,5,5,6,3,6,4,6,5,5,3
il_bacio13.jpg,6,7,6,6,5,0,6,6,4,5,5,4,7,6,5
il_bacio4.jpg,5,5,3,4,5,6,0,5,5,4,5,6,4,6,6
il_bacio6.jpg,6,4,4,3,6,6,5,0,6,4,4,6,5,4,5
il_bacio3.jpg,2,4,4,5,3,4,5,6,0,5,6,4,5,3,2
il_bacio1.jpg,6,6,5,5,6,5,4,4,5,0,4,4,4,5,5
il_bacio11.jpg,7,5,4,5,4,5,5,4,6,4,0,4,6,6,7
il_bacio10.jpg,6,6,5,6,6,4,6,6,4,4,4,0,6,6,6
il_bacio2.jpg,5,4,5,4,5,7,4,5,5,4,6,6,0,5,5
il_bacio14.jpg,4,3,5,5,5,6,6,4,3,5,6,6,5,0,2
il_bacio7.jpg,3,2,5,6,3,5,6,5,2,5,7,6,5,2,0
Type,R-Meta,R-Meta,R-Meta,R-Meta,R-Meta,R-Meta,R-Meta,R-Meta,R-Meta,R-Meta,R-Meta,R-Meta,R-Meta,R-Meta,R-Meta
il_bacio8.jpg,0,0,1,1,1,3,1,1,3,1,2,3,1,1,1
il_bacio0.jpg,0,0,1,1,1,3,1,1,3,1,2,3,1,1,1
il_bacio9.jpg,1,1,0,0,2,4,2,2,4,2,3,4,2,2,2
il_bacio12.jpg,1,1,0,0,2,4,2,2,4,2,3,4,2,2,2
il_bacio5.jpg,1,1,2,2,0,2,2,2,2,2,1,2,2,2,2
il_bacio13.jpg,3,3,4,4,2,0,2,2,0,2,1,0,2,2,2
il_bacio4.jpg,1,1,2,2,2,2,0,0,2,0,1,2,0,0,0
il_bacio6.jpg,1,1,2,2,2,2,0,0,2,0,1,2,0,0,0
il_bacio3.jpg,3,3,4,4,2,0,2,2,0,2,1,0,2,2,2
il_bacio1.jpg,1,1,2,2,2,2,0,0,2,0,1,2,0,0,0
il_bacio11.jpg,2,2,3,3,1,1,1,1,1,1,0,1,1,1,1
il_bacio10.jpg,3,3,4,4,2,0,2,2,0,2,1,0,2,2,2
il_bacio2.jpg,1,1,2,2,2,2,0,0,2,0,1,2,0,0,0
il_bacio14.jpg,1,1,2,2,2,2,0,0,2,0,1,2,0,0,0
il_bacio7.jpg,1,1,2,2,2,2,0,0,2,0,1,2,0,0,0
Type,Content,Content,Content,Content,Content,Content,Content,Content,Content,Content,Content,Content,Content,Content,Content
il_bacio8.jpg,0,12,11,12,13,12,11,11,11,10,9,12,11,12,11
il_bacio0.jpg,12,0,11,11,13,8,9,9,5,8,11,7,7,12,8
il_bacio9.jpg,11,11,0,8,13,11,11,12,11,12,9,11,12,11,12
il_bacio12.jpg,12,11,8,0,13,11,10,11,11,13,9,12,11,12,11
il_bacio5.jpg,13,13,13,13,0,12,12,11,13,12,13,12,12,12,13
il_bacio13.jpg,12,8,11,11,12,0,7,10,9,9,12,9,11,11,12
il_bacio4.jpg,11,9,11,10,12,7,0,8,9,10,10,10,9,12,10
il_bacio6.jpg,11,9,12,11,11,10,8,0,9,11,12,10,9,12,6
il_bacio3.jpg,11,5,11,11,13,9,9,9,0,7,12,8,6,12,7
il_bacio1.jpg,10,8,12,13,12,9,10,11,7,0,12,9,10,13,9
il_bacio11.jpg,9,11,9,9,13,12,10,12,12,12,0,12,11,13,12
il_bacio10.jpg,12,7,11,12,12,9,10,10,8,9,12,0,10,12,9
il_bacio2.jpg,11,7,12,11,12,11,9,9,6,10,11,10,0,12,9
il_bacio14.jpg,12,12,11,12,12,11,12,12,12,13,13,12,12,0,13
il_bacio7.jpg,11,8,12,11,13,12,10,6,7,9,12,9,9,13,0
Type,R-Content,R-Content,R-Content,R-Content,R-Content,R-Content,R-Content,R-Content,R-Content,R-Content,R-Content,R-Content,R-Content,R-Content,R-Content
il_bacio8.jpg,0,6,6,5,5,5,4,2,2,1,4,2,3,6,3
il_bacio0.jpg,6,0,6,3,7,5,4,4,4,7,4,4,3,6,7
il_bacio9.jpg,6,6,0,3,9,9,6,6,6,7,6,6,5,4,7
il_bacio12.jpg,5,3,3,0,8,6,3,5,5,6,3,5,4,7,6
il_bacio5.jpg,5,7,9,8,0,6,5,5,7,4,7,3,6,7,6
il_bacio13.jpg,5,5,9,6,6,0,3,3,5,6,3,5,4,7,8
il_bacio4.jpg,4,4,6,3,5,3,0,4,4,5,4,4,3,8,5
il_bacio6.jpg,2,4,6,5,5,3,4,0,2,3,2,2,1,4,5
il_bacio3.jpg,2,4,6,5,7,5,4,2,0,3,4,4,1,6,3
il_bacio1.jpg,1,7,7,6,4,6,5,3,3,0,5,3,4,7,2
il_bacio11.jpg,4,4,6,3,7,3,4,2,4,5,0,4,3,6,7
il_bacio10.jpg,2,4,6,5,3,5,4,2,4,3,4,0,3,6,5
il_bacio2.jpg,3,3,5,4,6,4,3,1,1,4,3,3,0,5,4
il_bacio14.jpg,6,6,4,7,7,7,8,4,6,7,6,6,5,0,9
il_bacio7.jpg,3,7,7,6,6,8,5,5,3,2,7,5,4,9,0
Type,Final-R,Final-R,Final-R,Final-R,Final-R,Final-R,Final-R,Final-R,Final-R,Final-R,Final-R,Final-R,Final-R,Final-R,Final-R
il_bacio8.jpg,0,6,6,5,5,5,4,2,2,1,4,2,3,6,3
il_bacio0.jpg,6,0,6,3,7,5,4,4,4,7,4,4,3,6,7
il_bacio9.jpg,6,6,0,3,9,9,6,6,6,7,6,6,5,4,7
il_bacio12.jpg,5,3,3,0,8,6,3,5,5,6,3,5,4,7,6
il_bacio5.jpg,5,7,9,8,0,6,5,5,7,4,7,3,6,7,6
il_bacio13.jpg,5,5,9,6,6,0,3,3,5,6,3,5,4,7,8
il_bacio4.jpg,4,4,6,3,5,3,0,4,4,5,4,4,3,8,5
il_bacio6.jpg,2,4,6,5,5,3,4,0,2,3,2,2,1,4,5
il_bacio3.jpg,2,4,6,5,7,5,4,2,0,3,4,4,1,6,3
il_bacio1.jpg,1,7,7,6,4,6,5,3,3,0,5,3,4,7,2
il_bacio11.jpg,4,4,6,3,7,3,4,2,4,5,0,4,3,6,7
il_bacio10.jpg,2,4,6,5,3,5,4,2,4,3,4,0,3,6,5
il_bacio2.jpg,3,3,5,4,6,4,3,1,1,4,3,3,0,5,4
il_bacio14.jpg,6,6,4,7,7,7,8,4,6,7,6,6,5,0,9
il_bacio7.jpg,3,7,7,6,6,8,5,5,3,2,7,5,4,9,0
