,torre_pisa0.jpg,torre_pisa5.jpg,torre_pisa11.jpg,torre_pisa13.jpg,torre_pisa12.jpg,torre_pisa3.jpg,torre_pisa4.jpg,torre_pisa10.jpg,torre_pisa7.jpg,torre_pisa1.jpg,torre_pisa6.jpg,torre_pisa9.jpg,torre_pisa8.jpg,torre_pisa2.jpg,torre_pisa14.jpg
Type,Meta,Meta,Meta,Meta,Meta,Meta,Meta,Meta,Meta,Meta,Meta,Meta,Meta,Meta,Meta
torre_pisa0.jpg,0,2,4,4,5,4,4,4,5,3,3,3,3,5,4
torre_pisa5.jpg,2,0,3,3,5,3,5,4,4,3,3,2,2,5,4
torre_pisa11.jpg,4,3,0,4,6,2,5,5,3,5,3,4,3,4,4
torre_pisa13.jpg,4,3,4,0,4,3,6,3,3,4,4,5,4,6,4
torre_pisa12.jpg,5,5,6,4,0,5,7,4,5,5,5,6,6,6,5
torre_pisa3.jpg,4,3,2,3,5,0,4,4,2,4,4,4,3,5,2
torre_pisa4.jpg,4,5,5,6,7,4,0,6,5,5,6,5,5,6,4
torre_pisa10.jpg,4,4,5,3,4,4,6,0,4,2,4,5,5,5,3
torre_pisa7.jpg,5,4,3,3,5,2,5,4,0,5,5,5,3,5,3
torre_pisa1.jpg,3,3,5,4,5,4,5,2,5,0,4,4,4,5,3
torre_pisa6.jpg,3,3,3,4,5,4,6,4,5,4,0,3,4,3,5
torre_pisa9.jpg,3,2,4,5,6,4,5,5,5,4,3,0,3,4,4
torre_pisa8.jpg,3,2,3,4,6,3,5,5,3,4,4,3,0,5,4
torre_pisa2.jpg,5,5,4,6,6,5,6,5,5,5,3,4,5,0,5
torre_pisa14.jpg,4,4,4,4,5,2,4,3,3,3,5,4,4,5,0
Type,R-Meta,R-Meta,R-Meta,R-Meta,R-Meta,R-Meta,R-Meta,R-Meta,R-Meta,R-Meta,R-Meta,R-Meta,R-Meta,R-Meta,R-Meta
torre_pisa0.jpg,0,1,2,2,2,1,1,1,0,0,2,1,0,4,0
torre_pisa5.jpg,1,0,3,1,3,2,2,2,1,1,3,0,1,5,1
torre_pisa11.jpg,2,3,0,2,2,1,3,1,2,2,0,3,2,2,2
torre_pisa13.jpg,2,1,2,0,2,3,3,1,2,2,2,1,2,4,2
torre_pisa12.jpg,2,3,2,2,0,3,3,1,2,2,2,3,2,2,2
torre_pisa3.jpg,1,2,1,3,3,0,2,2,1,1,1,2,1,3,1
torre_pisa4.jpg,1,2,3,3,3,2,0,2,1,1,3,2,1,5,1
torre_pisa10.jpg,1,2,1,1,1,2,2,0,1,1,1,2,1,3,1
torre_pisa7.jpg,0,1,2,2,2,1,1,1,0,0,2,1,0,4,0
torre_pisa1.jpg,0,1,2,2,2,1,1,1,0,0,2,1,0,4,0
torre_pisa6.jpg,2,3,0,2,2,1,3,1,2,2,0,3,2,2,2
torre_pisa9.jpg,1,0,3,1,3,2,2,2,1,1,3,0,1,5,1
torre_pisa8.jpg,0,1,2,2,2,1,1,1,0,0,2,1,0,4,0
torre_pisa2.jpg,4,5,2,4,2,3,5,3,4,4,2,5,4,0,4
torre_pisa14.jpg,0,1,2,2,2,1,1,1,0,0,2,1,0,4,0
Type,Content,Content,Content,Content,Content,Content,Content,Content,Content,Content,Content,Content,Content,Content,Content
torre_pisa0.jpg,0,13,13,13,11,13,11,12,12,13,12,13,12,11,12
torre_pisa5.jpg,13,0,13,13,13,12,12,12,13,12,12,13,12,13,13
torre_pisa11.jpg,13,13,0,12,13,13,13,13,13,13,12,12,9,12,13
torre_pisa13.jpg,13,13,12,0,13,13,13,13,12,13,13,13,13,12,13
torre_pisa12.jpg,11,13,13,13,0,13,11,13,13,12,13,13,12,12,13
torre_pisa3.jpg,13,12,13,13,13,0,13,13,11,13,11,12,13,11,13
torre_pisa4.jpg,11,12,13,13,11,13,0,12,13,13,12,12,12,13,13
torre_pisa10.jpg,12,12,13,13,13,13,12,0,13,13,11,11,13,13,13
torre_pisa7.jpg,12,13,13,12,13,11,13,13,0,13,13,13,13,12,11
torre_pisa1.jpg,13,12,13,13,12,13,13,13,13,0,13,13,13,13,13
torre_pisa6.jpg,12,12,12,13,13,11,12,11,13,13,0,12,12,13,12
torre_pisa9.jpg,13,13,12,13,13,12,12,11,13,13,12,0,11,12,13
torre_pisa8.jpg,12,12,9,13,12,13,12,13,13,13,12,11,0,13,13
torre_pisa2.jpg,11,13,12,12,12,11,13,13,12,13,13,12,13,0,12
torre_pisa14.jpg,12,13,13,13,13,13,13,13,11,13,12,13,13,12,0
Type,R-Content,R-Content,R-Content,R-Content,R-Content,R-Content,R-Content,R-Content,R-Content,R-Content,R-Content,R-Content,R-Content,R-Content,R-Content
torre_pisa0.jpg,0,7,7,6,6,7,5,3,6,10,9,7,5,5,4
torre_pisa5.jpg,7,0,6,3,7,8,6,6,9,7,8,6,8,8,7
torre_pisa11.jpg,7,6,0,7,3,4,10,8,5,9,4,4,2,6,5
torre_pisa13.jpg,6,3,7,0,8,7,5,5,8,10,7,7,7,7,8
torre_pisa12.jpg,6,7,3,8,0,3,9,7,6,6,7,1,3,5,4
torre_pisa3.jpg,7,8,4,7,3,0,8,6,5,7,4,4,2,6,7
torre_pisa4.jpg,5,6,10,5,9,8,0,6,7,7,8,8,8,8,5
torre_pisa10.jpg,3,6,8,5,7,6,6,0,9,9,8,8,8,8,7
torre_pisa7.jpg,6,9,5,8,6,5,7,9,0,10,7,7,3,5,8
torre_pisa1.jpg,10,7,9,10,6,7,7,9,10,0,7,5,9,7,6
torre_pisa6.jpg,9,8,4,7,7,4,8,8,7,7,0,8,4,8,7
torre_pisa9.jpg,7,6,4,7,1,4,8,8,7,5,8,0,4,4,5
torre_pisa8.jpg,5,8,2,7,3,2,8,8,3,9,4,4,0,4,5
torre_pisa2.jpg,5,8,6,7,5,6,8,8,5,7,8,4,4,0,7
torre_pisa14.jpg,4,7,5,8,4,7,5,7,8,6,7,5,5,7,0
Type,Final-R,Final-R,Final-R,Final-R,Final-R,Final-R,Final-R,Final-R,Final-R,Final-R,Final-R,Final-R,Final-R,Final-R,Final-R
torre_pisa0.jpg,0,3,4,4,4,5,5,2,5,6,6,4,3,6,1
torre_pisa5.jpg,3,0,5,1,5,6,4,5,6,5,7,3,4,7,2
torre_pisa11.jpg,4,5,0,4,2,3,5,6,3,8,2,4,1,4,3
torre_pisa13.jpg,4,1,4,0,4,5,3,6,5,6,6,2,3,6,3
torre_pisa12.jpg,4,5,2,4,0,3,5,4,5,6,4,2,3,4,3
torre_pisa3.jpg,5,6,3,5,3,0,4,3,4,5,3,3,2,5,4
torre_pisa4.jpg,5,4,5,3,5,4,0,5,4,5,5,3,4,7,4
torre_pisa10.jpg,2,5,6,6,4,3,5,0,7,4,6,4,5,6,3
torre_pisa7.jpg,5,6,3,5,5,4,4,7,0,7,5,5,2,5,4
torre_pisa1.jpg,6,5,8,6,6,5,5,4,7,0,6,4,7,6,5
torre_pisa6.jpg,6,7,2,6,4,3,5,6,5,6,0,6,3,6,5
torre_pisa9.jpg,4,3,4,2,2,3,3,4,5,4,6,0,3,4,3
torre_pisa8.jpg,3,4,1,3,3,2,4,5,2,7,3,3,0,5,2
torre_pisa2.jpg,6,7,4,6,4,5,7,6,5,6,6,4,5,0,7
torre_pisa14.jpg,1,2,3,3,3,4,4,3,4,5,5,3,2,7,0
