,torre_pisa3.jpg,torre_pisa0.jpg,torre_pisa4.jpg,torre_pisa14.jpg,torre_pisa1.jpg,torre_pisa6.jpg,torre_pisa12.jpg,torre_pisa13.jpg,torre_pisa9.jpg,torre_pisa5.jpg,torre_pisa7.jpg,torre_pisa2.jpg,torre_pisa10.jpg,torre_pisa11.jpg,torre_pisa8.jpg
Type,Meta,Meta,Meta,Meta,Meta,Meta,Meta,Meta,Meta,Meta,Meta,Meta,Meta,Meta,Meta
torre_pisa3.jpg,0,4,4,2,4,4,5,3,4,3,2,5,4,2,3
torre_pisa0.jpg,4,0,4,4,3,3,5,4,3,2,5,5,4,4,3
torre_pisa4.jpg,4,4,0,4,5,6,7,6,5,5,5,6,6,5,5
torre_pisa14.jpg,2,4,4,0,3,5,5,4,4,4,3,5,3,4,4
torre_pisa1.jpg,4,3,5,3,0,4,5,4,4,3,5,5,2,5,4
torre_pisa6.jpg,4,3,6,5,4,0,5,4,3,3,5,3,4,3,4
torre_pisa12.jpg,5,5,7,5,5,5,0,4,6,5,5,6,4,6,6
torre_pisa13.jpg,3,4,6,4,4,4,4,0,5,3,3,6,3,4,4
torre_pisa9.jpg,4,3,5,4,4,3,6,5,0,2,5,4,5,4,3
torre_pisa5.jpg,3,2,5,4,3,3,5,3,2,0,4,5,4,3,2
torre_pisa7.jpg,2,5,5,3,5,5,5,3,5,4,0,5,4,3,3
torre_pisa2.jpg,5,5,6,5,5,3,6,6,4,5,5,0,5,4,5
torre_pisa10.jpg,4,4,6,3,2,4,4,3,5,4,4,5,0,5,5
torre_pisa11.jpg,2,4,5,4,5,3,6,4,4,3,3,4,5,0,3
torre_pisa8.jpg,3,3,5,4,4,4,6,4,3,2,3,5,5,3,0
Type,R-Meta,R-Meta,R-Meta,R-Meta,R-Meta,R-Meta,R-Meta,R-Meta,R-Meta,R-Meta,R-Meta,R-Meta,R-Meta,R-Meta,R-Meta
torre_pisa3.jpg,0,1,3,2,2,1,4,4,2,2,3,4,4,2,2
torre_pisa0.jpg,1,0,2,1,1,2,3,3,1,1,2,5,3,3,1
torre_pisa4.jpg,3,2,0,3,3,4,5,5,3,3,4,7,5,5,3
torre_pisa14.jpg,2,1,3,0,2,3,4,4,2,2,3,6,4,4,2
torre_pisa1.jpg,2,1,3,2,0,3,2,4,2,2,3,4,2,4,2
torre_pisa6.jpg,1,2,4,3,3,0,3,3,3,3,2,3,3,1,3
torre_pisa12.jpg,4,3,5,4,2,3,0,4,4,4,3,2,2,4,4
torre_pisa13.jpg,4,3,5,4,4,3,4,0,2,2,3,6,4,4,4
torre_pisa9.jpg,2,1,3,2,2,3,4,2,0,0,3,6,4,4,2
torre_pisa5.jpg,2,1,3,2,2,3,4,2,0,0,3,6,4,4,2
torre_pisa7.jpg,3,2,4,3,3,2,3,3,3,3,0,5,1,3,1
torre_pisa2.jpg,4,5,7,6,4,3,2,6,6,6,5,0,4,4,6
torre_pisa10.jpg,4,3,5,4,2,3,2,4,4,4,1,4,0,4,2
torre_pisa11.jpg,2,3,5,4,4,1,4,4,4,4,3,4,4,0,4
torre_pisa8.jpg,2,1,3,2,2,3,4,4,2,2,1,6,2,4,0
Type,Content,Content,Content,Content,Content,Content,Content,Content,Content,Content,Content,Content,Content,Content,Content
torre_pisa3.jpg,0,13,13,13,13,11,13,13,12,12,11,11,13,13,13
torre_pisa0.jpg,13,0,11,12,13,12,11,13,13,13,12,11,12,13,12
torre_pisa4.jpg,13,11,0,13,13,12,11,13,12,12,13,13,12,13,12
torre_pisa14.jpg,13,12,13,0,13,12,13,13,13,13,11,12,13,13,13
torre_pisa1.jpg,13,13,13,13,0,13,12,13,13,12,13,13,13,13,13
torre_pisa6.jpg,11,12,12,12,13,0,13,13,12,12,13,13,11,12,12
torre_pisa12.jpg,13,11,11,13,12,13,0,13,13,13,13,12,13,13,12
torre_pisa13.jpg,13,13,13,13,13,13,13,0,13,13,12,12,13,12,13
torre_pisa9.jpg,12,13,12,13,13,12,13,13,0,13,13,12,11,12,11
torre_pisa5.jpg,12,13,12,13,12,12,13,13,13,0,13,13,12,13,12
torre_pisa7.jpg,11,12,13,11,13,13,13,12,13,13,0,12,13,13,13
torre_pisa2.jpg,11,11,13,12,13,13,12,12,12,13,12,0,13,12,13
torre_pisa10.jpg,13,12,12,13,13,11,13,13,11,12,13,13,0,13,13
torre_pisa11.jpg,13,13,13,13,13,12,13,12,12,13,13,12,13,0,9
torre_pisa8.jpg,13,12,12,13,13,12,12,13,11,12,13,13,13,9,0
Type,R-Content,R-Content,R-Content,R-Content,R-Content,R-Content,R-Content,R-Content,R-Content,R-Content,R-Content,R-Content,R-Content,R-Content,R-Content
torre_pisa3.jpg,0,10,11,11,10,8,5,10,7,11,11,10,8,7,6
torre_pisa0.jpg,10,0,9,9,12,12,9,10,9,9,7,6,6,11,8
torre_pisa4.jpg,11,9,0,10,9,13,10,9,10,8,8,9,7,12,11
torre_pisa14.jpg,11,9,10,0,11,11,8,13,8,10,10,9,9,10,9
torre_pisa1.jpg,10,12,9,11,0,12,7,12,11,11,11,10,10,11,12
torre_pisa6.jpg,8,12,13,11,12,0,11,8,11,11,11,10,10,5,6
torre_pisa12.jpg,5,9,10,8,7,11,0,11,6,8,10,9,7,6,7
torre_pisa13.jpg,10,10,9,13,12,8,11,0,11,9,9,10,10,7,8
torre_pisa9.jpg,7,9,10,8,11,11,6,11,0,10,8,5,9,10,7
torre_pisa5.jpg,11,9,8,10,11,11,8,9,10,0,10,9,7,10,11
torre_pisa7.jpg,11,7,8,10,11,11,10,9,8,10,0,5,9,10,7
torre_pisa2.jpg,10,6,9,9,10,10,9,10,5,9,5,0,8,9,6
torre_pisa10.jpg,8,6,7,9,10,10,7,10,9,7,9,8,0,11,10
torre_pisa11.jpg,7,11,12,10,11,5,6,7,10,10,10,9,11,0,3
torre_pisa8.jpg,6,8,11,9,12,6,7,8,7,11,7,6,10,3,0
Type,Final-R,Final-R,Final-R,Final-R,Final-R,Final-R,Final-R,Final-R,Final-R,Final-R,Final-R,Final-R,Final-R,Final-R,Final-R
torre_pisa3.jpg,0,10,11,11,10,8,5,10,7,11,11,10,8,7,6
torre_pisa0.jpg,10,0,9,9,12,12,9,10,9,9,7,6,6,11,8
torre_pisa4.jpg,11,9,0,10,9,13,10,9,10,8,8,9,7,12,11
torre_pisa14.jpg,11,9,10,0,11,11,8,13,8,10,10,9,9,10,9
torre_pisa1.jpg,10,12,9,11,0,12,7,12,11,11,11,10,10,11,12
torre_pisa6.jpg,8,12,13,11,12,0,11,8,11,11,11,10,10,5,6
torre_pisa12.jpg,5,9,10,8,7,11,0,11,6,8,10,9,7,6,7
torre_pisa13.jpg,10,10,9,13,12,8,11,0,11,9,9,10,10,7,8
torre_pisa9.jpg,7,9,10,8,11,11,6,11,0,10,8,5,9,10,7
torre_pisa5.jpg,11,9,8,10,11,11,8,9,10,0,10,9,7,10,11
torre_pisa7.jpg,11,7,8,10,11,11,10,9,8,10,0,5,9,10,7
torre_pisa2.jpg,10,6,9,9,10,10,9,10,5,9,5,0,8,9,6
torre_pisa10.jpg,8,6,7,9,10,10,7,10,9,7,9,8,0,11,10
torre_pisa11.jpg,7,11,12,10,11,5,6,7,10,10,10,9,11,0,3
torre_pisa8.jpg,6,8,11,9,12,6,7,8,7,11,7,6,10,3,0
