,basilica_santa_croce12.jpg,basilica_santa_croce9.jpg,basilica_santa_croce5.jpg,basilica_santa_croce0.jpg,basilica_santa_croce8.jpg,basilica_santa_croce4.jpg,basilica_santa_croce13.jpg,basilica_santa_croce7.jpg,basilica_santa_croce1.jpg,basilica_santa_croce10.jpg,basilica_santa_croce11.jpg,basilica_santa_croce6.jpg,basilica_santa_croce3.jpg,basilica_santa_croce2.jpg,basilica_santa_croce14.jpg
Type,SHA256,SHA256,SHA256,SHA256,SHA256,SHA256,SHA256,SHA256,SHA256,SHA256,SHA256,SHA256,SHA256,SHA256,SHA256
basilica_santa_croce12.jpg,0,60,59,59,59,55,62,63,61,62,60,64,61,61,61
basilica_santa_croce9.jpg,60,0,58,60,61,57,63,61,60,60,60,58,61,59,60
basilica_santa_croce5.jpg,59,58,0,62,59,58,61,61,57,59,62,62,61,60,61
basilica_santa_croce0.jpg,59,60,62,0,59,61,58,62,62,59,58,63,63,60,62
basilica_santa_croce8.jpg,59,61,59,59,0,57,63,60,60,61,60,59,60,60,59
basilica_santa_croce4.jpg,55,57,58,61,57,0,60,59,62,62,55,60,61,62,61
basilica_santa_croce13.jpg,62,63,61,58,63,60,0,63,62,58,58,60,61,59,61
basilica_santa_croce7.jpg,63,61,61,62,60,59,63,0,61,58,58,60,63,64,58
basilica_santa_croce1.jpg,61,60,57,62,60,62,62,61,0,60,58,62,60,61,60
basilica_santa_croce10.jpg,62,60,59,59,61,62,58,58,60,0,62,59,63,61,62
basilica_santa_croce11.jpg,60,60,62,58,60,55,58,58,58,62,0,58,59,61,56
basilica_santa_croce6.jpg,64,58,62,63,59,60,60,60,62,59,58,0,61,63,61
basilica_santa_croce3.jpg,61,61,61,63,60,61,61,63,60,63,59,61,0,59,61
basilica_santa_croce2.jpg,61,59,60,60,60,62,59,64,61,61,61,63,59,0,60
basilica_santa_croce14.jpg,61,60,61,62,59,61,61,58,60,62,56,61,61,60,0
Type,Final-R,Final-R,Final-R,Final-R,Final-R,Final-R,Final-R,Final-R,Final-R,Final-R,Final-R,Final-R,Final-R,Final-R,Final-R
basilica_santa_croce12.jpg,0,2,3,5,6,1,2,5,6,6,3,4,5,4,5
basilica_santa_croce9.jpg,2,0,3,5,4,1,4,7,4,6,3,4,7,2,3
basilica_santa_croce5.jpg,3,3,0,6,5,2,5,4,5,5,6,5,4,1,2
basilica_santa_croce0.jpg,5,5,6,0,5,6,3,2,5,3,4,5,2,5,4
basilica_santa_croce8.jpg,6,4,5,5,0,5,4,5,2,4,3,2,5,4,5
basilica_santa_croce4.jpg,1,1,2,6,5,0,3,6,5,7,4,5,6,3,4
basilica_santa_croce13.jpg,2,4,5,3,4,3,0,3,6,6,3,4,3,6,7
basilica_santa_croce7.jpg,5,7,4,2,5,6,3,0,5,3,6,5,0,5,4
basilica_santa_croce1.jpg,6,4,5,5,2,5,6,5,0,2,5,4,5,4,3
basilica_santa_croce10.jpg,6,6,5,3,4,7,6,3,2,0,5,4,3,4,3
basilica_santa_croce11.jpg,3,3,6,4,3,4,3,6,5,5,0,1,6,5,6
basilica_santa_croce6.jpg,4,4,5,5,2,5,4,5,4,4,1,0,5,4,5
basilica_santa_croce3.jpg,5,7,4,2,5,6,3,0,5,3,6,5,0,5,4
basilica_santa_croce2.jpg,4,2,1,5,4,3,6,5,4,4,5,4,5,0,1
basilica_santa_croce14.jpg,5,3,2,4,5,4,7,4,3,3,6,5,4,1,0
