Img-Name,SHA256,Final-R
basilica_san_marco8.jpg,669de5c42e6a7eae60c740808d56450a69a9b1a498de764bd64ed07fd3e82a1a,"[1, 0, 0, 0, 1, 0, 0, 0, 0, 0, 1, 1, 0, 0, 1, 0, 0, 0, 0, 0, 0, 0, 0, 0, 0, 0, 1, 0, 0, 0, 0, 1]"
basilica_san_marco4.jpg,82e8984d7696b4ea1b37bde4a0cd234619d43af804a56acede839b9799db7e98,"[0, 0, 0, 0, 1, 0, 1, 0, 0, 0, 1, 0, 0, 1, 1, 0, 0, 0, 0, 0, 0, 0, 0, 1, 1, 0, 0, 0, 0, 0, 0, 0]"
basilica_san_marco1.jpg,4c53533467dd95f62191c416367f30a67a52355ef6495ff63da8a66b3d37d735,"[0, 0, 0, 0, 0, 0, 1, 0, 0, 0, 0, 1, 0, 0, 0, 0, 0, 0, 0, 0, 1, 1, 1, 0, 0, 0, 0, 0, 0, 0, 1, 0]"
basilica_san_marco6.jpg,645f87c38f0eb14a8e1299269ce18171c1d640a875964c06840c2f43773f03fe,"[0, 0, 0, 1, 0, 0, 1, 0, 1, 0, 1, 0, 0, 0, 0, 0, 0, 1, 0, 0, 0, 0, 0, 0, 0, 0, 0, 0, 0, 0, 1, 0]"
basilica_san_marco14.jpg,3b872654d91baea4f46bad0d8c558480fcd12f3983a0eb5f433f5ae7735dd111,"[1, 0, 0, 0, 1, 0, 0, 1, 0, 0, 0, 0, 0, 1, 0, 0, 0, 1, 0, 0, 1, 0, 0, 0, 0, 1, 0, 0, 0, 0, 0, 1]"
basilica_san_marco7.jpg,19e1295ec50974878d0dc0bdb4b8de6601e560148b98bad1f6f8f9dc723e3b2b,"[0, 0, 0, 0, 0, 0, 1, 1, 0, 0, 0, 1, 0, 0, 0, 0, 0, 1, 0, 0, 1, 0, 0, 0, 0, 0, 0, 0, 1, 1, 1, 0]"
basilica_san_marco2.jpg,f50967f94d67c87fb70d23b8b9431ff09703af7bef20365f0c6057ccc725602b,"[0, 0, 0, 0, 0, 0, 0, 0, 0, 0, 0, 1, 1, 0, 0, 0, 1, 0, 0, 0, 0, 0, 0, 0, 1, 1, 0, 1, 0, 0, 0, 1]"
basilica_san_marco10.jpg,b62d35fd58ae9f0cc4c636e69f968f6b34ef5a61f40bcde5e60334c421511a65,"[0, 1, 0, 0, 1, 1, 1, 0, 0, 0, 0, 1, 1, 0, 0, 0, 0, 0, 0, 0, 0, 0, 0, 0, 0, 0, 0, 0, 0, 1, 0, 0]"
basilica_san_marco11.jpg,23edd872a6a1d8f65669de3637d06a5e1c46bd5e33ae04d1630f889feabb897f,"[0, 0, 0, 0, 0, 0, 0, 0, 0, 0, 0, 0, 0, 0, 0, 0, 0, 1, 1, 0, 0, 0, 1, 0, 0, 0, 0, 0, 0, 0, 1, 1]"
basilica_san_marco0.jpg,1467b62cdab8c8550ee8e8b57c44d6f6b5c14337b82aa7114402197f8b56117d,"[0, 0, 0, 0, 0, 0, 0, 0, 0, 0, 0, 0, 1, 0, 0, 0, 0, 1, 0, 0, 0, 1, 1, 1, 0, 0, 0, 0, 0, 1, 0, 1]"
basilica_san_marco3.jpg,918f53a91e261c50b1373b2de5cc03a166365235f20445341eb1794c07d07b16,"[0, 1, 0, 0, 0, 0, 0, 0, 0, 1, 0, 0, 1, 1, 0, 0, 1, 0, 0, 0, 1, 1, 1, 0, 0, 0, 0, 0, 0, 0, 0, 0]"
basilica_san_marco13.jpg,203aa1e95f643facff9ee294e79aa3d9b32763803bff5d74d41290f2c6f58893,"[1, 0, 0, 0, 0, 0, 0, 0, 0, 1, 0, 0, 1, 0, 0, 0, 0, 0, 1, 1, 1, 0, 0, 0, 0, 1, 0, 0, 0, 0, 0, 0]"
basilica_san_marco12.jpg,17193a95ca29a0389946b3ffe48ce78a457ebaf6114d85e55e4b7963d8f57eb8,"[0, 0, 0, 1, 0, 1, 0, 0, 0, 0, 1, 0, 0, 0, 0, 0, 0, 0, 0, 0, 0, 1, 1, 0, 1, 0, 0, 0, 0, 0, 0, 1]"
basilica_san_marco9.jpg,440b52d2891a89b4a6afe662863cfb17187ebd085ea9c2fbc754a2e4f42badc8,"[0, 0, 1, 0, 1, 0, 0, 0, 1, 0, 0, 0, 0, 0, 0, 0, 0, 0, 1, 0, 1, 0, 0, 1, 0, 0, 0, 1, 0, 0, 0, 0]"
basilica_san_marco5.jpg,aa8f0137c7628f6803a9be00294ffd1b423344dd3f13fa9ad1b5abdf2085158a,"[1, 0, 0, 0, 0, 0, 0, 0, 1, 0, 1, 0, 0, 0, 0, 0, 0, 0, 0, 0, 0, 0, 0, 1, 0, 0, 1, 1, 0, 1, 0, 1]"
