,lavorare_preferisco_mare7.jpg,lavorare_preferisco_mare6.jpg,lavorare_preferisco_mare4.jpg,lavorare_preferisco_mare1.jpg,lavorare_preferisco_mare11.jpg,lavorare_preferisco_mare10.jpg,lavorare_preferisco_mare9.jpg,lavorare_preferisco_mare13.jpg,lavorare_preferisco_mare12.jpg,lavorare_preferisco_mare3.jpg,lavorare_preferisco_mare5.jpg,lavorare_preferisco_mare8.jpg,lavorare_preferisco_mare0.jpg,lavorare_preferisco_mare2.jpg,lavorare_preferisco_mare14.jpg
Type,SHA256,SHA256,SHA256,SHA256,SHA256,SHA256,SHA256,SHA256,SHA256,SHA256,SHA256,SHA256,SHA256,SHA256,SHA256
lavorare_preferisco_mare7.jpg,0,63,59,57,59,61,60,62,59,60,59,59,59,62,56
lavorare_preferisco_mare6.jpg,63,0,59,61,63,59,60,61,58,62,57,61,57,62,61
lavorare_preferisco_mare4.jpg,59,59,0,57,60,60,63,60,60,58,60,57,63,62,62
lavorare_preferisco_mare1.jpg,57,61,57,0,60,59,61,61,60,58,59,61,61,61,59
lavorare_preferisco_mare11.jpg,59,63,60,60,0,61,60,60,59,61,60,61,59,63,61
lavorare_preferisco_mare10.jpg,61,59,60,59,61,0,59,62,58,60,59,59,60,63,60
lavorare_preferisco_mare9.jpg,60,60,63,61,60,59,0,61,61,62,60,61,60,62,64
lavorare_preferisco_mare13.jpg,62,61,60,61,60,62,61,0,60,61,61,62,57,58,58
lavorare_preferisco_mare12.jpg,59,58,60,60,59,58,61,60,0,62,57,57,58,61,61
lavorare_preferisco_mare3.jpg,60,62,58,58,61,60,62,61,62,0,59,58,61,60,60
lavorare_preferisco_mare5.jpg,59,57,60,59,60,59,60,61,57,59,0,60,59,63,59
lavorare_preferisco_mare8.jpg,59,61,57,61,61,59,61,62,57,58,60,0,61,59,60
lavorare_preferisco_mare0.jpg,59,57,63,61,59,60,60,57,58,61,59,61,0,57,60
lavorare_preferisco_mare2.jpg,62,62,62,61,63,63,62,58,61,60,63,59,57,0,57
lavorare_preferisco_mare14.jpg,56,61,62,59,61,60,64,58,61,60,59,60,60,57,0
Type,Final-R,Final-R,Final-R,Final-R,Final-R,Final-R,Final-R,Final-R,Final-R,Final-R,Final-R,Final-R,Final-R,Final-R,Final-R
lavorare_preferisco_mare7.jpg,0,10,7,8,8,8,11,9,7,7,8,11,7,7,8
lavorare_preferisco_mare6.jpg,10,0,7,8,8,8,7,9,5,7,6,9,11,11,4
lavorare_preferisco_mare4.jpg,7,7,0,9,3,7,8,6,8,8,11,8,4,10,5
lavorare_preferisco_mare1.jpg,8,8,9,0,10,10,9,5,11,5,6,7,5,5,12
lavorare_preferisco_mare11.jpg,8,8,3,10,0,8,7,9,5,9,10,7,5,9,6
lavorare_preferisco_mare10.jpg,8,8,7,10,8,0,9,7,9,7,8,9,9,7,8
lavorare_preferisco_mare9.jpg,11,7,8,9,7,9,0,8,6,8,7,6,10,8,5
lavorare_preferisco_mare13.jpg,9,9,6,5,9,7,8,0,10,6,9,6,6,8,9
lavorare_preferisco_mare12.jpg,7,5,8,11,5,9,6,10,0,8,5,8,10,8,3
lavorare_preferisco_mare3.jpg,7,7,8,5,9,7,8,6,8,0,7,10,8,8,7
lavorare_preferisco_mare5.jpg,8,6,11,6,10,8,7,9,5,7,0,9,7,5,6
lavorare_preferisco_mare8.jpg,11,9,8,7,7,9,6,6,8,10,9,0,8,8,9
lavorare_preferisco_mare0.jpg,7,11,4,5,5,9,10,6,10,8,7,8,0,6,9
lavorare_preferisco_mare2.jpg,7,11,10,5,9,7,8,8,8,8,5,8,6,0,11
lavorare_preferisco_mare14.jpg,8,4,5,12,6,8,5,9,3,7,6,9,9,11,0
