,obelisco_wash_dc2.jpg,obelisco_wash_dc11.jpg,obelisco_wash_dc9.jpg,obelisco_wash_dc5.jpg,obelisco_wash_dc14.jpg,obelisco_wash_dc13.jpg,obelisco_wash_dc3.jpg,obelisco_wash_dc8.jpg,obelisco_wash_dc6.jpg,obelisco_wash_dc4.jpg,obelisco_wash_dc1.jpg,obelisco_wash_dc12.jpg,obelisco_wash_dc0.jpg,obelisco_wash_dc10.jpg,obelisco_wash_dc7.jpg
Type,Meta,Meta,Meta,Meta,Meta,Meta,Meta,Meta,Meta,Meta,Meta,Meta,Meta,Meta,Meta
obelisco_wash_dc2.jpg,0,4,3,4,3,3,4,3,4,4,4,4,5,6,2
obelisco_wash_dc11.jpg,4,0,4,2,5,2,4,5,3,4,2,2,4,3,5
obelisco_wash_dc9.jpg,3,4,0,3,3,3,3,3,4,3,3,3,4,6,4
obelisco_wash_dc5.jpg,4,2,3,0,4,3,3,4,4,3,1,1,3,4,5
obelisco_wash_dc14.jpg,3,5,3,4,0,4,3,1,4,3,4,4,4,5,2
obelisco_wash_dc13.jpg,3,2,3,3,4,0,2,4,2,3,3,3,3,3,3
obelisco_wash_dc3.jpg,4,4,3,3,3,2,0,2,2,2,3,3,2,4,3
obelisco_wash_dc8.jpg,3,5,3,4,1,4,2,0,3,3,4,4,4,6,3
obelisco_wash_dc6.jpg,4,3,4,4,4,2,2,3,0,3,4,4,4,4,4
obelisco_wash_dc4.jpg,4,4,3,3,3,3,2,3,3,0,3,3,2,5,4
obelisco_wash_dc1.jpg,4,2,3,1,4,3,3,4,4,3,0,0,3,4,5
obelisco_wash_dc12.jpg,4,2,3,1,4,3,3,4,4,3,0,0,3,4,5
obelisco_wash_dc0.jpg,5,4,4,3,4,3,2,4,4,2,3,3,0,4,4
obelisco_wash_dc10.jpg,6,3,6,4,5,3,4,6,4,5,4,4,4,0,4
obelisco_wash_dc7.jpg,2,5,4,5,2,3,3,3,4,4,5,5,4,4,0
Type,R-Meta,R-Meta,R-Meta,R-Meta,R-Meta,R-Meta,R-Meta,R-Meta,R-Meta,R-Meta,R-Meta,R-Meta,R-Meta,R-Meta,R-Meta
obelisco_wash_dc2.jpg,0,2,2,2,2,2,2,2,2,2,2,2,2,4,0
obelisco_wash_dc11.jpg,2,0,2,2,2,2,2,2,0,2,2,2,2,4,2
obelisco_wash_dc9.jpg,2,2,0,2,2,2,2,2,2,2,2,2,2,4,2
obelisco_wash_dc5.jpg,2,2,2,0,0,2,0,0,2,2,0,0,0,4,2
obelisco_wash_dc14.jpg,2,2,2,0,0,2,0,0,2,2,0,0,0,4,2
obelisco_wash_dc13.jpg,2,2,2,2,2,0,2,2,2,2,2,2,2,2,2
obelisco_wash_dc3.jpg,2,2,2,0,0,2,0,0,2,2,0,0,0,4,2
obelisco_wash_dc8.jpg,2,2,2,0,0,2,0,0,2,2,0,0,0,4,2
obelisco_wash_dc6.jpg,2,0,2,2,2,2,2,2,0,2,2,2,2,4,2
obelisco_wash_dc4.jpg,2,2,2,2,2,2,2,2,2,0,2,2,2,4,2
obelisco_wash_dc1.jpg,2,2,2,0,0,2,0,0,2,2,0,0,0,4,2
obelisco_wash_dc12.jpg,2,2,2,0,0,2,0,0,2,2,0,0,0,4,2
obelisco_wash_dc0.jpg,2,2,2,0,0,2,0,0,2,2,0,0,0,4,2
obelisco_wash_dc10.jpg,4,4,4,4,4,2,4,4,4,4,4,4,4,0,4
obelisco_wash_dc7.jpg,0,2,2,2,2,2,2,2,2,2,2,2,2,4,0
Type,Content,Content,Content,Content,Content,Content,Content,Content,Content,Content,Content,Content,Content,Content,Content
obelisco_wash_dc2.jpg,0,13,13,13,11,13,12,13,11,13,13,13,12,11,12
obelisco_wash_dc11.jpg,13,0,12,13,13,11,12,13,13,11,13,13,13,13,12
obelisco_wash_dc9.jpg,13,12,0,13,13,13,13,13,13,12,13,13,13,11,13
obelisco_wash_dc5.jpg,13,13,13,0,13,13,13,12,13,13,13,13,13,13,13
obelisco_wash_dc14.jpg,11,13,13,13,0,13,12,13,12,13,12,12,12,12,13
obelisco_wash_dc13.jpg,13,11,13,13,13,0,13,12,13,13,12,12,13,12,10
obelisco_wash_dc3.jpg,12,12,13,13,12,13,0,12,12,12,12,13,13,11,13
obelisco_wash_dc8.jpg,13,13,13,12,13,12,12,0,13,12,12,13,13,13,13
obelisco_wash_dc6.jpg,11,13,13,13,12,13,12,13,0,12,13,13,13,10,12
obelisco_wash_dc4.jpg,13,11,12,13,13,13,12,12,12,0,11,13,13,13,13
obelisco_wash_dc1.jpg,13,13,13,13,12,12,12,12,13,11,0,11,13,13,12
obelisco_wash_dc12.jpg,13,13,13,13,12,12,13,13,13,13,11,0,13,13,12
obelisco_wash_dc0.jpg,12,13,13,13,12,13,13,13,13,13,13,13,0,13,13
obelisco_wash_dc10.jpg,11,13,11,13,12,12,11,13,10,13,13,13,13,0,13
obelisco_wash_dc7.jpg,12,12,13,13,13,10,13,13,12,13,12,12,13,13,0
Type,R-Content,R-Content,R-Content,R-Content,R-Content,R-Content,R-Content,R-Content,R-Content,R-Content,R-Content,R-Content,R-Content,R-Content,R-Content
obelisco_wash_dc2.jpg,0,8,8,8,6,8,6,8,6,8,8,6,8,6,6
obelisco_wash_dc11.jpg,8,0,4,8,8,8,8,8,8,6,8,8,8,8,8
obelisco_wash_dc9.jpg,8,4,0,8,8,8,8,8,8,6,8,8,8,8,8
obelisco_wash_dc5.jpg,8,8,8,0,8,8,8,6,8,8,8,8,8,8,8
obelisco_wash_dc14.jpg,6,8,8,8,0,8,6,8,6,8,8,6,8,6,8
obelisco_wash_dc13.jpg,8,8,8,8,8,0,8,8,8,8,6,6,8,8,4
obelisco_wash_dc3.jpg,6,8,8,8,6,8,0,8,6,8,8,6,8,4,8
obelisco_wash_dc8.jpg,8,8,8,6,8,8,8,0,8,8,8,8,8,8,8
obelisco_wash_dc6.jpg,6,8,8,8,6,8,6,8,0,6,6,6,8,6,6
obelisco_wash_dc4.jpg,8,6,6,8,8,8,8,8,6,0,8,8,8,8,8
obelisco_wash_dc1.jpg,8,8,8,8,8,6,8,8,6,8,0,6,8,8,6
obelisco_wash_dc12.jpg,6,8,8,8,6,6,6,8,6,8,6,0,8,6,6
obelisco_wash_dc0.jpg,8,8,8,8,8,8,8,8,8,8,8,8,0,8,8
obelisco_wash_dc10.jpg,6,8,8,8,6,8,4,8,6,8,8,6,8,0,8
obelisco_wash_dc7.jpg,6,8,8,8,8,4,8,8,6,8,6,6,8,8,0
Type,Final-R,Final-R,Final-R,Final-R,Final-R,Final-R,Final-R,Final-R,Final-R,Final-R,Final-R,Final-R,Final-R,Final-R,Final-R
obelisco_wash_dc2.jpg,0,8,8,8,6,8,6,8,6,8,8,6,8,6,6
obelisco_wash_dc11.jpg,8,0,4,8,8,8,8,8,8,6,8,8,8,8,8
obelisco_wash_dc9.jpg,8,4,0,8,8,8,8,8,8,6,8,8,8,8,8
obelisco_wash_dc5.jpg,8,8,8,0,8,8,8,6,8,8,8,8,8,8,8
obelisco_wash_dc14.jpg,6,8,8,8,0,8,6,8,6,8,8,6,8,6,8
obelisco_wash_dc13.jpg,8,8,8,8,8,0,8,8,8,8,6,6,8,8,4
obelisco_wash_dc3.jpg,6,8,8,8,6,8,0,8,6,8,8,6,8,4,8
obelisco_wash_dc8.jpg,8,8,8,6,8,8,8,0,8,8,8,8,8,8,8
obelisco_wash_dc6.jpg,6,8,8,8,6,8,6,8,0,6,6,6,8,6,6
obelisco_wash_dc4.jpg,8,6,6,8,8,8,8,8,6,0,8,8,8,8,8
obelisco_wash_dc1.jpg,8,8,8,8,8,6,8,8,6,8,0,6,8,8,6
obelisco_wash_dc12.jpg,6,8,8,8,6,6,6,8,6,8,6,0,8,6,6
obelisco_wash_dc0.jpg,8,8,8,8,8,8,8,8,8,8,8,8,0,8,8
obelisco_wash_dc10.jpg,6,8,8,8,6,8,4,8,6,8,8,6,8,0,8
obelisco_wash_dc7.jpg,6,8,8,8,8,4,8,8,6,8,6,6,8,8,0
