,colosseo13.jpg,colosseo4.jpg,colosseo9.jpg,colosseo3.jpg,colosseo12.jpg,colosseo7.jpg,colosseo14.jpg,colosseo2.jpg,colosseo0.jpg,colosseo5.jpg,colosseo8.jpg,colosseo6.jpg,colosseo10.jpg,colosseo11.jpg,colosseo1.jpg
Type,Meta,Meta,Meta,Meta,Meta,Meta,Meta,Meta,Meta,Meta,Meta,Meta,Meta,Meta,Meta
colosseo13.jpg,0,5,5,3,3,5,4,4,5,5,5,6,4,4,5
colosseo4.jpg,5,0,3,4,3,3,5,5,5,3,4,4,4,5,5
colosseo9.jpg,5,3,0,5,4,4,4,5,3,6,5,5,3,4,6
colosseo3.jpg,3,4,5,0,3,5,4,4,4,3,5,6,4,4,6
colosseo12.jpg,3,3,4,3,0,5,3,4,5,5,4,6,4,3,4
colosseo7.jpg,5,3,4,5,5,0,4,4,4,5,2,3,3,4,4
colosseo14.jpg,4,5,4,4,3,4,0,4,3,6,3,6,3,1,4
colosseo2.jpg,4,5,5,4,4,4,4,0,4,5,4,6,4,4,4
colosseo0.jpg,5,5,3,4,5,4,3,4,0,6,5,4,3,3,6
colosseo5.jpg,5,3,6,3,5,5,6,5,6,0,5,6,6,6,5
colosseo8.jpg,5,4,5,5,4,2,3,4,5,5,0,4,4,3,3
colosseo6.jpg,6,4,5,6,6,3,6,6,4,6,4,0,5,6,6
colosseo10.jpg,4,4,3,4,4,3,3,4,3,6,4,5,0,3,5
colosseo11.jpg,4,5,4,4,3,4,1,4,3,6,3,6,3,0,3
colosseo1.jpg,5,5,6,6,4,4,4,4,6,5,3,6,5,3,0
Type,R-Meta,R-Meta,R-Meta,R-Meta,R-Meta,R-Meta,R-Meta,R-Meta,R-Meta,R-Meta,R-Meta,R-Meta,R-Meta,R-Meta,R-Meta
colosseo13.jpg,0,2,2,0,0,3,1,3,2,3,3,4,1,1,5
colosseo4.jpg,2,0,4,2,2,1,3,3,4,1,1,2,3,3,3
colosseo9.jpg,2,4,0,2,2,3,1,3,2,5,3,6,1,1,5
colosseo3.jpg,0,2,2,0,0,3,1,3,2,3,3,4,1,1,5
colosseo12.jpg,0,2,2,0,0,3,1,3,2,3,3,4,1,1,5
colosseo7.jpg,3,1,3,3,3,0,2,2,3,2,0,3,2,2,2
colosseo14.jpg,1,3,1,1,1,2,0,2,1,4,2,5,0,0,4
colosseo2.jpg,3,3,3,3,3,2,2,0,3,4,2,5,2,2,4
colosseo0.jpg,2,4,2,2,2,3,1,3,0,5,3,4,1,1,3
colosseo5.jpg,3,1,5,3,3,2,4,4,5,0,2,3,4,4,2
colosseo8.jpg,3,1,3,3,3,0,2,2,3,2,0,3,2,2,2
colosseo6.jpg,4,2,6,4,4,3,5,5,4,3,3,0,5,5,3
colosseo10.jpg,1,3,1,1,1,2,0,2,1,4,2,5,0,0,4
colosseo11.jpg,1,3,1,1,1,2,0,2,1,4,2,5,0,0,4
colosseo1.jpg,5,3,5,5,5,2,4,4,3,2,2,3,4,4,0
Type,Content,Content,Content,Content,Content,Content,Content,Content,Content,Content,Content,Content,Content,Content,Content
colosseo13.jpg,0,13,13,12,12,13,12,13,13,13,13,11,10,11,13
colosseo4.jpg,13,0,12,13,12,13,13,13,12,13,12,13,12,13,13
colosseo9.jpg,13,12,0,12,11,13,13,12,13,13,12,12,11,13,12
colosseo3.jpg,12,13,12,0,13,13,12,13,13,11,13,13,13,13,13
colosseo12.jpg,12,12,11,13,0,12,13,12,12,12,12,13,10,13,13
colosseo7.jpg,13,13,13,13,12,0,11,12,10,13,13,11,13,13,12
colosseo14.jpg,12,13,13,12,13,11,0,13,13,12,13,13,13,13,12
colosseo2.jpg,13,13,12,13,12,12,13,0,12,13,13,11,12,13,12
colosseo0.jpg,13,12,13,13,12,10,13,12,0,13,13,12,13,13,12
colosseo5.jpg,13,13,13,11,12,13,12,13,13,0,12,13,13,11,12
colosseo8.jpg,13,12,12,13,12,13,13,13,13,12,0,13,13,11,12
colosseo6.jpg,11,13,12,13,13,11,13,11,12,13,13,0,12,12,12
colosseo10.jpg,10,12,11,13,10,13,13,12,13,13,13,12,0,12,12
colosseo11.jpg,11,13,13,13,13,13,13,13,13,11,11,12,12,0,13
colosseo1.jpg,13,13,12,13,13,12,12,12,12,12,12,12,12,13,0
Type,R-Content,R-Content,R-Content,R-Content,R-Content,R-Content,R-Content,R-Content,R-Content,R-Content,R-Content,R-Content,R-Content,R-Content,R-Content
colosseo13.jpg,0,6,10,7,8,11,6,8,10,4,7,7,7,10,9
colosseo4.jpg,6,0,10,11,10,11,8,8,12,8,7,7,7,12,9
colosseo9.jpg,10,10,0,7,8,9,10,12,10,10,7,9,7,10,5
colosseo3.jpg,7,11,7,0,11,10,11,9,9,9,10,10,10,11,8
colosseo12.jpg,8,10,8,11,0,11,12,8,10,6,9,13,9,10,11
colosseo7.jpg,11,11,9,10,11,0,7,7,5,9,12,8,10,7,8
colosseo14.jpg,6,8,10,11,12,7,0,10,10,8,7,5,9,8,7
colosseo2.jpg,8,8,12,9,8,7,10,0,8,6,11,7,7,10,9
colosseo0.jpg,10,12,10,9,10,5,10,8,0,10,11,11,9,8,9
colosseo5.jpg,4,8,10,9,6,9,8,6,10,0,9,7,5,8,7
colosseo8.jpg,7,7,7,10,9,12,7,11,11,9,0,6,8,9,8
colosseo6.jpg,7,7,9,10,13,8,5,7,11,7,6,0,8,9,6
colosseo10.jpg,7,7,7,10,9,10,9,7,9,5,8,8,0,9,6
colosseo11.jpg,10,12,10,11,10,7,8,10,8,8,9,9,9,0,7
colosseo1.jpg,9,9,5,8,11,8,7,9,9,7,8,6,6,7,0
Type,Final-R,Final-R,Final-R,Final-R,Final-R,Final-R,Final-R,Final-R,Final-R,Final-R,Final-R,Final-R,Final-R,Final-R,Final-R
colosseo13.jpg,0,6,12,6,6,10,6,7,7,4,9,6,6,9,11
colosseo4.jpg,6,0,12,10,10,8,8,9,11,4,7,4,8,11,7
colosseo9.jpg,12,12,0,8,8,8,8,11,5,12,9,12,6,9,5
colosseo3.jpg,6,10,8,0,8,10,10,9,5,8,11,8,8,9,9
colosseo12.jpg,6,10,8,8,0,8,10,7,7,6,11,10,8,7,11
colosseo7.jpg,10,8,8,10,8,0,6,5,5,8,9,8,8,7,7
colosseo14.jpg,6,8,8,10,10,6,0,7,7,8,7,6,6,7,7
colosseo2.jpg,7,9,11,9,7,5,7,0,8,5,10,7,7,8,8
colosseo0.jpg,7,11,5,5,7,5,7,8,0,9,8,9,7,6,6
colosseo5.jpg,4,4,12,8,6,8,8,5,9,0,7,4,6,9,7
colosseo8.jpg,9,7,9,11,11,9,7,10,8,7,0,5,9,8,6
colosseo6.jpg,6,4,12,8,10,8,6,7,9,4,5,0,10,11,7
colosseo10.jpg,6,8,6,8,8,8,6,7,7,6,9,10,0,7,7
colosseo11.jpg,9,11,9,9,7,7,7,8,6,9,8,11,7,0,8
colosseo1.jpg,11,7,5,9,11,7,7,8,6,7,6,7,7,8,0
