,ultima_cena3.jpg,ultima_cena13.jpg,ultima_cena11.jpg,ultima_cena2.jpg,ultima_cena6.jpg,ultima_cena0.jpg,ultima_cena10.jpg,ultima_cena7.jpg,ultima_cena4.jpg,ultima_cena1.jpg,ultima_cena14.jpg,ultima_cena8.jpg,ultima_cena9.jpg,ultima_cena12.jpg,ultima_cena5.jpg
Type,Meta,Meta,Meta,Meta,Meta,Meta,Meta,Meta,Meta,Meta,Meta,Meta,Meta,Meta,Meta
ultima_cena3.jpg,0,3,4,6,5,4,5,5,6,6,6,6,3,5,6
ultima_cena13.jpg,3,0,4,7,7,4,5,4,6,5,6,5,5,5,7
ultima_cena11.jpg,4,4,0,5,5,4,4,4,5,4,6,4,3,4,6
ultima_cena2.jpg,6,7,5,0,3,6,4,5,5,5,5,4,5,3,4
ultima_cena6.jpg,5,7,5,3,0,6,4,4,5,5,4,5,4,3,3
ultima_cena0.jpg,4,4,4,6,6,0,6,4,4,4,6,5,4,6,6
ultima_cena10.jpg,5,5,4,4,4,6,0,4,6,4,4,4,5,2,5
ultima_cena7.jpg,5,4,4,5,4,4,4,0,3,4,6,5,5,3,5
ultima_cena4.jpg,6,6,5,5,5,4,6,3,0,5,6,6,5,5,5
ultima_cena1.jpg,6,5,4,5,5,4,4,4,5,0,5,3,5,4,5
ultima_cena14.jpg,6,6,6,5,4,6,4,6,6,5,0,5,5,5,4
ultima_cena8.jpg,6,5,4,4,5,5,4,5,6,3,5,0,4,4,4
ultima_cena9.jpg,3,5,3,5,4,4,5,5,5,5,5,4,0,5,4
ultima_cena12.jpg,5,5,4,3,3,6,2,3,5,4,5,4,5,0,4
ultima_cena5.jpg,6,7,6,4,3,6,5,5,5,5,4,4,4,4,0
Type,R-Meta,R-Meta,R-Meta,R-Meta,R-Meta,R-Meta,R-Meta,R-Meta,R-Meta,R-Meta,R-Meta,R-Meta,R-Meta,R-Meta,R-Meta
ultima_cena3.jpg,0,2,2,4,2,2,2,2,2,4,4,4,0,2,4
ultima_cena13.jpg,2,0,2,4,4,2,4,2,2,4,2,4,2,4,4
ultima_cena11.jpg,2,2,0,2,4,2,4,2,2,4,4,4,2,4,4
ultima_cena2.jpg,4,4,2,0,2,4,2,4,4,2,2,2,4,2,2
ultima_cena6.jpg,2,4,4,2,0,4,0,4,4,2,2,2,2,0,2
ultima_cena0.jpg,2,2,2,4,4,0,4,2,0,4,4,4,2,4,4
ultima_cena10.jpg,2,4,4,2,0,4,0,4,4,2,2,2,2,0,2
ultima_cena7.jpg,2,2,2,4,4,2,4,0,2,2,4,4,2,4,4
ultima_cena4.jpg,2,2,2,4,4,0,4,2,0,4,4,4,2,4,4
ultima_cena1.jpg,4,4,4,2,2,4,2,2,4,0,2,2,4,2,2
ultima_cena14.jpg,4,2,4,2,2,4,2,4,4,2,0,2,4,2,2
ultima_cena8.jpg,4,4,4,2,2,4,2,4,4,2,2,0,4,2,2
ultima_cena9.jpg,0,2,2,4,2,2,2,2,2,4,4,4,0,2,4
ultima_cena12.jpg,2,4,4,2,0,4,0,4,4,2,2,2,2,0,2
ultima_cena5.jpg,4,4,4,2,2,4,2,4,4,2,2,2,4,2,0
Type,Content,Content,Content,Content,Content,Content,Content,Content,Content,Content,Content,Content,Content,Content,Content
ultima_cena3.jpg,0,12,13,12,12,13,11,13,12,12,10,13,13,13,13
ultima_cena13.jpg,12,0,10,11,11,13,13,13,11,13,11,13,12,13,12
ultima_cena11.jpg,13,10,0,12,12,13,11,13,10,11,12,13,6,12,11
ultima_cena2.jpg,12,11,12,0,13,13,11,13,11,12,12,12,13,12,12
ultima_cena6.jpg,12,11,12,13,0,12,13,12,13,12,12,12,12,13,12
ultima_cena0.jpg,13,13,13,13,12,0,13,11,13,11,13,13,12,8,13
ultima_cena10.jpg,11,13,11,11,13,13,0,13,11,12,13,12,12,13,12
ultima_cena7.jpg,13,13,13,13,12,11,13,0,13,11,12,13,12,12,13
ultima_cena4.jpg,12,11,10,11,13,13,11,13,0,12,12,13,10,13,12
ultima_cena1.jpg,12,13,11,12,12,11,12,11,12,0,13,12,10,13,13
ultima_cena14.jpg,10,11,12,12,12,13,13,12,12,13,0,10,12,13,11
ultima_cena8.jpg,13,13,13,12,12,13,12,13,13,12,10,0,13,13,11
ultima_cena9.jpg,13,12,6,13,12,12,12,12,10,10,12,13,0,12,11
ultima_cena12.jpg,13,13,12,12,13,8,13,12,13,13,13,13,12,0,13
ultima_cena5.jpg,13,12,11,12,12,13,12,13,12,13,11,11,11,13,0
Type,R-Content,R-Content,R-Content,R-Content,R-Content,R-Content,R-Content,R-Content,R-Content,R-Content,R-Content,R-Content,R-Content,R-Content,R-Content
ultima_cena3.jpg,0,8,8,6,8,8,4,6,6,8,8,8,8,8,8
ultima_cena13.jpg,8,0,6,4,8,8,8,6,4,6,6,6,8,8,6
ultima_cena11.jpg,8,6,0,6,8,8,6,6,4,8,6,6,4,8,6
ultima_cena2.jpg,6,4,6,0,8,8,8,6,4,8,6,6,8,8,6
ultima_cena6.jpg,8,8,8,8,0,6,8,4,8,6,8,6,6,8,8
ultima_cena0.jpg,8,8,8,8,6,0,8,4,8,4,8,8,4,6,8
ultima_cena10.jpg,4,8,6,8,8,8,0,6,4,8,8,8,6,8,8
ultima_cena7.jpg,6,6,6,6,4,4,6,0,6,4,6,6,4,6,6
ultima_cena4.jpg,6,4,4,4,8,8,4,6,0,8,6,6,6,8,6
ultima_cena1.jpg,8,6,8,8,6,4,8,4,8,0,8,6,6,8,8
ultima_cena14.jpg,8,6,6,6,8,8,8,6,6,8,0,6,8,8,4
ultima_cena8.jpg,8,6,6,6,6,8,8,6,6,6,6,0,8,8,6
ultima_cena9.jpg,8,8,4,8,6,4,6,4,6,6,8,8,0,6,8
ultima_cena12.jpg,8,8,8,8,8,6,8,6,8,8,8,8,6,0,8
ultima_cena5.jpg,8,6,6,6,8,8,8,6,6,8,4,6,8,8,0
Type,Final-R,Final-R,Final-R,Final-R,Final-R,Final-R,Final-R,Final-R,Final-R,Final-R,Final-R,Final-R,Final-R,Final-R,Final-R
ultima_cena3.jpg,0,8,8,6,8,8,4,6,6,8,8,8,8,8,8
ultima_cena13.jpg,8,0,6,4,8,8,8,6,4,6,6,6,8,8,6
ultima_cena11.jpg,8,6,0,6,8,8,6,6,4,8,6,6,4,8,6
ultima_cena2.jpg,6,4,6,0,8,8,8,6,4,8,6,6,8,8,6
ultima_cena6.jpg,8,8,8,8,0,6,8,4,8,6,8,6,6,8,8
ultima_cena0.jpg,8,8,8,8,6,0,8,4,8,4,8,8,4,6,8
ultima_cena10.jpg,4,8,6,8,8,8,0,6,4,8,8,8,6,8,8
ultima_cena7.jpg,6,6,6,6,4,4,6,0,6,4,6,6,4,6,6
ultima_cena4.jpg,6,4,4,4,8,8,4,6,0,8,6,6,6,8,6
ultima_cena1.jpg,8,6,8,8,6,4,8,4,8,0,8,6,6,8,8
ultima_cena14.jpg,8,6,6,6,8,8,8,6,6,8,0,6,8,8,4
ultima_cena8.jpg,8,6,6,6,6,8,8,6,6,6,6,0,8,8,6
ultima_cena9.jpg,8,8,4,8,6,4,6,4,6,6,8,8,0,6,8
ultima_cena12.jpg,8,8,8,8,8,6,8,6,8,8,8,8,6,0,8
ultima_cena5.jpg,8,6,6,6,8,8,8,6,6,8,4,6,8,8,0
