,san_petronio1.jpg,san_petronio6.jpg,san_petronio5.jpg,san_petronio0.jpg,san_petronio8.jpg,san_petronio11.jpg,san_petronio13.jpg,san_petronio12.jpg,san_petronio3.jpg,san_petronio9.jpg,san_petronio2.jpg,san_petronio7.jpg,san_petronio4.jpg,san_petronio10.jpg,san_petronio14.jpg
Type,SHA256,SHA256,SHA256,SHA256,SHA256,SHA256,SHA256,SHA256,SHA256,SHA256,SHA256,SHA256,SHA256,SHA256,SHA256
san_petronio1.jpg,0,58,60,60,60,60,61,58,59,63,59,61,61,60,58
san_petronio6.jpg,58,0,59,58,54,58,61,58,61,59,57,59,60,61,60
san_petronio5.jpg,60,59,0,60,58,60,58,61,59,58,55,62,61,59,63
san_petronio0.jpg,60,58,60,0,58,59,60,60,61,60,62,60,60,60,60
san_petronio8.jpg,60,54,58,58,0,61,58,61,62,56,60,56,61,63,59
san_petronio11.jpg,60,58,60,59,61,0,58,60,57,59,63,62,60,60,62
san_petronio13.jpg,61,61,58,60,58,58,0,61,61,60,63,59,59,60,60
san_petronio12.jpg,58,58,61,60,61,60,61,0,61,59,59,61,58,57,62
san_petronio3.jpg,59,61,59,61,62,57,61,61,0,60,62,60,58,61,60
san_petronio9.jpg,63,59,58,60,56,59,60,59,60,0,61,57,59,63,58
san_petronio2.jpg,59,57,55,62,60,63,63,59,62,61,0,61,58,60,61
san_petronio7.jpg,61,59,62,60,56,62,59,61,60,57,61,0,61,58,62
san_petronio4.jpg,61,60,61,60,61,60,59,58,58,59,58,61,0,58,61
san_petronio10.jpg,60,61,59,60,63,60,60,57,61,63,60,58,58,0,59
san_petronio14.jpg,58,60,63,60,59,62,60,62,60,58,61,62,61,59,0
Type,Final-R,Final-R,Final-R,Final-R,Final-R,Final-R,Final-R,Final-R,Final-R,Final-R,Final-R,Final-R,Final-R,Final-R,Final-R
san_petronio1.jpg,0,8,7,8,8,8,6,6,8,8,8,7,8,8,8
san_petronio6.jpg,8,0,7,8,6,8,8,8,8,8,6,7,8,8,8
san_petronio5.jpg,7,7,0,3,7,7,7,7,7,5,7,6,5,7,7
san_petronio0.jpg,8,8,3,0,8,8,8,8,8,8,8,7,4,8,6
san_petronio8.jpg,8,6,7,8,0,6,8,8,8,8,6,5,8,8,8
san_petronio11.jpg,8,8,7,8,6,0,6,6,6,8,8,5,8,8,8
san_petronio13.jpg,6,8,7,8,8,6,0,8,8,8,8,7,8,8,8
san_petronio12.jpg,6,8,7,8,8,6,8,0,6,6,8,7,8,8,8
san_petronio3.jpg,8,8,7,8,8,6,8,6,0,6,8,5,8,8,8
san_petronio9.jpg,8,8,5,8,8,8,8,6,6,0,8,7,8,8,8
san_petronio2.jpg,8,6,7,8,6,8,8,8,8,8,0,5,8,6,8
san_petronio7.jpg,7,7,6,7,5,5,7,7,5,7,5,0,7,5,7
san_petronio4.jpg,8,8,5,4,8,8,8,8,8,8,8,7,0,6,6
san_petronio10.jpg,8,8,7,8,8,8,8,8,8,8,6,5,6,0,8
san_petronio14.jpg,8,8,7,6,8,8,8,8,8,8,8,7,6,8,0
