,torre_pisa3.jpg,torre_pisa0.jpg,torre_pisa4.jpg,torre_pisa14.jpg,torre_pisa1.jpg,torre_pisa6.jpg,torre_pisa12.jpg,torre_pisa13.jpg,torre_pisa9.jpg,torre_pisa5.jpg,torre_pisa7.jpg,torre_pisa2.jpg,torre_pisa10.jpg,torre_pisa11.jpg,torre_pisa8.jpg
Type,SHA256,SHA256,SHA256,SHA256,SHA256,SHA256,SHA256,SHA256,SHA256,SHA256,SHA256,SHA256,SHA256,SHA256,SHA256
torre_pisa3.jpg,0,61,60,61,62,63,59,61,59,61,60,60,58,60,59
torre_pisa0.jpg,61,0,59,58,62,63,62,59,60,59,62,59,59,62,60
torre_pisa4.jpg,60,59,0,63,60,61,63,63,61,58,59,57,59,58,62
torre_pisa14.jpg,61,58,63,0,62,58,61,59,59,62,62,58,62,62,62
torre_pisa1.jpg,62,62,60,62,0,62,62,62,60,61,63,59,59,54,59
torre_pisa6.jpg,63,63,61,58,62,0,62,61,61,63,63,57,58,59,61
torre_pisa12.jpg,59,62,63,61,62,62,0,62,62,62,62,62,58,63,59
torre_pisa13.jpg,61,59,63,59,62,61,62,0,62,61,59,61,61,61,58
torre_pisa9.jpg,59,60,61,59,60,61,62,62,0,62,57,58,59,62,60
torre_pisa5.jpg,61,59,58,62,61,63,62,61,62,0,60,61,57,58,62
torre_pisa7.jpg,60,62,59,62,63,63,62,59,57,60,0,60,59,61,59
torre_pisa2.jpg,60,59,57,58,59,57,62,61,58,61,60,0,60,55,63
torre_pisa10.jpg,58,59,59,62,59,58,58,61,59,57,59,60,0,62,60
torre_pisa11.jpg,60,62,58,62,54,59,63,61,62,58,61,55,62,0,61
torre_pisa8.jpg,59,60,62,62,59,61,59,58,60,62,59,63,60,61,0
Type,Final-R,Final-R,Final-R,Final-R,Final-R,Final-R,Final-R,Final-R,Final-R,Final-R,Final-R,Final-R,Final-R,Final-R,Final-R
torre_pisa3.jpg,0,16,16,16,16,16,16,16,16,16,16,16,15,16,14
torre_pisa0.jpg,16,0,16,16,16,16,16,14,16,14,16,16,15,16,16
torre_pisa4.jpg,16,16,0,16,16,16,16,16,16,16,16,16,15,16,16
torre_pisa14.jpg,16,16,16,0,14,14,16,16,16,16,16,16,15,16,16
torre_pisa1.jpg,16,16,16,14,0,16,16,16,16,16,16,16,15,16,16
torre_pisa6.jpg,16,16,16,14,16,0,16,14,16,16,16,16,15,16,16
torre_pisa12.jpg,16,16,16,16,16,16,0,16,16,16,16,16,15,16,14
torre_pisa13.jpg,16,14,16,16,16,14,16,0,16,16,16,16,15,16,16
torre_pisa9.jpg,16,16,16,16,16,16,16,16,0,16,16,16,15,16,16
torre_pisa5.jpg,16,14,16,16,16,16,16,16,16,0,16,16,15,16,16
torre_pisa7.jpg,16,16,16,16,16,16,16,16,16,16,0,16,15,16,16
torre_pisa2.jpg,16,16,16,16,16,16,16,16,16,16,16,0,15,16,16
torre_pisa10.jpg,15,15,15,15,15,15,15,15,15,15,15,15,0,15,15
torre_pisa11.jpg,16,16,16,16,16,16,16,16,16,16,16,16,15,0,16
torre_pisa8.jpg,14,16,16,16,16,16,14,16,16,16,16,16,15,16,0
