Img-Name,SHA256,Final-R
ponte_vecchio4.jpg,8e2e850ded2131617266366ced3149ba4a963536700ee590d26215fcbacbf622,"[1, 1, 1, 0, 0, 0, 0, 0]"
ponte_vecchio8.jpg,23d48e8bddc5c2afcee73860d9dd20d50f96402f0e24655db13cee0a87205524,"[0, 0, 0, 0, 1, 1, 0, 1]"
ponte_vecchio2.jpg,7bb0c398fa7650f1ef4d3da0e1069b7a5c363bb8b6e01fdc7d55819f7d9848f5,"[0, 1, 1, 0, 1, 1, 0, 0]"
ponte_vecchio6.jpg,bd9705730393c30483d39b179230e58db6d9123fdadf20984f94cb814494cd7f,"[1, 0, 0, 0, 1, 1, 0, 1]"
ponte_vecchio0.jpg,2a310b79bc8ef5612acf220ef76323df4bb55c068e645b8eabcaa2bc6d7ac6be,"[0, 1, 0, 0, 0, 0, 1, 1]"
ponte_vecchio13.jpg,15699c13916e267c0a1051cabd61ea6ba9d93af45dbfda572570599d3a106f5c,"[0, 0, 0, 1, 1, 0, 0, 1]"
ponte_vecchio11.jpg,a660033669922900b9804fea038ab5d3fca5603dd0ce2019af4dfc043047e0ab,"[1, 1, 0, 1, 0, 0, 0, 0]"
ponte_vecchio14.jpg,9c50f08230aa91c80f7bccc13a76af3ea0819f7198c920d2a926f14218904255,"[1, 0, 1, 0, 0, 1, 1, 0]"
ponte_vecchio1.jpg,7fd3ebeb1bf9f3525aa2c7af787f930af39cc74eaea725a9e277a8bd84e49275,"[0, 1, 1, 0, 0, 1, 0, 0]"
ponte_vecchio3.jpg,f635df5485baa6d41f56b2c6ffb15a47bbd06672a82b61db8fe3f166ba4aecbe,"[0, 0, 0, 1, 1, 0, 1, 1]"
ponte_vecchio7.jpg,9046b293101ff92575d2267f9ff398ef856296009ec0c32462d25f6965c749f0,"[1, 0, 0, 0, 1, 1, 0, 1]"
ponte_vecchio9.jpg,46e151cb35d6fe8dbbfd5bc034b27ca44468e0ad12021a22870198a1edd45972,"[0, 0, 1, 0, 1, 1, 0, 0]"
ponte_vecchio12.jpg,4d56174a366f15ba5f0aac12e161291f14cae2d2cc0d69f3f68c81c823d6a48d,"[0, 0, 1, 1, 0, 1, 0, 1]"
ponte_vecchio10.jpg,ff21b4c1a249bdbdc126159306c9b757c1106b69d7166c2b614eadf357d29da6,"[0, 0, 0, 1, 0, 1, 1, 1]"
ponte_vecchio5.jpg,0fa937b9808819f95c5f482a64245bf78b74a2ddea2db17f7ff152ceaf9919f1,"[0, 1, 0, 0, 0, 0, 0, 1]"
