,piazza_san_marco6.jpg,piazza_san_marco14.jpg,piazza_san_marco1.jpg,piazza_san_marco10.jpg,piazza_san_marco11.jpg,piazza_san_marco4.jpg,piazza_san_marco12.jpg,piazza_san_marco7.jpg,piazza_san_marco8.jpg,piazza_san_marco0.jpg,piazza_san_marco13.jpg,piazza_san_marco9.jpg,piazza_san_marco3.jpg,piazza_san_marco2.jpg,piazza_san_marco5.jpg
Type,Meta,Meta,Meta,Meta,Meta,Meta,Meta,Meta,Meta,Meta,Meta,Meta,Meta,Meta,Meta
piazza_san_marco6.jpg,0,3,3,4,4,5,4,3,5,3,3,4,3,3,4
piazza_san_marco14.jpg,3,0,3,3,3,3,3,4,4,4,1,4,0,3,4
piazza_san_marco1.jpg,3,3,0,3,4,4,4,3,4,5,4,6,3,3,5
piazza_san_marco10.jpg,4,3,3,0,4,3,3,4,4,5,3,6,3,4,6
piazza_san_marco11.jpg,4,3,4,4,0,5,3,6,6,3,3,5,3,3,4
piazza_san_marco4.jpg,5,3,4,3,5,0,3,2,2,5,3,4,3,5,5
piazza_san_marco12.jpg,4,3,4,3,3,3,0,3,4,4,3,4,3,5,5
piazza_san_marco7.jpg,3,4,3,4,6,2,3,0,2,6,4,3,4,5,5
piazza_san_marco8.jpg,5,4,4,4,6,2,4,2,0,5,4,4,4,4,4
piazza_san_marco0.jpg,3,4,5,5,3,5,4,6,5,0,4,5,4,3,2
piazza_san_marco13.jpg,3,1,4,3,3,3,3,4,4,4,0,4,1,3,5
piazza_san_marco9.jpg,4,4,6,6,5,4,4,3,4,5,4,0,4,5,4
piazza_san_marco3.jpg,3,0,3,3,3,3,3,4,4,4,1,4,0,3,4
piazza_san_marco2.jpg,3,3,3,4,3,5,5,5,4,3,3,5,3,0,4
piazza_san_marco5.jpg,4,4,5,6,4,5,5,5,4,2,5,4,4,4,0
Type,R-Meta,R-Meta,R-Meta,R-Meta,R-Meta,R-Meta,R-Meta,R-Meta,R-Meta,R-Meta,R-Meta,R-Meta,R-Meta,R-Meta,R-Meta
piazza_san_marco6.jpg,0,0,2,2,0,4,2,4,4,0,0,2,0,0,2
piazza_san_marco14.jpg,0,0,2,2,0,4,2,4,4,0,0,2,0,0,2
piazza_san_marco1.jpg,2,2,0,0,2,2,0,2,2,2,2,4,2,2,4
piazza_san_marco10.jpg,2,2,0,0,2,2,0,2,2,2,2,4,2,2,4
piazza_san_marco11.jpg,0,0,2,2,0,4,2,4,4,0,0,2,0,0,2
piazza_san_marco4.jpg,4,4,2,2,4,0,2,0,0,4,4,2,4,4,2
piazza_san_marco12.jpg,2,2,0,0,2,2,0,2,2,2,2,4,2,2,4
piazza_san_marco7.jpg,4,4,2,2,4,0,2,0,0,4,4,2,4,4,2
piazza_san_marco8.jpg,4,4,2,2,4,0,2,0,0,4,4,2,4,4,2
piazza_san_marco0.jpg,0,0,2,2,0,4,2,4,4,0,0,2,0,0,2
piazza_san_marco13.jpg,0,0,2,2,0,4,2,4,4,0,0,2,0,0,2
piazza_san_marco9.jpg,2,2,4,4,2,2,4,2,2,2,2,0,2,2,0
piazza_san_marco3.jpg,0,0,2,2,0,4,2,4,4,0,0,2,0,0,2
piazza_san_marco2.jpg,0,0,2,2,0,4,2,4,4,0,0,2,0,0,2
piazza_san_marco5.jpg,2,2,4,4,2,2,4,2,2,2,2,0,2,2,0
Type,Content,Content,Content,Content,Content,Content,Content,Content,Content,Content,Content,Content,Content,Content,Content
piazza_san_marco6.jpg,0,12,13,13,13,12,12,13,11,12,13,12,13,12,13
piazza_san_marco14.jpg,12,0,13,13,13,12,11,12,13,12,13,13,13,12,13
piazza_san_marco1.jpg,13,13,0,13,13,13,13,10,13,12,13,12,11,12,13
piazza_san_marco10.jpg,13,13,13,0,12,13,13,13,13,13,13,13,12,13,13
piazza_san_marco11.jpg,13,13,13,12,0,12,13,12,12,13,13,13,11,12,13
piazza_san_marco4.jpg,12,12,13,13,12,0,12,13,13,13,13,12,13,11,12
piazza_san_marco12.jpg,12,11,13,13,13,12,0,13,10,13,12,13,13,12,13
piazza_san_marco7.jpg,13,12,10,13,12,13,13,0,12,12,13,11,13,13,13
piazza_san_marco8.jpg,11,13,13,13,12,13,10,12,0,13,13,13,13,13,12
piazza_san_marco0.jpg,12,12,12,13,13,13,13,12,13,0,12,12,12,13,12
piazza_san_marco13.jpg,13,13,13,13,13,13,12,13,13,12,0,13,9,10,12
piazza_san_marco9.jpg,12,13,12,13,13,12,13,11,13,12,13,0,13,13,13
piazza_san_marco3.jpg,13,13,11,12,11,13,13,13,13,12,9,13,0,12,12
piazza_san_marco2.jpg,12,12,12,13,12,11,12,13,13,13,10,13,12,0,13
piazza_san_marco5.jpg,13,13,13,13,13,12,13,13,12,12,12,13,12,13,0
Type,R-Content,R-Content,R-Content,R-Content,R-Content,R-Content,R-Content,R-Content,R-Content,R-Content,R-Content,R-Content,R-Content,R-Content,R-Content
piazza_san_marco6.jpg,0,6,8,4,8,8,6,7,4,8,8,8,7,6,8
piazza_san_marco14.jpg,6,0,8,8,6,6,6,7,8,8,8,6,7,8,8
piazza_san_marco1.jpg,8,8,0,8,6,8,8,5,6,8,8,8,7,6,8
piazza_san_marco10.jpg,4,8,8,0,8,8,8,7,6,8,8,8,5,8,8
piazza_san_marco11.jpg,8,6,6,8,0,6,8,5,6,6,8,4,7,8,4
piazza_san_marco4.jpg,8,6,8,8,6,0,6,5,6,6,8,8,7,8,6
piazza_san_marco12.jpg,6,6,8,8,8,6,0,7,6,8,8,6,7,6,8
piazza_san_marco7.jpg,7,7,5,7,5,5,7,0,5,7,5,5,4,7,7
piazza_san_marco8.jpg,4,8,6,6,6,6,6,5,0,8,8,8,7,6,8
piazza_san_marco0.jpg,8,8,8,8,6,6,8,7,8,0,6,8,5,8,4
piazza_san_marco13.jpg,8,8,8,8,8,8,8,5,8,6,0,6,3,6,6
piazza_san_marco9.jpg,8,6,8,8,4,8,6,5,8,8,6,0,5,8,6
piazza_san_marco3.jpg,7,7,7,5,7,7,7,4,7,5,3,5,0,7,5
piazza_san_marco2.jpg,6,8,6,8,8,8,6,7,6,8,6,8,7,0,8
piazza_san_marco5.jpg,8,8,8,8,4,6,8,7,8,4,6,6,5,8,0
Type,Final-R,Final-R,Final-R,Final-R,Final-R,Final-R,Final-R,Final-R,Final-R,Final-R,Final-R,Final-R,Final-R,Final-R,Final-R
piazza_san_marco6.jpg,0,0,2,2,0,4,2,4,4,0,0,2,0,0,2
piazza_san_marco14.jpg,0,0,2,2,0,4,2,4,4,0,0,2,0,0,2
piazza_san_marco1.jpg,2,2,0,0,2,2,0,2,2,2,2,4,2,2,4
piazza_san_marco10.jpg,2,2,0,0,2,2,0,2,2,2,2,4,2,2,4
piazza_san_marco11.jpg,0,0,2,2,0,4,2,4,4,0,0,2,0,0,2
piazza_san_marco4.jpg,4,4,2,2,4,0,2,0,0,4,4,2,4,4,2
piazza_san_marco12.jpg,2,2,0,0,2,2,0,2,2,2,2,4,2,2,4
piazza_san_marco7.jpg,4,4,2,2,4,0,2,0,0,4,4,2,4,4,2
piazza_san_marco8.jpg,4,4,2,2,4,0,2,0,0,4,4,2,4,4,2
piazza_san_marco0.jpg,0,0,2,2,0,4,2,4,4,0,0,2,0,0,2
piazza_san_marco13.jpg,0,0,2,2,0,4,2,4,4,0,0,2,0,0,2
piazza_san_marco9.jpg,2,2,4,4,2,2,4,2,2,2,2,0,2,2,0
piazza_san_marco3.jpg,0,0,2,2,0,4,2,4,4,0,0,2,0,0,2
piazza_san_marco2.jpg,0,0,2,2,0,4,2,4,4,0,0,2,0,0,2
piazza_san_marco5.jpg,2,2,4,4,2,2,4,2,2,2,2,0,2,2,0
