,torre_pisa3.jpg,torre_pisa0.jpg,torre_pisa4.jpg,torre_pisa14.jpg,torre_pisa1.jpg,torre_pisa6.jpg,torre_pisa12.jpg,torre_pisa13.jpg,torre_pisa9.jpg,torre_pisa5.jpg,torre_pisa7.jpg,torre_pisa2.jpg,torre_pisa10.jpg,torre_pisa11.jpg,torre_pisa8.jpg
Type,Meta,Meta,Meta,Meta,Meta,Meta,Meta,Meta,Meta,Meta,Meta,Meta,Meta,Meta,Meta
torre_pisa3.jpg,0,4,4,2,4,4,5,3,4,3,2,5,4,2,3
torre_pisa0.jpg,4,0,4,4,3,3,5,4,3,2,5,5,4,4,3
torre_pisa4.jpg,4,4,0,4,5,6,7,6,5,5,5,6,6,5,5
torre_pisa14.jpg,2,4,4,0,3,5,5,4,4,4,3,5,3,4,4
torre_pisa1.jpg,4,3,5,3,0,4,5,4,4,3,5,5,2,5,4
torre_pisa6.jpg,4,3,6,5,4,0,5,4,3,3,5,3,4,3,4
torre_pisa12.jpg,5,5,7,5,5,5,0,4,6,5,5,6,4,6,6
torre_pisa13.jpg,3,4,6,4,4,4,4,0,5,3,3,6,3,4,4
torre_pisa9.jpg,4,3,5,4,4,3,6,5,0,2,5,4,5,4,3
torre_pisa5.jpg,3,2,5,4,3,3,5,3,2,0,4,5,4,3,2
torre_pisa7.jpg,2,5,5,3,5,5,5,3,5,4,0,5,4,3,3
torre_pisa2.jpg,5,5,6,5,5,3,6,6,4,5,5,0,5,4,5
torre_pisa10.jpg,4,4,6,3,2,4,4,3,5,4,4,5,0,5,5
torre_pisa11.jpg,2,4,5,4,5,3,6,4,4,3,3,4,5,0,3
torre_pisa8.jpg,3,3,5,4,4,4,6,4,3,2,3,5,5,3,0
Type,R-Meta,R-Meta,R-Meta,R-Meta,R-Meta,R-Meta,R-Meta,R-Meta,R-Meta,R-Meta,R-Meta,R-Meta,R-Meta,R-Meta,R-Meta
torre_pisa3.jpg,0,1,1,2,1,1,3,2,1,1,2,2,3,1,2
torre_pisa0.jpg,1,0,0,1,0,2,2,1,0,0,1,3,2,2,1
torre_pisa4.jpg,1,0,0,1,0,2,2,1,0,0,1,3,2,2,1
torre_pisa14.jpg,2,1,1,0,1,3,3,2,1,1,0,4,1,3,0
torre_pisa1.jpg,1,0,0,1,0,2,2,1,0,0,1,3,2,2,1
torre_pisa6.jpg,1,2,2,3,2,0,2,1,2,2,3,1,2,0,3
torre_pisa12.jpg,3,2,2,3,2,2,0,1,2,2,3,1,2,2,3
torre_pisa13.jpg,2,1,1,2,1,1,1,0,1,1,2,2,1,1,2
torre_pisa9.jpg,1,0,0,1,0,2,2,1,0,0,1,3,2,2,1
torre_pisa5.jpg,1,0,0,1,0,2,2,1,0,0,1,3,2,2,1
torre_pisa7.jpg,2,1,1,0,1,3,3,2,1,1,0,4,1,3,0
torre_pisa2.jpg,2,3,3,4,3,1,1,2,3,3,4,0,3,1,4
torre_pisa10.jpg,3,2,2,1,2,2,2,1,2,2,1,3,0,2,1
torre_pisa11.jpg,1,2,2,3,2,0,2,1,2,2,3,1,2,0,3
torre_pisa8.jpg,2,1,1,0,1,3,3,2,1,1,0,4,1,3,0
Type,Content,Content,Content,Content,Content,Content,Content,Content,Content,Content,Content,Content,Content,Content,Content
torre_pisa3.jpg,0,13,13,13,13,11,13,13,12,12,11,11,13,13,13
torre_pisa0.jpg,13,0,11,12,13,12,11,13,13,13,12,11,12,13,12
torre_pisa4.jpg,13,11,0,13,13,12,11,13,12,12,13,13,12,13,12
torre_pisa14.jpg,13,12,13,0,13,12,13,13,13,13,11,12,13,13,13
torre_pisa1.jpg,13,13,13,13,0,13,12,13,13,12,13,13,13,13,13
torre_pisa6.jpg,11,12,12,12,13,0,13,13,12,12,13,13,11,12,12
torre_pisa12.jpg,13,11,11,13,12,13,0,13,13,13,13,12,13,13,12
torre_pisa13.jpg,13,13,13,13,13,13,13,0,13,13,12,12,13,12,13
torre_pisa9.jpg,12,13,12,13,13,12,13,13,0,13,13,12,11,12,11
torre_pisa5.jpg,12,13,12,13,12,12,13,13,13,0,13,13,12,13,12
torre_pisa7.jpg,11,12,13,11,13,13,13,12,13,13,0,12,13,13,13
torre_pisa2.jpg,11,11,13,12,13,13,12,12,12,13,12,0,13,12,13
torre_pisa10.jpg,13,12,12,13,13,11,13,13,11,12,13,13,0,13,13
torre_pisa11.jpg,13,13,13,13,13,12,13,12,12,13,13,12,13,0,9
torre_pisa8.jpg,13,12,12,13,13,12,12,13,11,12,13,13,13,9,0
Type,R-Content,R-Content,R-Content,R-Content,R-Content,R-Content,R-Content,R-Content,R-Content,R-Content,R-Content,R-Content,R-Content,R-Content,R-Content
torre_pisa3.jpg,0,5,6,5,4,1,1,4,2,4,4,3,2,1,1
torre_pisa0.jpg,5,0,3,2,5,6,4,3,5,3,3,4,3,4,4
torre_pisa4.jpg,6,3,0,3,4,5,7,2,6,4,4,5,4,7,7
torre_pisa14.jpg,5,2,3,0,3,4,4,5,5,5,5,4,5,4,4
torre_pisa1.jpg,4,5,4,3,0,3,3,6,2,4,4,3,6,3,3
torre_pisa6.jpg,1,6,5,4,3,0,2,5,3,5,5,4,3,2,2
torre_pisa12.jpg,1,4,7,4,3,2,0,5,1,3,3,2,3,0,0
torre_pisa13.jpg,4,3,2,5,6,5,5,0,4,2,2,3,2,5,5
torre_pisa9.jpg,2,5,6,5,2,3,1,4,0,2,2,1,4,1,1
torre_pisa5.jpg,4,3,4,5,4,5,3,2,2,0,2,1,4,3,3
torre_pisa7.jpg,4,3,4,5,4,5,3,2,2,2,0,3,2,3,3
torre_pisa2.jpg,3,4,5,4,3,4,2,3,1,1,3,0,5,2,2
torre_pisa10.jpg,2,3,4,5,6,3,3,2,4,4,2,5,0,3,3
torre_pisa11.jpg,1,4,7,4,3,2,0,5,1,3,3,2,3,0,0
torre_pisa8.jpg,1,4,7,4,3,2,0,5,1,3,3,2,3,0,0
Type,Final-R,Final-R,Final-R,Final-R,Final-R,Final-R,Final-R,Final-R,Final-R,Final-R,Final-R,Final-R,Final-R,Final-R,Final-R
torre_pisa3.jpg,0,1,1,2,1,1,3,2,1,1,2,2,3,1,2
torre_pisa0.jpg,1,0,0,1,0,2,2,1,0,0,1,3,2,2,1
torre_pisa4.jpg,1,0,0,1,0,2,2,1,0,0,1,3,2,2,1
torre_pisa14.jpg,2,1,1,0,1,3,3,2,1,1,0,4,1,3,0
torre_pisa1.jpg,1,0,0,1,0,2,2,1,0,0,1,3,2,2,1
torre_pisa6.jpg,1,2,2,3,2,0,2,1,2,2,3,1,2,0,3
torre_pisa12.jpg,3,2,2,3,2,2,0,1,2,2,3,1,2,2,3
torre_pisa13.jpg,2,1,1,2,1,1,1,0,1,1,2,2,1,1,2
torre_pisa9.jpg,1,0,0,1,0,2,2,1,0,0,1,3,2,2,1
torre_pisa5.jpg,1,0,0,1,0,2,2,1,0,0,1,3,2,2,1
torre_pisa7.jpg,2,1,1,0,1,3,3,2,1,1,0,4,1,3,0
torre_pisa2.jpg,2,3,3,4,3,1,1,2,3,3,4,0,3,1,4
torre_pisa10.jpg,3,2,2,1,2,2,2,1,2,2,1,3,0,2,1
torre_pisa11.jpg,1,2,2,3,2,0,2,1,2,2,3,1,2,0,3
torre_pisa8.jpg,2,1,1,0,1,3,3,2,1,1,0,4,1,3,0
