,basilica_san_marco11.jpg,basilica_san_marco10.jpg,basilica_san_marco3.jpg,basilica_san_marco9.jpg,basilica_san_marco2.jpg,basilica_san_marco5.jpg,basilica_san_marco0.jpg,basilica_san_marco4.jpg,basilica_san_marco1.jpg,basilica_san_marco8.jpg,basilica_san_marco6.jpg,basilica_san_marco14.jpg,basilica_san_marco12.jpg,basilica_san_marco7.jpg,basilica_san_marco13.jpg
Type,SHA256,SHA256,SHA256,SHA256,SHA256,SHA256,SHA256,SHA256,SHA256,SHA256,SHA256,SHA256,SHA256,SHA256,SHA256
basilica_san_marco11.jpg,0,60,63,57,63,60,59,57,58,60,61,58,63,61,60
basilica_san_marco10.jpg,60,0,60,61,61,60,61,59,60,57,59,61,59,61,59
basilica_san_marco3.jpg,63,60,0,62,60,60,61,56,59,60,57,60,56,60,60
basilica_san_marco9.jpg,57,61,62,0,62,59,62,59,58,60,61,58,59,64,63
basilica_san_marco2.jpg,63,61,60,62,0,58,58,64,64,62,62,58,61,57,60
basilica_san_marco5.jpg,60,60,60,59,58,0,59,60,60,59,62,62,59,61,58
basilica_san_marco0.jpg,59,61,61,62,58,59,0,63,63,61,58,55,60,58,59
basilica_san_marco4.jpg,57,59,56,59,64,60,63,0,62,61,60,60,57,60,59
basilica_san_marco1.jpg,58,60,59,58,64,60,63,62,0,63,60,62,62,60,62
basilica_san_marco8.jpg,60,57,60,60,62,59,61,61,63,0,61,57,60,60,60
basilica_san_marco6.jpg,61,59,57,61,62,62,58,60,60,61,0,60,63,57,62
basilica_san_marco14.jpg,58,61,60,58,58,62,55,60,62,57,60,0,62,59,62
basilica_san_marco12.jpg,63,59,56,59,61,59,60,57,62,60,63,62,0,59,61
basilica_san_marco7.jpg,61,61,60,64,57,61,58,60,60,60,57,59,59,0,62
basilica_san_marco13.jpg,60,59,60,63,60,58,59,59,62,60,62,62,61,62,0
Type,Final-R,Final-R,Final-R,Final-R,Final-R,Final-R,Final-R,Final-R,Final-R,Final-R,Final-R,Final-R,Final-R,Final-R,Final-R
basilica_san_marco11.jpg,0,29,25,31,29,31,27,29,24,27,31,29,27,27,31
basilica_san_marco10.jpg,29,0,30,30,30,32,32,30,29,28,28,30,30,30,32
basilica_san_marco3.jpg,25,30,0,30,30,26,30,30,23,30,30,32,32,32,32
basilica_san_marco9.jpg,31,30,30,0,30,28,32,30,31,28,32,30,30,30,32
basilica_san_marco2.jpg,29,30,30,30,0,32,26,32,29,30,28,28,30,24,32
basilica_san_marco5.jpg,31,32,26,28,32,0,28,30,27,30,32,30,30,32,30
basilica_san_marco0.jpg,27,32,30,32,26,28,0,28,25,26,32,28,28,30,32
basilica_san_marco4.jpg,29,30,30,30,32,30,28,0,29,30,30,32,28,28,32
basilica_san_marco1.jpg,24,29,23,31,29,27,25,29,0,29,29,29,29,29,31
basilica_san_marco8.jpg,27,28,30,28,30,30,26,30,29,0,32,28,30,32,30
basilica_san_marco6.jpg,31,28,30,32,28,32,32,30,29,32,0,28,32,30,30
basilica_san_marco14.jpg,29,30,32,30,28,30,28,32,29,28,28,0,32,26,30
basilica_san_marco12.jpg,27,30,32,30,30,30,28,28,29,30,32,32,0,28,28
basilica_san_marco7.jpg,27,30,32,30,24,32,30,28,29,32,30,26,28,0,32
basilica_san_marco13.jpg,31,32,32,32,32,30,32,32,31,30,30,30,28,32,0
