,arco_pace0.jpg,arco_pace12.jpg,arco_pace11.jpg,arco_pace6.jpg,arco_pace13.jpg,arco_pace5.jpg,arco_pace4.jpg,arco_pace9.jpg,arco_pace10.jpg,arco_pace1.jpg,arco_pace14.jpg,arco_pace7.jpg,arco_pace3.jpg,arco_pace2.jpg,arco_pace8.jpg
Type,Meta,Meta,Meta,Meta,Meta,Meta,Meta,Meta,Meta,Meta,Meta,Meta,Meta,Meta,Meta
arco_pace0.jpg,0,6,5,3,4,3,4,5,5,4,6,4,4,4,3
arco_pace12.jpg,6,0,3,6,5,6,4,6,3,4,2,3,7,6,6
arco_pace11.jpg,5,3,0,5,4,5,5,5,1,5,4,4,6,5,7
arco_pace6.jpg,3,6,5,0,5,5,5,5,5,5,5,6,4,5,5
arco_pace13.jpg,4,5,4,5,0,5,6,4,4,6,5,4,6,6,6
arco_pace5.jpg,3,6,5,5,5,0,5,6,5,5,7,6,5,5,3
arco_pace4.jpg,4,4,5,5,6,5,0,6,6,4,4,5,5,5,4
arco_pace9.jpg,5,6,5,5,4,6,6,0,5,5,6,6,3,3,6
arco_pace10.jpg,5,3,1,5,4,5,6,5,0,5,3,4,6,5,7
arco_pace1.jpg,4,4,5,5,6,5,4,5,5,0,5,5,5,3,5
arco_pace14.jpg,6,2,4,5,5,7,4,6,3,5,0,3,7,6,6
arco_pace7.jpg,4,3,4,6,4,6,5,6,4,5,3,0,7,6,6
arco_pace3.jpg,4,7,6,4,6,5,5,3,6,5,7,7,0,4,5
arco_pace2.jpg,4,6,5,5,6,5,5,3,5,3,6,6,4,0,5
arco_pace8.jpg,3,6,7,5,6,3,4,6,7,5,6,6,5,5,0
Type,R-Meta,R-Meta,R-Meta,R-Meta,R-Meta,R-Meta,R-Meta,R-Meta,R-Meta,R-Meta,R-Meta,R-Meta,R-Meta,R-Meta,R-Meta
arco_pace0.jpg,0,8,8,4,4,4,6,4,6,4,6,6,4,4,4
arco_pace12.jpg,8,0,4,6,6,8,4,6,6,6,2,4,8,8,8
arco_pace11.jpg,8,4,0,6,6,6,4,6,2,6,6,6,8,6,6
arco_pace6.jpg,4,6,6,0,6,6,6,4,8,4,8,8,4,6,6
arco_pace13.jpg,4,6,6,6,0,6,8,4,4,8,4,4,6,8,8
arco_pace5.jpg,4,8,6,6,6,0,4,6,6,6,8,8,6,6,4
arco_pace4.jpg,6,4,4,6,8,4,0,8,6,4,6,6,8,6,4
arco_pace9.jpg,4,6,6,4,4,6,8,0,6,6,6,6,4,6,6
arco_pace10.jpg,6,6,2,8,4,6,6,6,0,8,4,4,8,6,6
arco_pace1.jpg,4,6,6,4,8,6,4,6,8,0,8,8,4,4,4
arco_pace14.jpg,6,2,6,8,4,8,6,6,4,8,0,2,8,8,8
arco_pace7.jpg,6,4,6,8,4,8,6,6,4,8,2,0,8,8,8
arco_pace3.jpg,4,8,8,4,6,6,8,4,8,4,8,8,0,6,6
arco_pace2.jpg,4,8,6,6,8,6,6,6,6,4,8,8,6,0,4
arco_pace8.jpg,4,8,6,6,8,4,4,6,6,4,8,8,6,4,0
Type,Content,Content,Content,Content,Content,Content,Content,Content,Content,Content,Content,Content,Content,Content,Content
arco_pace0.jpg,0,12,13,12,11,13,12,12,13,11,13,12,13,12,11
arco_pace12.jpg,12,0,11,13,12,13,12,12,13,11,12,13,11,13,13
arco_pace11.jpg,13,11,0,13,12,13,13,13,13,12,12,13,12,13,13
arco_pace6.jpg,12,13,13,0,12,13,13,13,13,13,13,13,13,12,12
arco_pace13.jpg,11,12,12,12,0,11,11,12,11,12,13,12,13,11,12
arco_pace5.jpg,13,13,13,13,11,0,13,12,13,13,13,13,12,13,12
arco_pace4.jpg,12,12,13,13,11,13,0,13,13,12,13,11,12,11,11
arco_pace9.jpg,12,12,13,13,12,12,13,0,13,13,12,13,12,13,13
arco_pace10.jpg,13,13,13,13,11,13,13,13,0,11,13,12,13,12,11
arco_pace1.jpg,11,11,12,13,12,13,12,13,11,0,13,12,13,12,10
arco_pace14.jpg,13,12,12,13,13,13,13,12,13,13,0,13,12,12,13
arco_pace7.jpg,12,13,13,13,12,13,11,13,12,12,13,0,13,11,12
arco_pace3.jpg,13,11,12,13,13,12,12,12,13,13,12,13,0,13,13
arco_pace2.jpg,12,13,13,12,11,13,11,13,12,12,12,11,13,0,10
arco_pace8.jpg,11,13,13,12,12,12,11,13,11,10,13,12,13,10,0
Type,R-Content,R-Content,R-Content,R-Content,R-Content,R-Content,R-Content,R-Content,R-Content,R-Content,R-Content,R-Content,R-Content,R-Content,R-Content
arco_pace0.jpg,0,12,12,10,10,14,10,12,11,10,12,9,9,9,12
arco_pace12.jpg,12,0,12,14,12,14,10,12,11,10,10,11,9,11,12
arco_pace11.jpg,12,12,0,12,10,14,12,12,11,12,10,9,11,13,12
arco_pace6.jpg,10,14,12,0,10,12,12,10,11,12,12,11,11,13,12
arco_pace13.jpg,10,12,10,10,0,12,10,12,9,10,12,9,13,9,12
arco_pace5.jpg,14,14,14,12,12,0,14,12,13,10,10,13,13,13,12
arco_pace4.jpg,10,10,12,12,10,14,0,12,13,10,12,9,9,11,12
arco_pace9.jpg,12,12,12,10,12,12,12,0,13,12,12,13,11,11,12
arco_pace10.jpg,11,11,11,11,9,13,13,13,0,11,9,10,10,8,13
arco_pace1.jpg,10,10,12,12,10,10,10,12,11,0,10,9,11,7,10
arco_pace14.jpg,12,10,10,12,12,10,12,12,9,10,0,11,9,11,12
arco_pace7.jpg,9,11,9,11,9,13,9,13,10,9,11,0,10,8,11
arco_pace3.jpg,9,9,11,11,13,13,9,11,10,11,9,10,0,12,13
arco_pace2.jpg,9,11,13,13,9,13,11,11,8,7,11,8,12,0,9
arco_pace8.jpg,12,12,12,12,12,12,12,12,13,10,12,11,13,9,0
Type,Final-R,Final-R,Final-R,Final-R,Final-R,Final-R,Final-R,Final-R,Final-R,Final-R,Final-R,Final-R,Final-R,Final-R,Final-R
arco_pace0.jpg,0,8,8,4,4,4,6,4,6,4,6,6,4,4,4
arco_pace12.jpg,8,0,4,6,6,8,4,6,6,6,2,4,8,8,8
arco_pace11.jpg,8,4,0,6,6,6,4,6,2,6,6,6,8,6,6
arco_pace6.jpg,4,6,6,0,6,6,6,4,8,4,8,8,4,6,6
arco_pace13.jpg,4,6,6,6,0,6,8,4,4,8,4,4,6,8,8
arco_pace5.jpg,4,8,6,6,6,0,4,6,6,6,8,8,6,6,4
arco_pace4.jpg,6,4,4,6,8,4,0,8,6,4,6,6,8,6,4
arco_pace9.jpg,4,6,6,4,4,6,8,0,6,6,6,6,4,6,6
arco_pace10.jpg,6,6,2,8,4,6,6,6,0,8,4,4,8,6,6
arco_pace1.jpg,4,6,6,4,8,6,4,6,8,0,8,8,4,4,4
arco_pace14.jpg,6,2,6,8,4,8,6,6,4,8,0,2,8,8,8
arco_pace7.jpg,6,4,6,8,4,8,6,6,4,8,2,0,8,8,8
arco_pace3.jpg,4,8,8,4,6,6,8,4,8,4,8,8,0,6,6
arco_pace2.jpg,4,8,6,6,8,6,6,6,6,4,8,8,6,0,4
arco_pace8.jpg,4,8,6,6,8,4,4,6,6,4,8,8,6,4,0
