Img-Name,Meta,R-Meta,Content,R-Content,Final-R
san_luca11.jpg,AAAZFYN6IYZTHHPT,"[1, 1, 1, 0, 1, 0, 1, 0]",EEAZLUSSE5MNK3UZ,"[0, 0, 1, 1, 0, 1, 1, 0]","[1, 1, 1, 0, 1, 0, 1, 0]"
san_luca14.jpg,AAARI3FUAYZTHHPT,"[1, 1, 1, 1, 1, 1, 0, 0]",EEA6NMFPZY4MJFRY,"[1, 1, 0, 0, 0, 1, 1, 0]","[1, 1, 1, 1, 1, 1, 0, 0]"
san_luca2.jpg,AAAS635YA4ZTHHPT,"[1, 1, 0, 1, 1, 0, 0, 0]",EEA4ZMJGZYM6SN4Y,"[0, 1, 0, 0, 1, 1, 1, 1]","[1, 1, 0, 1, 1, 0, 0, 0]"
san_luca1.jpg,AAA3J6N6MYZTHHPT,"[1, 1, 0, 1, 1, 0, 1, 0]",EEA2PMS6BJU724IC,"[0, 0, 1, 1, 1, 1, 1, 1]","[1, 1, 0, 1, 1, 0, 1, 0]"
san_luca12.jpg,AAARI2BKEYZTHHPT,"[1, 1, 1, 1, 1, 0, 0, 0]",EEA4NOIRRF7EKGO5,"[0, 0, 1, 0, 1, 1, 1, 1]","[1, 1, 1, 1, 1, 0, 0, 0]"
san_luca3.jpg,AAA6K3V5IYZTHHPT,"[1, 1, 0, 1, 1, 1, 1, 0]",EEA2HK2UAQWXW5UT,"[1, 1, 1, 1, 1, 1, 0, 0]","[1, 1, 0, 1, 1, 1, 1, 0]"
san_luca5.jpg,AAAZKZZ4M4ZTHHPT,"[1, 1, 1, 0, 1, 0, 0, 0]",EEAZX7WEGLMOGFMC,"[0, 0, 1, 1, 1, 1, 1, 1]","[1, 1, 1, 0, 1, 0, 0, 0]"
san_luca13.jpg,AAAZBZRWEYZTHHPT,"[1, 1, 1, 0, 1, 0, 0, 1]",EEA3DU2OFDYUHK6U,"[0, 0, 0, 1, 1, 1, 0, 1]","[1, 1, 1, 0, 1, 0, 0, 1]"
san_luca0.jpg,AAA3LZJ4IYZTHHPT,"[1, 1, 1, 1, 1, 0, 0, 0]",EEA2HVSOBD2UVC7U,"[0, 0, 1, 1, 1, 1, 1, 1]","[1, 1, 1, 1, 1, 0, 0, 0]"
san_luca8.jpg,AAAZI7F6MYZTHHPT,"[1, 1, 1, 0, 1, 0, 1, 1]",EEAYV5IV5JTQSZE3,"[0, 1, 1, 1, 0, 1, 1, 0]","[1, 1, 1, 0, 1, 0, 1, 1]"
san_luca10.jpg,AAAZK3RWEQZTHHPT,"[1, 1, 1, 1, 1, 0, 0, 1]",EEA44NLBXN3YGSIR,"[0, 1, 1, 1, 1, 1, 1, 0]","[1, 1, 1, 1, 1, 0, 0, 1]"
san_luca9.jpg,AAAZL7V4IYZTHHPT,"[1, 1, 1, 0, 1, 0, 0, 1]",EEAYUGNHNB3NGCPN,"[1, 1, 1, 1, 0, 1, 1, 1]","[1, 1, 1, 0, 1, 0, 0, 1]"
san_luca7.jpg,AAA3I2DWI4ZTHHPT,"[1, 1, 1, 1, 1, 0, 0, 1]",EEAYLATHIR7HTHKH,"[1, 1, 1, 0, 0, 1, 0, 0]","[1, 1, 1, 1, 1, 0, 0, 1]"
san_luca6.jpg,AAA3233WN4ZTHHPT,"[1, 1, 0, 1, 1, 0, 0, 1]",EEA4TSHEMLR4R6HS,"[0, 0, 0, 1, 1, 1, 1, 0]","[1, 1, 0, 1, 1, 0, 0, 1]"
san_luca4.jpg,AAA3N7FWM4ZTHHPT,"[1, 1, 0, 1, 1, 0, 0, 1]",EEA3DQSPXRYQXPSC,"[1, 1, 1, 1, 0, 1, 0, 0]","[1, 1, 0, 1, 1, 0, 0, 1]"
