,pantheon6.jpg,pantheon1.jpg,pantheon14.jpg,pantheon0.jpg,pantheon12.jpg,pantheon13.jpg,pantheon4.jpg,pantheon11.jpg,pantheon3.jpg,pantheon2.jpg,pantheon9.jpg,pantheon5.jpg,pantheon8.jpg,pantheon7.jpg,pantheon10.jpg
Type,Meta,Meta,Meta,Meta,Meta,Meta,Meta,Meta,Meta,Meta,Meta,Meta,Meta,Meta,Meta
pantheon6.jpg,0,4,3,5,3,5,3,4,6,3,6,6,4,4,4
pantheon1.jpg,4,0,3,3,4,4,5,3,4,4,5,6,3,3,4
pantheon14.jpg,3,3,0,4,4,5,5,4,5,3,6,5,4,4,3
pantheon0.jpg,5,3,4,0,4,6,6,5,4,5,5,7,5,4,4
pantheon12.jpg,3,4,4,4,0,5,4,4,5,4,6,6,4,3,2
pantheon13.jpg,5,4,5,6,5,0,5,2,5,5,6,5,5,4,4
pantheon4.jpg,3,5,5,6,4,5,0,5,5,3,5,4,3,3,5
pantheon11.jpg,4,3,4,5,4,2,5,0,6,5,6,5,5,4,3
pantheon3.jpg,6,4,5,4,5,5,5,6,0,5,5,4,5,4,5
pantheon2.jpg,3,4,3,5,4,5,3,5,5,0,4,5,2,2,5
pantheon9.jpg,6,5,6,5,6,6,5,6,5,4,0,5,4,3,7
pantheon5.jpg,6,6,5,7,6,5,4,5,4,5,5,0,5,5,6
pantheon8.jpg,4,3,4,5,4,5,3,5,5,2,4,5,0,2,5
pantheon7.jpg,4,3,4,4,3,4,3,4,4,2,3,5,2,0,4
pantheon10.jpg,4,4,3,4,2,4,5,3,5,5,7,6,5,4,0
Type,R-Meta,R-Meta,R-Meta,R-Meta,R-Meta,R-Meta,R-Meta,R-Meta,R-Meta,R-Meta,R-Meta,R-Meta,R-Meta,R-Meta,R-Meta
pantheon6.jpg,0,1,1,1,0,3,2,2,1,2,2,3,1,2,1
pantheon1.jpg,1,0,0,2,1,2,3,1,2,3,3,4,2,3,0
pantheon14.jpg,1,0,0,2,1,2,3,1,2,3,3,4,2,3,0
pantheon0.jpg,1,2,2,0,1,4,3,3,2,3,1,4,2,3,2
pantheon12.jpg,0,1,1,1,0,3,2,2,1,2,2,3,1,2,1
pantheon13.jpg,3,2,2,4,3,0,3,1,2,3,5,2,4,3,2
pantheon4.jpg,2,3,3,3,2,3,0,4,1,0,2,1,1,0,3
pantheon11.jpg,2,1,1,3,2,1,4,0,3,4,4,3,3,4,1
pantheon3.jpg,1,2,2,2,1,2,1,3,0,1,3,2,2,1,2
pantheon2.jpg,2,3,3,3,2,3,0,4,1,0,2,1,1,0,3
pantheon9.jpg,2,3,3,1,2,5,2,4,3,2,0,3,1,2,3
pantheon5.jpg,3,4,4,4,3,2,1,3,2,1,3,0,2,1,4
pantheon8.jpg,1,2,2,2,1,4,1,3,2,1,1,2,0,1,2
pantheon7.jpg,2,3,3,3,2,3,0,4,1,0,2,1,1,0,3
pantheon10.jpg,1,0,0,2,1,2,3,1,2,3,3,4,2,3,0
Type,Content,Content,Content,Content,Content,Content,Content,Content,Content,Content,Content,Content,Content,Content,Content
pantheon6.jpg,0,13,13,9,13,12,11,12,13,12,13,13,13,12,13
pantheon1.jpg,13,0,13,13,13,13,13,13,12,13,11,13,13,13,12
pantheon14.jpg,13,13,0,13,12,11,13,11,12,13,12,9,11,12,12
pantheon0.jpg,9,13,13,0,13,13,11,13,13,12,13,13,13,13,13
pantheon12.jpg,13,13,12,13,0,12,13,12,13,11,11,12,10,12,12
pantheon13.jpg,12,13,11,13,12,0,13,12,13,12,12,11,12,13,12
pantheon4.jpg,11,13,13,11,13,13,0,12,13,13,13,12,13,12,13
pantheon11.jpg,12,13,11,13,12,12,12,0,13,12,13,12,12,11,12
pantheon3.jpg,13,12,12,13,13,13,13,13,0,13,13,12,13,13,13
pantheon2.jpg,12,13,13,12,11,12,13,12,13,0,11,13,12,13,13
pantheon9.jpg,13,11,12,13,11,12,13,13,13,11,0,12,10,13,12
pantheon5.jpg,13,13,9,13,12,11,12,12,12,13,12,0,12,13,11
pantheon8.jpg,13,13,11,13,10,12,13,12,13,12,10,12,0,12,12
pantheon7.jpg,12,13,12,13,12,13,12,11,13,13,13,13,12,0,13
pantheon10.jpg,13,12,12,13,12,12,13,12,13,13,12,11,12,13,0
Type,R-Content,R-Content,R-Content,R-Content,R-Content,R-Content,R-Content,R-Content,R-Content,R-Content,R-Content,R-Content,R-Content,R-Content,R-Content
pantheon6.jpg,0,4,4,2,6,2,5,3,3,7,4,5,2,6,6
pantheon1.jpg,4,0,2,4,2,4,3,1,1,3,4,3,2,2,4
pantheon14.jpg,4,2,0,4,2,2,3,3,3,3,2,1,2,2,2
pantheon0.jpg,2,4,4,0,6,2,3,3,5,5,2,3,2,6,4
pantheon12.jpg,6,2,2,6,0,4,3,3,3,1,4,3,4,0,2
pantheon13.jpg,2,4,2,2,4,0,3,3,5,5,2,3,2,4,4
pantheon4.jpg,5,3,3,3,3,3,0,4,4,2,1,2,5,3,3
pantheon11.jpg,3,1,3,3,3,3,4,0,2,4,5,4,1,3,5
pantheon3.jpg,3,1,3,5,3,5,4,2,0,4,5,4,3,3,5
pantheon2.jpg,7,3,3,5,1,5,2,4,4,0,3,2,5,1,1
pantheon9.jpg,4,4,2,2,4,2,1,5,5,3,0,1,4,4,2
pantheon5.jpg,5,3,1,3,3,3,2,4,4,2,1,0,3,3,1
pantheon8.jpg,2,2,2,2,4,2,5,1,3,5,4,3,0,4,4
pantheon7.jpg,6,2,2,6,0,4,3,3,3,1,4,3,4,0,2
pantheon10.jpg,6,4,2,4,2,4,3,5,5,1,2,1,4,2,0
Type,Final-R,Final-R,Final-R,Final-R,Final-R,Final-R,Final-R,Final-R,Final-R,Final-R,Final-R,Final-R,Final-R,Final-R,Final-R
pantheon6.jpg,0,1,1,0,1,1,1,1,1,1,2,2,1,1,1
pantheon1.jpg,1,0,0,1,0,2,0,0,0,0,1,1,0,0,0
pantheon14.jpg,1,0,0,1,0,2,0,0,0,0,1,1,0,0,0
pantheon0.jpg,0,1,1,0,1,1,1,1,1,1,2,2,1,1,1
pantheon12.jpg,1,0,0,1,0,2,0,0,0,0,1,1,0,0,0
pantheon13.jpg,1,2,2,1,2,0,2,2,2,2,3,1,2,2,2
pantheon4.jpg,1,0,0,1,0,2,0,0,0,0,1,1,0,0,0
pantheon11.jpg,1,0,0,1,0,2,0,0,0,0,1,1,0,0,0
pantheon3.jpg,1,0,0,1,0,2,0,0,0,0,1,1,0,0,0
pantheon2.jpg,1,0,0,1,0,2,0,0,0,0,1,1,0,0,0
pantheon9.jpg,2,1,1,2,1,3,1,1,1,1,0,2,1,1,1
pantheon5.jpg,2,1,1,2,1,1,1,1,1,1,2,0,1,1,1
pantheon8.jpg,1,0,0,1,0,2,0,0,0,0,1,1,0,0,0
pantheon7.jpg,1,0,0,1,0,2,0,0,0,0,1,1,0,0,0
pantheon10.jpg,1,0,0,1,0,2,0,0,0,0,1,1,0,0,0
