,arco_pace0.jpg,arco_pace12.jpg,arco_pace11.jpg,arco_pace6.jpg,arco_pace13.jpg,arco_pace5.jpg,arco_pace4.jpg,arco_pace9.jpg,arco_pace10.jpg,arco_pace1.jpg,arco_pace14.jpg,arco_pace7.jpg,arco_pace3.jpg,arco_pace2.jpg,arco_pace8.jpg
Type,Meta,Meta,Meta,Meta,Meta,Meta,Meta,Meta,Meta,Meta,Meta,Meta,Meta,Meta,Meta
arco_pace0.jpg,0,6,5,3,4,3,4,5,5,4,6,4,4,4,3
arco_pace12.jpg,6,0,3,6,5,6,4,6,3,4,2,3,7,6,6
arco_pace11.jpg,5,3,0,5,4,5,5,5,1,5,4,4,6,5,7
arco_pace6.jpg,3,6,5,0,5,5,5,5,5,5,5,6,4,5,5
arco_pace13.jpg,4,5,4,5,0,5,6,4,4,6,5,4,6,6,6
arco_pace5.jpg,3,6,5,5,5,0,5,6,5,5,7,6,5,5,3
arco_pace4.jpg,4,4,5,5,6,5,0,6,6,4,4,5,5,5,4
arco_pace9.jpg,5,6,5,5,4,6,6,0,5,5,6,6,3,3,6
arco_pace10.jpg,5,3,1,5,4,5,6,5,0,5,3,4,6,5,7
arco_pace1.jpg,4,4,5,5,6,5,4,5,5,0,5,5,5,3,5
arco_pace14.jpg,6,2,4,5,5,7,4,6,3,5,0,3,7,6,6
arco_pace7.jpg,4,3,4,6,4,6,5,6,4,5,3,0,7,6,6
arco_pace3.jpg,4,7,6,4,6,5,5,3,6,5,7,7,0,4,5
arco_pace2.jpg,4,6,5,5,6,5,5,3,5,3,6,6,4,0,5
arco_pace8.jpg,3,6,7,5,6,3,4,6,7,5,6,6,5,5,0
Type,R-Meta,R-Meta,R-Meta,R-Meta,R-Meta,R-Meta,R-Meta,R-Meta,R-Meta,R-Meta,R-Meta,R-Meta,R-Meta,R-Meta,R-Meta
arco_pace0.jpg,0,4,4,1,4,2,2,2,4,0,4,4,2,0,0
arco_pace12.jpg,4,0,2,3,2,4,2,2,2,4,0,0,4,4,4
arco_pace11.jpg,4,2,0,3,2,2,4,2,0,4,2,2,4,4,4
arco_pace6.jpg,1,3,3,0,3,3,3,1,3,1,3,3,1,1,1
arco_pace13.jpg,4,2,2,3,0,4,4,2,2,4,2,2,2,4,4
arco_pace5.jpg,2,4,2,3,4,0,2,4,2,2,4,4,4,2,2
arco_pace4.jpg,2,2,4,3,4,2,0,4,4,2,2,2,4,2,2
arco_pace9.jpg,2,2,2,1,2,4,4,0,2,2,2,2,2,2,2
arco_pace10.jpg,4,2,0,3,2,2,4,2,0,4,2,2,4,4,4
arco_pace1.jpg,0,4,4,1,4,2,2,2,4,0,4,4,2,0,0
arco_pace14.jpg,4,0,2,3,2,4,2,2,2,4,0,0,4,4,4
arco_pace7.jpg,4,0,2,3,2,4,2,2,2,4,0,0,4,4,4
arco_pace3.jpg,2,4,4,1,2,4,4,2,4,2,4,4,0,2,2
arco_pace2.jpg,0,4,4,1,4,2,2,2,4,0,4,4,2,0,0
arco_pace8.jpg,0,4,4,1,4,2,2,2,4,0,4,4,2,0,0
Type,Content,Content,Content,Content,Content,Content,Content,Content,Content,Content,Content,Content,Content,Content,Content
arco_pace0.jpg,0,12,13,12,11,13,12,12,13,11,13,12,13,12,11
arco_pace12.jpg,12,0,11,13,12,13,12,12,13,11,12,13,11,13,13
arco_pace11.jpg,13,11,0,13,12,13,13,13,13,12,12,13,12,13,13
arco_pace6.jpg,12,13,13,0,12,13,13,13,13,13,13,13,13,12,12
arco_pace13.jpg,11,12,12,12,0,11,11,12,11,12,13,12,13,11,12
arco_pace5.jpg,13,13,13,13,11,0,13,12,13,13,13,13,12,13,12
arco_pace4.jpg,12,12,13,13,11,13,0,13,13,12,13,11,12,11,11
arco_pace9.jpg,12,12,13,13,12,12,13,0,13,13,12,13,12,13,13
arco_pace10.jpg,13,13,13,13,11,13,13,13,0,11,13,12,13,12,11
arco_pace1.jpg,11,11,12,13,12,13,12,13,11,0,13,12,13,12,10
arco_pace14.jpg,13,12,12,13,13,13,13,12,13,13,0,13,12,12,13
arco_pace7.jpg,12,13,13,13,12,13,11,13,12,12,13,0,13,11,12
arco_pace3.jpg,13,11,12,13,13,12,12,12,13,13,12,13,0,13,13
arco_pace2.jpg,12,13,13,12,11,13,11,13,12,12,12,11,13,0,10
arco_pace8.jpg,11,13,13,12,12,12,11,13,11,10,13,12,13,10,0
Type,R-Content,R-Content,R-Content,R-Content,R-Content,R-Content,R-Content,R-Content,R-Content,R-Content,R-Content,R-Content,R-Content,R-Content,R-Content
arco_pace0.jpg,0,5,8,4,2,8,5,8,6,4,7,4,4,4,4
arco_pace12.jpg,5,0,5,3,5,5,4,7,5,1,4,5,3,3,1
arco_pace11.jpg,8,5,0,6,6,6,5,2,4,6,5,4,4,6,4
arco_pace6.jpg,4,3,6,0,4,4,3,8,4,4,3,4,4,4,2
arco_pace13.jpg,2,5,6,4,0,8,5,6,4,4,7,2,4,4,4
arco_pace5.jpg,8,5,6,4,8,0,5,8,4,6,1,8,6,6,4
arco_pace4.jpg,5,4,5,3,5,5,0,5,7,3,4,3,5,5,3
arco_pace9.jpg,8,7,2,8,6,8,5,0,6,6,7,4,6,8,6
arco_pace10.jpg,6,5,4,4,4,4,7,6,0,6,5,4,4,6,4
arco_pace1.jpg,4,1,6,4,4,6,3,6,6,0,5,4,4,4,2
arco_pace14.jpg,7,4,5,3,7,1,4,7,5,5,0,7,5,5,3
arco_pace7.jpg,4,5,4,4,2,8,3,4,4,4,7,0,4,6,4
arco_pace3.jpg,4,3,4,4,4,6,5,6,4,4,5,4,0,4,2
arco_pace2.jpg,4,3,6,4,4,6,5,8,6,4,5,6,4,0,2
arco_pace8.jpg,4,1,4,2,4,4,3,6,4,2,3,4,2,2,0
Type,Final-R,Final-R,Final-R,Final-R,Final-R,Final-R,Final-R,Final-R,Final-R,Final-R,Final-R,Final-R,Final-R,Final-R,Final-R
arco_pace0.jpg,0,8,9,3,3,6,3,8,7,3,7,5,3,3,3
arco_pace12.jpg,8,0,3,5,5,6,5,6,5,5,3,3,5,7,5
arco_pace11.jpg,9,3,0,6,6,5,6,3,4,8,2,4,6,8,6
arco_pace6.jpg,3,5,6,0,4,3,2,7,4,2,4,4,2,2,0
arco_pace13.jpg,3,5,6,4,0,5,4,7,4,4,6,2,6,4,4
arco_pace5.jpg,6,6,5,3,5,0,5,6,1,5,3,5,5,5,3
arco_pace4.jpg,3,5,6,2,4,5,0,5,6,2,4,2,4,4,2
arco_pace9.jpg,8,6,3,7,7,6,5,0,7,7,3,5,7,9,7
arco_pace10.jpg,7,5,4,4,4,1,6,7,0,6,4,4,6,6,4
arco_pace1.jpg,3,5,8,2,4,5,2,7,6,0,6,4,4,4,2
arco_pace14.jpg,7,3,2,4,6,3,4,3,4,6,0,4,4,6,4
arco_pace7.jpg,5,3,4,4,2,5,2,5,4,4,4,0,6,6,4
arco_pace3.jpg,3,5,6,2,6,5,4,7,6,4,4,6,0,4,2
arco_pace2.jpg,3,7,8,2,4,5,4,9,6,4,6,6,4,0,2
arco_pace8.jpg,3,5,6,0,4,3,2,7,4,2,4,4,2,2,0
