,notte_stellata_vangog2.jpg,notte_stellata_vangog0.jpg,notte_stellata_vangog7.jpg,notte_stellata_vangog3.jpg,notte_stellata_vangog10.jpg,notte_stellata_vangog5.jpg,notte_stellata_vangog13.jpg,notte_stellata_vangog14.jpg,notte_stellata_vangog4.jpg,notte_stellata_vangog6.jpg,notte_stellata_vangog11.jpg,notte_stellata_vangog8.jpg,notte_stellata_vangog12.jpg,notte_stellata_vangog9.jpg,notte_stellata_vangog1.jpg
Type,SHA256,SHA256,SHA256,SHA256,SHA256,SHA256,SHA256,SHA256,SHA256,SHA256,SHA256,SHA256,SHA256,SHA256,SHA256
notte_stellata_vangog2.jpg,0,54,61,60,57,62,62,55,61,60,59,58,61,59,58
notte_stellata_vangog0.jpg,54,0,60,62,62,63,60,59,61,60,60,59,58,61,57
notte_stellata_vangog7.jpg,61,60,0,61,56,59,59,60,57,60,63,59,59,61,57
notte_stellata_vangog3.jpg,60,62,61,0,62,63,62,58,60,58,59,61,58,60,57
notte_stellata_vangog10.jpg,57,62,56,62,0,61,60,59,56,59,56,58,63,63,60
notte_stellata_vangog5.jpg,62,63,59,63,61,0,60,59,63,62,59,62,61,60,59
notte_stellata_vangog13.jpg,62,60,59,62,60,60,0,55,62,58,62,58,61,61,62
notte_stellata_vangog14.jpg,55,59,60,58,59,59,55,0,61,56,58,61,60,57,61
notte_stellata_vangog4.jpg,61,61,57,60,56,63,62,61,0,60,60,60,61,62,58
notte_stellata_vangog6.jpg,60,60,60,58,59,62,58,56,60,0,59,60,62,60,59
notte_stellata_vangog11.jpg,59,60,63,59,56,59,62,58,60,59,0,59,58,60,63
notte_stellata_vangog8.jpg,58,59,59,61,58,62,58,61,60,60,59,0,61,60,60
notte_stellata_vangog12.jpg,61,58,59,58,63,61,61,60,61,62,58,61,0,63,63
notte_stellata_vangog9.jpg,59,61,61,60,63,60,61,57,62,60,60,60,63,0,56
notte_stellata_vangog1.jpg,58,57,57,57,60,59,62,61,58,59,63,60,63,56,0
Type,Final-R,Final-R,Final-R,Final-R,Final-R,Final-R,Final-R,Final-R,Final-R,Final-R,Final-R,Final-R,Final-R,Final-R,Final-R
notte_stellata_vangog2.jpg,0,7,7,7,6,7,8,6,6,6,6,8,6,6,6
notte_stellata_vangog0.jpg,7,0,4,6,7,6,5,7,7,7,7,7,7,7,7
notte_stellata_vangog7.jpg,7,4,0,6,5,6,5,7,7,7,7,7,5,5,5
notte_stellata_vangog3.jpg,7,6,6,0,7,4,7,5,7,7,5,7,5,7,5
notte_stellata_vangog10.jpg,6,7,5,7,0,7,8,8,6,8,8,8,4,6,6
notte_stellata_vangog5.jpg,7,6,6,4,7,0,5,5,7,7,5,7,7,7,3
notte_stellata_vangog13.jpg,8,5,5,7,8,5,0,8,8,8,6,4,8,6,8
notte_stellata_vangog14.jpg,6,7,7,5,8,5,8,0,6,8,4,8,8,8,6
notte_stellata_vangog4.jpg,6,7,7,7,6,7,8,6,0,8,4,8,8,8,8
notte_stellata_vangog6.jpg,6,7,7,7,8,7,8,8,8,0,8,8,8,6,8
notte_stellata_vangog11.jpg,6,7,7,5,8,5,6,4,4,8,0,6,8,8,6
notte_stellata_vangog8.jpg,8,7,7,7,8,7,4,8,8,8,6,0,8,6,8
notte_stellata_vangog12.jpg,6,7,5,5,4,7,8,8,8,8,8,8,0,4,8
notte_stellata_vangog9.jpg,6,7,5,7,6,7,6,8,8,6,8,6,4,0,8
notte_stellata_vangog1.jpg,6,7,5,5,6,3,8,6,8,8,6,8,8,8,0
