,arco_trionfo1.jpg,arco_trionfo12.jpg,arco_trionfo9.jpg,arco_trionfo8.jpg,arco_trionfo11.jpg,arco_trionfo3.jpg,arco_trionfo6.jpg,arco_trionfo13.jpg,arco_trionfo4.jpg,arco_trionfo10.jpg,arco_trionfo5.jpg,arco_trionfo2.jpg,arco_trionfo7.jpg,arco_trionfo14.jpg,arco_trionfo0.jpg
Type,SHA256,SHA256,SHA256,SHA256,SHA256,SHA256,SHA256,SHA256,SHA256,SHA256,SHA256,SHA256,SHA256,SHA256,SHA256
arco_trionfo1.jpg,0,61,62,63,61,62,63,58,62,61,59,60,61,59,61
arco_trionfo12.jpg,61,0,58,57,58,60,61,61,59,57,62,64,55,58,61
arco_trionfo9.jpg,62,58,0,59,60,61,59,60,63,60,60,61,59,60,63
arco_trionfo8.jpg,63,57,59,0,58,59,59,61,59,61,57,64,56,60,62
arco_trionfo11.jpg,61,58,60,58,0,60,59,61,57,59,60,60,57,54,57
arco_trionfo3.jpg,62,60,61,59,60,0,58,58,58,58,58,61,61,59,62
arco_trionfo6.jpg,63,61,59,59,59,58,0,57,58,61,61,59,57,62,61
arco_trionfo13.jpg,58,61,60,61,61,58,57,0,64,60,61,59,59,54,62
arco_trionfo4.jpg,62,59,63,59,57,58,58,64,0,61,63,62,61,58,59
arco_trionfo10.jpg,61,57,60,61,59,58,61,60,61,0,60,56,60,63,64
arco_trionfo5.jpg,59,62,60,57,60,58,61,61,63,60,0,60,61,60,58
arco_trionfo2.jpg,60,64,61,64,60,61,59,59,62,56,60,0,63,61,61
arco_trionfo7.jpg,61,55,59,56,57,61,57,59,61,60,61,63,0,60,62
arco_trionfo14.jpg,59,58,60,60,54,59,62,54,58,63,60,61,60,0,57
arco_trionfo0.jpg,61,61,63,62,57,62,61,62,59,64,58,61,62,57,0
Type,Final-R,Final-R,Final-R,Final-R,Final-R,Final-R,Final-R,Final-R,Final-R,Final-R,Final-R,Final-R,Final-R,Final-R,Final-R
arco_trionfo1.jpg,0,14,16,14,16,14,13,16,16,14,13,16,16,16,16
arco_trionfo12.jpg,14,0,16,14,16,16,15,16,16,16,13,16,14,16,16
arco_trionfo9.jpg,16,16,0,14,16,16,13,16,16,16,15,16,16,14,16
arco_trionfo8.jpg,14,14,14,0,14,14,13,14,14,14,11,14,14,14,14
arco_trionfo11.jpg,16,16,16,14,0,16,15,14,14,16,15,16,14,16,16
arco_trionfo3.jpg,14,16,16,14,16,0,13,16,16,16,15,16,16,16,14
arco_trionfo6.jpg,13,15,13,13,15,13,0,15,15,15,14,15,15,13,15
arco_trionfo13.jpg,16,16,16,14,14,16,15,0,16,14,13,16,16,16,16
arco_trionfo4.jpg,16,16,16,14,14,16,15,16,0,16,15,16,16,16,16
arco_trionfo10.jpg,14,16,16,14,16,16,15,14,16,0,13,16,16,16,16
arco_trionfo5.jpg,13,13,15,11,15,15,14,13,15,13,0,13,15,15,15
arco_trionfo2.jpg,16,16,16,14,16,16,15,16,16,16,13,0,16,16,16
arco_trionfo7.jpg,16,14,16,14,14,16,15,16,16,16,15,16,0,14,16
arco_trionfo14.jpg,16,16,14,14,16,16,13,16,16,16,15,16,14,0,14
arco_trionfo0.jpg,16,16,16,14,16,14,15,16,16,16,15,16,16,14,0
