,san_luca11.jpg,san_luca14.jpg,san_luca2.jpg,san_luca1.jpg,san_luca12.jpg,san_luca3.jpg,san_luca5.jpg,san_luca13.jpg,san_luca0.jpg,san_luca8.jpg,san_luca10.jpg,san_luca9.jpg,san_luca7.jpg,san_luca6.jpg,san_luca4.jpg
Type,Meta,Meta,Meta,Meta,Meta,Meta,Meta,Meta,Meta,Meta,Meta,Meta,Meta,Meta,Meta
san_luca11.jpg,0,6,7,4,6,5,6,5,5,4,6,4,6,7,7
san_luca14.jpg,6,0,5,6,4,5,7,6,6,4,6,6,6,6,6
san_luca2.jpg,7,5,0,7,7,6,6,7,7,7,6,7,6,5,6
san_luca1.jpg,4,6,7,0,6,6,6,6,5,4,7,6,6,6,5
san_luca12.jpg,6,4,7,6,0,6,7,5,6,5,6,6,5,7,7
san_luca3.jpg,5,5,6,6,6,0,6,6,5,6,5,4,6,6,7
san_luca5.jpg,6,7,6,6,7,6,0,5,5,5,5,5,6,6,5
san_luca13.jpg,5,6,7,6,5,6,5,0,5,5,3,5,6,6,6
san_luca0.jpg,5,6,7,5,6,5,5,5,0,6,7,3,5,6,6
san_luca8.jpg,4,4,7,4,5,6,5,5,6,0,6,4,6,7,4
san_luca10.jpg,6,6,6,7,6,5,5,3,7,6,0,6,6,5,6
san_luca9.jpg,4,6,7,6,6,4,5,5,3,4,6,0,6,7,6
san_luca7.jpg,6,6,6,6,5,6,6,6,5,6,6,6,0,4,4
san_luca6.jpg,7,6,5,6,7,6,6,6,6,7,5,7,4,0,4
san_luca4.jpg,7,6,6,5,7,7,5,6,6,4,6,6,4,4,0
Type,R-Meta,R-Meta,R-Meta,R-Meta,R-Meta,R-Meta,R-Meta,R-Meta,R-Meta,R-Meta,R-Meta,R-Meta,R-Meta,R-Meta,R-Meta
san_luca11.jpg,0,4,4,2,4,2,2,2,4,0,2,2,4,4,4
san_luca14.jpg,4,0,4,4,2,2,4,4,4,4,4,4,4,4,4
san_luca2.jpg,4,4,0,2,4,4,4,4,2,4,4,4,2,2,2
san_luca1.jpg,2,4,2,0,4,2,4,4,2,2,4,4,2,2,2
san_luca12.jpg,4,2,4,4,0,4,4,4,4,4,4,4,4,4,4
san_luca3.jpg,2,2,4,2,4,0,4,4,4,2,4,4,4,4,4
san_luca5.jpg,2,4,4,4,4,4,0,2,2,2,2,0,4,4,4
san_luca13.jpg,2,4,4,4,4,4,2,0,4,2,0,2,2,2,2
san_luca0.jpg,4,4,2,2,4,4,2,4,0,4,4,2,2,2,2
san_luca8.jpg,0,4,4,2,4,2,2,2,4,0,2,2,4,4,4
san_luca10.jpg,2,4,4,4,4,4,2,0,4,2,0,2,2,2,2
san_luca9.jpg,2,4,4,4,4,4,0,2,2,2,2,0,4,4,4
san_luca7.jpg,4,4,2,2,4,4,4,2,2,4,2,4,0,0,0
san_luca6.jpg,4,4,2,2,4,4,4,2,2,4,2,4,0,0,0
san_luca4.jpg,4,4,2,2,4,4,4,2,2,4,2,4,0,0,0
Type,Content,Content,Content,Content,Content,Content,Content,Content,Content,Content,Content,Content,Content,Content,Content
san_luca11.jpg,0,13,12,12,12,12,11,12,12,13,13,12,12,13,12
san_luca14.jpg,13,0,9,12,12,13,12,13,13,13,13,13,13,13,12
san_luca2.jpg,12,9,0,12,12,13,12,13,13,12,12,13,13,12,13
san_luca1.jpg,12,12,12,0,13,12,12,13,10,12,12,13,13,13,11
san_luca12.jpg,12,12,12,13,0,13,13,13,13,12,12,13,12,12,13
san_luca3.jpg,12,13,13,12,13,0,13,12,11,13,13,13,13,13,13
san_luca5.jpg,11,12,12,12,13,13,0,13,13,13,12,12,13,11,12
san_luca13.jpg,12,13,13,13,13,12,13,0,9,13,13,13,13,13,10
san_luca0.jpg,12,13,13,10,13,11,13,9,0,13,13,12,13,13,12
san_luca8.jpg,13,13,12,12,12,13,13,13,13,0,13,12,12,13,12
san_luca10.jpg,13,13,12,12,12,13,12,13,13,13,0,11,13,12,12
san_luca9.jpg,12,13,13,13,13,13,12,13,12,12,11,0,11,13,13
san_luca7.jpg,12,13,13,13,12,13,13,13,13,12,13,11,0,13,12
san_luca6.jpg,13,13,12,13,12,13,11,13,13,13,12,13,13,0,13
san_luca4.jpg,12,12,13,11,13,13,12,10,12,12,12,13,12,13,0
Type,R-Content,R-Content,R-Content,R-Content,R-Content,R-Content,R-Content,R-Content,R-Content,R-Content,R-Content,R-Content,R-Content,R-Content,R-Content
san_luca11.jpg,0,7,7,7,7,7,5,4,6,5,7,4,5,4,5
san_luca14.jpg,7,0,4,6,8,8,8,7,7,4,6,5,4,7,6
san_luca2.jpg,7,4,0,6,6,6,8,7,7,4,4,5,4,5,8
san_luca1.jpg,7,6,6,0,6,6,6,7,5,6,6,7,6,7,6
san_luca12.jpg,7,8,6,6,0,2,6,5,3,8,4,7,6,3,8
san_luca3.jpg,7,8,6,6,2,0,8,5,3,8,4,7,6,5,8
san_luca5.jpg,5,8,8,6,6,8,0,5,5,8,8,7,6,5,6
san_luca13.jpg,4,7,7,7,5,5,5,0,2,5,7,6,5,4,5
san_luca0.jpg,6,7,7,5,3,3,5,2,0,7,5,6,5,6,7
san_luca8.jpg,5,4,4,6,8,8,8,5,7,0,6,5,4,5,4
san_luca10.jpg,7,6,4,6,4,4,8,7,5,6,0,5,4,5,8
san_luca9.jpg,4,5,5,7,7,7,7,6,6,5,5,0,1,6,7
san_luca7.jpg,5,4,4,6,6,6,6,5,5,4,4,1,0,5,6
san_luca6.jpg,4,7,5,7,3,5,5,4,6,5,5,6,5,0,5
san_luca4.jpg,5,6,8,6,8,8,6,5,7,4,8,7,6,5,0
Type,Final-R,Final-R,Final-R,Final-R,Final-R,Final-R,Final-R,Final-R,Final-R,Final-R,Final-R,Final-R,Final-R,Final-R,Final-R
san_luca11.jpg,0,8,5,5,9,7,7,5,7,3,7,5,6,6,7
san_luca14.jpg,8,0,7,7,7,5,11,9,7,7,7,9,8,10,9
san_luca2.jpg,5,7,0,6,8,6,8,8,6,4,6,6,5,5,8
san_luca1.jpg,5,7,6,0,8,6,8,6,6,6,6,10,5,5,4
san_luca12.jpg,9,7,8,8,0,4,6,8,4,10,6,8,9,5,10
san_luca3.jpg,7,5,6,6,4,0,8,8,4,8,6,8,9,7,10
san_luca5.jpg,7,11,8,8,6,8,0,6,6,8,6,6,9,5,8
san_luca13.jpg,5,9,8,6,8,8,6,0,4,6,6,8,5,5,6
san_luca0.jpg,7,7,6,6,4,4,6,4,0,8,6,8,7,5,8
san_luca8.jpg,3,7,4,6,10,8,8,6,8,0,6,6,5,7,6
san_luca10.jpg,7,7,6,6,6,6,6,6,6,6,0,4,5,5,8
san_luca9.jpg,5,9,6,10,8,8,6,8,8,6,4,0,5,7,10
san_luca7.jpg,6,8,5,5,9,9,9,5,7,5,5,5,0,4,5
san_luca6.jpg,6,10,5,5,5,7,5,5,5,7,5,7,4,0,5
san_luca4.jpg,7,9,8,4,10,10,8,6,8,6,8,10,5,5,0
