,obelisco_wash_dc2.jpg,obelisco_wash_dc11.jpg,obelisco_wash_dc9.jpg,obelisco_wash_dc5.jpg,obelisco_wash_dc14.jpg,obelisco_wash_dc13.jpg,obelisco_wash_dc3.jpg,obelisco_wash_dc8.jpg,obelisco_wash_dc6.jpg,obelisco_wash_dc4.jpg,obelisco_wash_dc1.jpg,obelisco_wash_dc12.jpg,obelisco_wash_dc0.jpg,obelisco_wash_dc10.jpg,obelisco_wash_dc7.jpg
Type,SHA256,SHA256,SHA256,SHA256,SHA256,SHA256,SHA256,SHA256,SHA256,SHA256,SHA256,SHA256,SHA256,SHA256,SHA256
obelisco_wash_dc2.jpg,0,59,63,60,61,61,60,58,58,55,60,58,62,59,60
obelisco_wash_dc11.jpg,59,0,61,56,61,61,61,62,63,64,61,61,62,59,58
obelisco_wash_dc9.jpg,63,61,0,62,58,60,58,58,64,63,60,63,61,62,60
obelisco_wash_dc5.jpg,60,56,62,0,60,63,58,62,62,59,60,60,59,58,61
obelisco_wash_dc14.jpg,61,61,58,60,0,61,64,61,61,61,58,61,59,58,63
obelisco_wash_dc13.jpg,61,61,60,63,61,0,60,64,62,60,59,59,61,58,58
obelisco_wash_dc3.jpg,60,61,58,58,64,60,0,59,59,62,62,61,62,60,62
obelisco_wash_dc8.jpg,58,62,58,62,61,64,59,0,60,58,60,61,60,61,59
obelisco_wash_dc6.jpg,58,63,64,62,61,62,59,60,0,58,63,59,60,61,62
obelisco_wash_dc4.jpg,55,64,63,59,61,60,62,58,58,0,61,56,55,62,57
obelisco_wash_dc1.jpg,60,61,60,60,58,59,62,60,63,61,0,53,62,63,60
obelisco_wash_dc12.jpg,58,61,63,60,61,59,61,61,59,56,53,0,62,59,60
obelisco_wash_dc0.jpg,62,62,61,59,59,61,62,60,60,55,62,62,0,61,62
obelisco_wash_dc10.jpg,59,59,62,58,58,58,60,61,61,62,63,59,61,0,63
obelisco_wash_dc7.jpg,60,58,60,61,63,58,62,59,62,57,60,60,62,63,0
Type,Final-R,Final-R,Final-R,Final-R,Final-R,Final-R,Final-R,Final-R,Final-R,Final-R,Final-R,Final-R,Final-R,Final-R,Final-R
obelisco_wash_dc2.jpg,0,14,12,12,12,16,12,16,16,14,14,14,16,13,16
obelisco_wash_dc11.jpg,14,0,14,10,14,16,14,14,14,16,16,14,16,15,14
obelisco_wash_dc9.jpg,12,14,0,12,10,16,12,16,14,14,16,16,16,13,14
obelisco_wash_dc5.jpg,12,10,12,0,12,16,12,16,16,14,16,16,16,13,14
obelisco_wash_dc14.jpg,12,14,10,12,0,14,14,14,14,14,16,14,16,13,14
obelisco_wash_dc13.jpg,16,16,16,16,14,0,12,16,16,16,16,16,16,13,12
obelisco_wash_dc3.jpg,12,14,12,12,14,12,0,14,14,14,14,14,14,11,14
obelisco_wash_dc8.jpg,16,14,16,16,14,16,14,0,16,16,16,16,14,15,16
obelisco_wash_dc6.jpg,16,14,14,16,14,16,14,16,0,12,16,14,16,15,16
obelisco_wash_dc4.jpg,14,16,14,14,14,16,14,16,12,0,16,12,16,15,16
obelisco_wash_dc1.jpg,14,16,16,16,16,16,14,16,16,16,0,14,14,13,16
obelisco_wash_dc12.jpg,14,14,16,16,14,16,14,16,14,12,14,0,16,15,14
obelisco_wash_dc0.jpg,16,16,16,16,16,16,14,14,16,16,14,16,0,13,16
obelisco_wash_dc10.jpg,13,15,13,13,13,13,11,15,15,15,13,15,13,0,15
obelisco_wash_dc7.jpg,16,14,14,14,14,12,14,16,16,16,16,14,16,15,0
