,monalisa11.jpg,monalisa13.jpg,monalisa2.jpg,monalisa12.jpg,monalisa6.jpg,monalisa1.jpg,monalisa4.jpg,monalisa0.jpg,monalisa10.jpg,monalisa7.jpg,monalisa14.jpg,monalisa5.jpg,monalisa3.jpg,monalisa8.jpg,monalisa9.jpg
Type,SHA256,SHA256,SHA256,SHA256,SHA256,SHA256,SHA256,SHA256,SHA256,SHA256,SHA256,SHA256,SHA256,SHA256,SHA256
monalisa11.jpg,0,59,62,59,61,58,58,59,61,58,63,59,63,63,62
monalisa13.jpg,59,0,62,61,59,64,62,61,59,60,61,59,61,62,63
monalisa2.jpg,62,62,0,61,59,63,58,61,59,61,56,63,62,59,61
monalisa12.jpg,59,61,61,0,58,63,57,59,61,63,56,58,59,60,62
monalisa6.jpg,61,59,59,58,0,59,62,62,61,63,56,60,63,64,60
monalisa1.jpg,58,64,63,63,59,0,58,58,59,60,63,61,61,64,58
monalisa4.jpg,58,62,58,57,62,58,0,57,56,59,58,62,61,59,58
monalisa0.jpg,59,61,61,59,62,58,57,0,62,59,60,60,60,57,59
monalisa10.jpg,61,59,59,61,61,59,56,62,0,58,62,60,61,60,61
monalisa7.jpg,58,60,61,63,63,60,59,59,58,0,60,59,59,62,62
monalisa14.jpg,63,61,56,56,56,63,58,60,62,60,0,61,62,62,56
monalisa5.jpg,59,59,63,58,60,61,62,60,60,59,61,0,59,61,61
monalisa3.jpg,63,61,62,59,63,61,61,60,61,59,62,59,0,60,60
monalisa8.jpg,63,62,59,60,64,64,59,57,60,62,62,61,60,0,60
monalisa9.jpg,62,63,61,62,60,58,58,59,61,62,56,61,60,60,0
Type,Final-R,Final-R,Final-R,Final-R,Final-R,Final-R,Final-R,Final-R,Final-R,Final-R,Final-R,Final-R,Final-R,Final-R,Final-R
monalisa11.jpg,0,11,11,14,13,13,7,11,13,11,12,14,14,14,11
monalisa13.jpg,11,0,10,13,12,12,14,8,12,10,11,13,9,11,12
monalisa2.jpg,11,10,0,15,10,12,10,10,8,14,9,13,15,13,14
monalisa12.jpg,14,13,15,0,13,13,11,11,13,11,10,10,12,10,11
monalisa6.jpg,13,12,10,13,0,10,12,12,8,8,11,9,9,11,14
monalisa1.jpg,13,12,12,13,10,0,10,12,12,14,11,5,7,13,10
monalisa4.jpg,7,14,10,11,12,10,0,14,12,10,15,9,15,13,12
monalisa0.jpg,11,8,10,11,12,12,14,0,12,12,9,15,13,7,10
monalisa10.jpg,13,12,8,13,8,12,12,12,0,10,11,11,13,11,12
monalisa7.jpg,11,10,14,11,8,14,10,12,10,0,15,11,9,9,8
monalisa14.jpg,12,11,9,10,11,11,15,9,11,15,0,14,12,12,13
monalisa5.jpg,14,13,13,10,9,5,9,15,11,11,14,0,8,14,15
monalisa3.jpg,14,9,15,12,9,7,15,13,13,9,12,8,0,14,11
monalisa8.jpg,14,11,13,10,11,13,13,7,11,9,12,14,14,0,9
monalisa9.jpg,11,12,14,11,14,10,12,10,12,8,13,15,11,9,0
