,basilica_santa_croce1.jpg,basilica_santa_croce7.jpg,basilica_santa_croce13.jpg,basilica_santa_croce12.jpg,basilica_santa_croce8.jpg,basilica_santa_croce11.jpg,basilica_santa_croce9.jpg,basilica_santa_croce4.jpg,basilica_santa_croce6.jpg,basilica_santa_croce5.jpg,basilica_santa_croce3.jpg,basilica_santa_croce2.jpg,basilica_santa_croce10.jpg,basilica_santa_croce0.jpg,basilica_santa_croce14.jpg
Type,Meta,Meta,Meta,Meta,Meta,Meta,Meta,Meta,Meta,Meta,Meta,Meta,Meta,Meta,Meta
basilica_santa_croce1.jpg,0,6,5,4,3,3,5,5,4,6,2,3,5,4,4
basilica_santa_croce7.jpg,6,0,4,6,4,6,2,3,6,5,4,5,5,5,6
basilica_santa_croce13.jpg,5,4,0,7,5,3,3,2,5,4,3,5,4,6,4
basilica_santa_croce12.jpg,4,6,7,0,5,5,7,6,5,5,6,5,5,5,3
basilica_santa_croce8.jpg,3,4,5,5,0,5,4,5,6,5,3,4,4,5,6
basilica_santa_croce11.jpg,3,6,3,5,5,0,5,4,5,5,5,5,3,6,2
basilica_santa_croce9.jpg,5,2,3,7,4,5,0,4,5,4,3,4,6,4,6
basilica_santa_croce4.jpg,5,3,2,6,5,4,4,0,5,5,3,4,4,6,4
basilica_santa_croce6.jpg,4,6,5,5,6,5,5,5,0,5,4,4,5,2,4
basilica_santa_croce5.jpg,6,5,4,5,5,5,4,5,5,0,4,5,4,5,5
basilica_santa_croce3.jpg,2,4,3,6,3,5,3,3,4,4,0,3,5,4,6
basilica_santa_croce2.jpg,3,5,5,5,4,5,4,4,4,5,3,0,7,4,6
basilica_santa_croce10.jpg,5,5,4,5,4,3,6,4,5,4,5,7,0,6,3
basilica_santa_croce0.jpg,4,5,6,5,5,6,4,6,2,5,4,4,6,0,5
basilica_santa_croce14.jpg,4,6,4,3,6,2,6,4,4,5,6,6,3,5,0
Type,R-Meta,R-Meta,R-Meta,R-Meta,R-Meta,R-Meta,R-Meta,R-Meta,R-Meta,R-Meta,R-Meta,R-Meta,R-Meta,R-Meta,R-Meta
basilica_santa_croce1.jpg,0,6,6,5,6,6,6,5,6,8,4,4,6,4,5
basilica_santa_croce7.jpg,6,0,6,5,4,6,2,5,6,4,4,6,6,6,5
basilica_santa_croce13.jpg,6,6,0,7,8,6,6,3,8,6,6,8,4,8,5
basilica_santa_croce12.jpg,5,5,7,0,7,7,7,6,7,7,7,5,7,5,6
basilica_santa_croce8.jpg,6,4,8,7,0,8,4,7,6,6,4,6,6,4,7
basilica_santa_croce11.jpg,6,6,6,7,8,0,8,5,4,6,4,8,4,6,1
basilica_santa_croce9.jpg,6,2,6,7,4,8,0,7,6,4,4,6,8,6,7
basilica_santa_croce4.jpg,5,5,3,6,7,5,7,0,7,7,5,5,3,7,4
basilica_santa_croce6.jpg,6,6,8,7,6,4,6,7,0,6,4,6,6,4,5
basilica_santa_croce5.jpg,8,4,6,7,6,6,4,7,6,0,4,8,6,6,7
basilica_santa_croce3.jpg,4,4,6,7,4,4,4,5,4,4,0,6,4,4,5
basilica_santa_croce2.jpg,4,6,8,5,6,8,6,5,6,8,6,0,8,4,7
basilica_santa_croce10.jpg,6,6,4,7,6,4,8,3,6,6,4,8,0,6,5
basilica_santa_croce0.jpg,4,6,8,5,4,6,6,7,4,6,4,4,6,0,7
basilica_santa_croce14.jpg,5,5,5,6,7,1,7,4,5,7,5,7,5,7,0
Type,Content,Content,Content,Content,Content,Content,Content,Content,Content,Content,Content,Content,Content,Content,Content
basilica_santa_croce1.jpg,0,13,12,13,13,13,11,13,11,12,13,11,13,12,13
basilica_santa_croce7.jpg,13,0,12,12,12,13,12,13,13,13,13,13,13,13,13
basilica_santa_croce13.jpg,12,12,0,13,13,13,13,13,12,12,13,12,13,11,13
basilica_santa_croce12.jpg,13,12,13,0,12,12,13,12,13,12,13,12,11,11,9
basilica_santa_croce8.jpg,13,12,13,12,0,13,12,13,13,12,13,13,12,13,13
basilica_santa_croce11.jpg,13,13,13,12,13,0,13,12,13,12,13,11,12,11,11
basilica_santa_croce9.jpg,11,12,13,13,12,13,0,11,9,12,12,13,13,12,13
basilica_santa_croce4.jpg,13,13,13,12,13,12,11,0,13,12,11,13,11,12,11
basilica_santa_croce6.jpg,11,13,12,13,13,13,9,13,0,11,12,13,13,13,11
basilica_santa_croce5.jpg,12,13,12,12,12,12,12,12,11,0,13,11,12,12,11
basilica_santa_croce3.jpg,13,13,13,13,13,13,12,11,12,13,0,13,12,13,13
basilica_santa_croce2.jpg,11,13,12,12,13,11,13,13,13,11,13,0,12,12,12
basilica_santa_croce10.jpg,13,13,13,11,12,12,13,11,13,12,12,12,0,11,10
basilica_santa_croce0.jpg,12,13,11,11,13,11,12,12,13,12,13,12,11,0,11
basilica_santa_croce14.jpg,13,13,13,9,13,11,13,11,11,11,13,12,10,11,0
Type,R-Content,R-Content,R-Content,R-Content,R-Content,R-Content,R-Content,R-Content,R-Content,R-Content,R-Content,R-Content,R-Content,R-Content,R-Content
basilica_santa_croce1.jpg,0,12,11,10,12,11,9,13,11,11,13,13,9,10,8
basilica_santa_croce7.jpg,12,0,11,10,10,11,9,9,11,11,13,13,11,10,10
basilica_santa_croce13.jpg,11,11,0,13,13,14,12,12,12,10,14,14,12,9,13
basilica_santa_croce12.jpg,10,10,13,0,10,11,11,13,11,9,11,11,9,8,8
basilica_santa_croce8.jpg,12,10,13,10,0,13,9,13,13,9,11,11,11,10,12
basilica_santa_croce11.jpg,11,11,14,11,13,0,12,14,10,8,14,10,10,9,9
basilica_santa_croce9.jpg,9,9,12,11,9,12,0,10,6,10,10,12,10,11,9
basilica_santa_croce4.jpg,13,9,12,13,13,14,10,0,12,12,12,12,10,13,9
basilica_santa_croce6.jpg,11,11,12,11,13,10,6,12,0,8,14,12,10,11,9
basilica_santa_croce5.jpg,11,11,10,9,9,8,10,12,8,0,12,10,8,9,9
basilica_santa_croce3.jpg,13,13,14,11,11,14,10,12,14,12,0,12,12,11,13
basilica_santa_croce2.jpg,13,13,14,11,11,10,12,12,12,10,12,0,10,11,11
basilica_santa_croce10.jpg,9,11,12,9,11,10,10,10,10,8,12,10,0,9,7
basilica_santa_croce0.jpg,10,10,9,8,10,9,11,13,11,9,11,11,9,0,10
basilica_santa_croce14.jpg,8,10,13,8,12,9,9,9,9,9,13,11,7,10,0
Type,Final-R,Final-R,Final-R,Final-R,Final-R,Final-R,Final-R,Final-R,Final-R,Final-R,Final-R,Final-R,Final-R,Final-R,Final-R
basilica_santa_croce1.jpg,0,16,15,10,16,13,14,17,13,18,13,13,14,13,10
basilica_santa_croce7.jpg,16,0,13,14,10,15,8,13,15,12,13,17,16,15,12
basilica_santa_croce13.jpg,15,13,0,17,17,18,17,12,18,15,16,20,15,16,15
basilica_santa_croce12.jpg,10,14,17,0,12,11,14,17,11,12,13,11,14,9,10
basilica_santa_croce8.jpg,16,10,17,12,0,19,8,19,17,12,11,15,16,13,16
basilica_santa_croce11.jpg,13,15,18,11,19,0,17,18,12,13,14,16,13,14,7
basilica_santa_croce9.jpg,14,8,17,14,8,17,0,17,9,12,9,17,16,15,14
basilica_santa_croce4.jpg,17,13,12,17,19,18,17,0,18,19,12,16,13,20,11
basilica_santa_croce6.jpg,13,15,18,11,17,12,9,18,0,13,14,16,15,14,11
basilica_santa_croce5.jpg,18,12,15,12,12,13,12,19,13,0,13,17,14,15,14
basilica_santa_croce3.jpg,13,13,16,13,11,14,9,12,14,13,0,14,13,12,13
basilica_santa_croce2.jpg,13,17,20,11,15,16,17,16,16,17,14,0,17,12,15
basilica_santa_croce10.jpg,14,16,15,14,16,13,16,13,15,14,13,17,0,15,10
basilica_santa_croce0.jpg,13,15,16,9,13,14,15,20,14,15,12,12,15,0,15
basilica_santa_croce14.jpg,10,12,15,10,16,7,14,11,11,14,13,15,10,15,0
