Img-Name,Meta,R-Meta,Content,R-Content,Final-R
pietà_mic14.jpg,AAA5D7XN5UZSPCL3,"[0, 0, 0, 1, 0, 1, 1, 0]",EEA4DYJDDY6JYNT3,"[0, 0, 1, 1, 1, 0, 0, 0]","[0, 0, 1, 1, 1, 1, 1, 0]"
pietà_mic6.jpg,AAA4D6W35EZSPCL3,"[0, 0, 0, 1, 1, 0, 0, 0]",EEAZOS33MES2I3SK,"[0, 0, 1, 1, 0, 0, 0, 0]","[0, 0, 1, 1, 1, 0, 0, 0]"
pietà_mic9.jpg,AAA5D5VZVEZSPCL3,"[0, 0, 1, 1, 0, 1, 0, 0]",EEAYTGJ4NVLIG6KO,"[0, 1, 0, 0, 1, 0, 0, 1]","[0, 1, 1, 1, 1, 1, 0, 1]"
pietà_mic7.jpg,AAA6HUV35UZSPCL3,"[0, 0, 0, 1, 0, 0, 1, 0]",EEAZP7DMV52M4QBA,"[0, 1, 1, 0, 0, 1, 0, 0]","[0, 1, 1, 1, 0, 1, 1, 0]"
pietà_mic2.jpg,AAA6H2X3VUZSPCL3,"[0, 0, 0, 1, 0, 0, 1, 0]",EEA4CGZYPUQ7MZ2D,"[0, 1, 0, 0, 1, 0, 0, 1]","[0, 1, 0, 1, 1, 0, 1, 1]"
pietà_mic4.jpg,AAA6H5UIVUZSPCL3,"[0, 1, 0, 1, 0, 0, 1, 0]",EEA4KWZYFG2NMI7F,"[0, 1, 0, 0, 1, 0, 1, 0]","[0, 1, 0, 1, 1, 0, 1, 0]"
pietà_mic1.jpg,AAA4H55PUEZSPCL3,"[1, 0, 0, 1, 1, 0, 0, 0]",EEA5GO3YUQDNMD3R,"[0, 1, 1, 0, 0, 1, 1, 0]","[1, 1, 1, 1, 1, 1, 1, 0]"
pietà_mic13.jpg,AAA4H5V7VEZSPCL3,"[0, 0, 0, 1, 1, 0, 0, 1]",EEA4DHZ3ED2GXFEO,"[0, 0, 0, 1, 1, 0, 0, 1]","[0, 0, 0, 1, 1, 0, 0, 1]"
pietà_mic10.jpg,AAA67ZV35UZSPCL3,"[0, 0, 0, 1, 0, 0, 1, 0]",EEA2ZVCL5ENZQY5F,"[0, 0, 1, 0, 1, 0, 1, 0]","[0, 0, 1, 1, 1, 0, 1, 0]"
pietà_mic11.jpg,AAA4H5775EZSPCL3,"[0, 0, 0, 1, 1, 0, 0, 1]",EEAYGPZI4VZYUV5Q,"[0, 1, 0, 0, 0, 0, 0, 0]","[0, 1, 0, 1, 1, 0, 0, 1]"
pietà_mic3.jpg,AAA4HZUT4EZSPCL3,"[0, 0, 0, 1, 1, 0, 0, 0]",EEAZKW3JGUS6IRVH,"[1, 0, 1, 0, 0, 0, 1, 0]","[1, 0, 1, 1, 1, 0, 1, 0]"
pietà_mic5.jpg,AAA4HZVJUUZSPCL3,"[0, 0, 1, 1, 1, 0, 0, 0]",EEA5CCR5HVLMG6MD,"[0, 0, 0, 0, 1, 1, 0, 0]","[0, 0, 1, 1, 1, 1, 0, 0]"
pietà_mic0.jpg,AAA7H5V3REZSPCL3,"[0, 0, 0, 1, 0, 0, 0, 1]",EEA4CGZYOFR3NTSH,"[1, 1, 0, 1, 1, 0, 0, 0]","[1, 1, 0, 1, 1, 0, 0, 1]"
pietà_mic8.jpg,AAA4H6VZUEZSPCL3,"[0, 0, 1, 1, 1, 0, 0, 0]",EEA56SJVGQJM4Y3K,"[0, 0, 0, 1, 0, 1, 1, 0]","[0, 0, 1, 1, 1, 1, 1, 0]"
pietà_mic12.jpg,AAA4P67LXEZSPCL3,"[0, 0, 0, 1, 1, 0, 0, 0]",EEA4WOJUG3RMPJCL,"[0, 0, 0, 0, 1, 1, 0, 0]","[0, 0, 0, 1, 1, 1, 0, 0]"
