,san_petronio1.jpg,san_petronio6.jpg,san_petronio5.jpg,san_petronio0.jpg,san_petronio8.jpg,san_petronio11.jpg,san_petronio13.jpg,san_petronio12.jpg,san_petronio3.jpg,san_petronio9.jpg,san_petronio2.jpg,san_petronio7.jpg,san_petronio4.jpg,san_petronio10.jpg,san_petronio14.jpg
Type,SHA256,SHA256,SHA256,SHA256,SHA256,SHA256,SHA256,SHA256,SHA256,SHA256,SHA256,SHA256,SHA256,SHA256,SHA256
san_petronio1.jpg,0,58,60,60,60,60,61,58,59,63,59,61,61,60,58
san_petronio6.jpg,58,0,59,58,54,58,61,58,61,59,57,59,60,61,60
san_petronio5.jpg,60,59,0,60,58,60,58,61,59,58,55,62,61,59,63
san_petronio0.jpg,60,58,60,0,58,59,60,60,61,60,62,60,60,60,60
san_petronio8.jpg,60,54,58,58,0,61,58,61,62,56,60,56,61,63,59
san_petronio11.jpg,60,58,60,59,61,0,58,60,57,59,63,62,60,60,62
san_petronio13.jpg,61,61,58,60,58,58,0,61,61,60,63,59,59,60,60
san_petronio12.jpg,58,58,61,60,61,60,61,0,61,59,59,61,58,57,62
san_petronio3.jpg,59,61,59,61,62,57,61,61,0,60,62,60,58,61,60
san_petronio9.jpg,63,59,58,60,56,59,60,59,60,0,61,57,59,63,58
san_petronio2.jpg,59,57,55,62,60,63,63,59,62,61,0,61,58,60,61
san_petronio7.jpg,61,59,62,60,56,62,59,61,60,57,61,0,61,58,62
san_petronio4.jpg,61,60,61,60,61,60,59,58,58,59,58,61,0,58,61
san_petronio10.jpg,60,61,59,60,63,60,60,57,61,63,60,58,58,0,59
san_petronio14.jpg,58,60,63,60,59,62,60,62,60,58,61,62,61,59,0
Type,Final-R,Final-R,Final-R,Final-R,Final-R,Final-R,Final-R,Final-R,Final-R,Final-R,Final-R,Final-R,Final-R,Final-R,Final-R
san_petronio1.jpg,0,14,10,11,12,12,12,10,10,14,11,9,9,10,13
san_petronio6.jpg,14,0,10,11,12,12,14,12,8,6,11,13,11,10,9
san_petronio5.jpg,10,10,0,5,12,10,12,14,8,10,11,13,9,10,11
san_petronio0.jpg,11,11,5,0,11,13,13,13,9,9,10,10,8,9,10
san_petronio8.jpg,12,12,12,11,0,12,10,8,12,8,11,7,11,14,13
san_petronio11.jpg,12,12,10,13,12,0,10,12,10,10,13,11,11,10,11
san_petronio13.jpg,12,14,12,13,10,10,0,10,14,14,9,13,11,14,9
san_petronio12.jpg,10,12,14,13,8,12,10,0,12,10,13,9,11,14,15
san_petronio3.jpg,10,8,8,9,12,10,14,12,0,10,11,11,11,10,13
san_petronio9.jpg,14,6,10,9,8,10,14,10,10,0,11,9,9,12,9
san_petronio2.jpg,11,11,11,10,11,13,9,13,11,11,0,10,10,11,8
san_petronio7.jpg,9,13,13,10,7,11,13,9,11,9,10,0,10,11,14
san_petronio4.jpg,9,11,9,8,11,11,11,11,11,9,10,10,0,9,10
san_petronio10.jpg,10,10,10,9,14,10,14,14,10,12,11,11,9,0,11
san_petronio14.jpg,13,9,11,10,13,11,9,15,13,9,8,14,10,11,0
