,arena_verona12.jpg,arena_verona13.jpg,arena_verona9.jpg,arena_verona1.jpg,arena_verona6.jpg,arena_verona3.jpg,arena_verona2.jpg,arena_verona4.jpg,arena_verona14.jpg,arena_verona5.jpg,arena_verona11.jpg,arena_verona0.jpg,arena_verona8.jpg,arena_verona7.jpg,arena_verona10.jpg
Type,Meta,Meta,Meta,Meta,Meta,Meta,Meta,Meta,Meta,Meta,Meta,Meta,Meta,Meta,Meta
arena_verona12.jpg,0,4,6,4,5,6,5,5,5,5,5,5,5,6,6
arena_verona13.jpg,4,0,4,4,5,6,5,6,4,5,5,5,3,7,5
arena_verona9.jpg,6,4,0,4,4,5,4,6,3,4,5,5,2,6,5
arena_verona1.jpg,4,4,4,0,3,3,2,3,2,4,3,3,2,4,4
arena_verona6.jpg,5,5,4,3,0,2,2,5,4,2,3,4,4,3,4
arena_verona3.jpg,6,6,5,3,2,0,2,5,4,3,4,4,4,1,4
arena_verona2.jpg,5,5,4,2,2,2,0,4,3,3,4,3,3,3,4
arena_verona4.jpg,5,6,6,3,5,5,4,0,5,5,6,4,5,5,5
arena_verona14.jpg,5,4,3,2,4,4,3,5,0,5,4,4,1,5,3
arena_verona5.jpg,5,5,4,4,2,3,3,5,5,0,5,3,5,4,4
arena_verona11.jpg,5,5,5,3,3,4,4,6,4,5,0,5,4,5,6
arena_verona0.jpg,5,5,5,3,4,4,3,4,4,3,5,0,4,5,4
arena_verona8.jpg,5,3,2,2,4,4,3,5,1,5,4,4,0,5,4
arena_verona7.jpg,6,7,6,4,3,1,3,5,5,4,5,5,5,0,5
arena_verona10.jpg,6,5,5,4,4,4,4,5,3,4,6,4,4,5,0
Type,R-Meta,R-Meta,R-Meta,R-Meta,R-Meta,R-Meta,R-Meta,R-Meta,R-Meta,R-Meta,R-Meta,R-Meta,R-Meta,R-Meta,R-Meta
arena_verona12.jpg,0,2,4,4,4,4,4,4,4,4,4,4,4,4,4
arena_verona13.jpg,2,0,4,4,4,4,4,4,4,4,4,4,4,4,2
arena_verona9.jpg,4,4,0,2,2,2,2,4,2,0,2,2,2,4,4
arena_verona1.jpg,4,4,2,0,2,0,0,2,0,2,2,0,0,2,2
arena_verona6.jpg,4,4,2,2,0,2,2,4,2,2,0,2,2,4,4
arena_verona3.jpg,4,4,2,0,2,0,0,2,0,2,2,0,0,2,2
arena_verona2.jpg,4,4,2,0,2,0,0,2,0,2,2,0,0,2,2
arena_verona4.jpg,4,4,4,2,4,2,2,0,2,4,4,2,2,2,2
arena_verona14.jpg,4,4,2,0,2,0,0,2,0,2,2,0,0,2,2
arena_verona5.jpg,4,4,0,2,2,2,2,4,2,0,2,2,2,4,4
arena_verona11.jpg,4,4,2,2,0,2,2,4,2,2,0,2,2,4,4
arena_verona0.jpg,4,4,2,0,2,0,0,2,0,2,2,0,0,2,2
arena_verona8.jpg,4,4,2,0,2,0,0,2,0,2,2,0,0,2,2
arena_verona7.jpg,4,4,4,2,4,2,2,2,2,4,4,2,2,0,2
arena_verona10.jpg,4,2,4,2,4,2,2,2,2,4,4,2,2,2,0
Type,Content,Content,Content,Content,Content,Content,Content,Content,Content,Content,Content,Content,Content,Content,Content
arena_verona12.jpg,0,11,13,0,12,12,10,13,12,12,8,7,12,13,11
arena_verona13.jpg,11,0,13,11,13,13,13,13,13,13,12,11,13,13,13
arena_verona9.jpg,13,13,0,13,12,13,13,11,11,13,13,13,11,13,13
arena_verona1.jpg,0,11,13,0,12,12,10,13,12,12,8,7,12,13,11
arena_verona6.jpg,12,13,12,12,0,11,13,12,11,13,13,11,13,13,13
arena_verona3.jpg,12,13,13,12,11,0,12,13,13,11,13,13,13,13,12
arena_verona2.jpg,10,13,13,10,13,12,0,13,13,11,12,13,12,13,12
arena_verona4.jpg,13,13,11,13,12,13,13,0,11,13,13,13,12,13,13
arena_verona14.jpg,12,13,11,12,11,13,13,11,0,12,13,12,12,13,13
arena_verona5.jpg,12,13,13,12,13,11,11,13,12,0,13,13,12,13,12
arena_verona11.jpg,8,12,13,8,13,13,12,13,13,13,0,7,11,12,12
arena_verona0.jpg,7,11,13,7,11,13,13,13,12,13,7,0,12,13,12
arena_verona8.jpg,12,13,11,12,13,13,12,12,12,12,11,12,0,13,13
arena_verona7.jpg,13,13,13,13,13,13,13,13,13,13,12,13,13,0,13
arena_verona10.jpg,11,13,13,11,13,12,12,13,13,12,12,12,13,13,0
Type,R-Content,R-Content,R-Content,R-Content,R-Content,R-Content,R-Content,R-Content,R-Content,R-Content,R-Content,R-Content,R-Content,R-Content,R-Content
arena_verona12.jpg,0,8,8,0,8,6,6,8,8,6,6,8,6,8,6
arena_verona13.jpg,8,0,6,8,8,8,8,6,8,8,6,8,8,8,8
arena_verona9.jpg,8,6,0,8,4,8,8,6,6,8,8,8,8,8,8
arena_verona1.jpg,0,8,8,0,8,6,6,8,8,6,6,8,6,8,6
arena_verona6.jpg,8,8,4,8,0,8,8,6,6,8,8,8,8,8,8
arena_verona3.jpg,6,8,8,6,8,0,6,8,8,6,8,8,8,8,6
arena_verona2.jpg,6,8,8,6,8,6,0,8,8,6,8,8,8,8,6
arena_verona4.jpg,8,6,6,8,6,8,8,0,6,8,8,8,8,8,8
arena_verona14.jpg,8,8,6,8,6,8,8,6,0,8,8,8,8,8,8
arena_verona5.jpg,6,8,8,6,8,6,6,8,8,0,8,8,8,8,6
arena_verona11.jpg,6,6,8,6,8,8,8,8,8,8,0,6,6,8,8
arena_verona0.jpg,8,8,8,8,8,8,8,8,8,8,6,0,6,8,8
arena_verona8.jpg,6,8,8,6,8,8,8,8,8,8,6,6,0,6,8
arena_verona7.jpg,8,8,8,8,8,8,8,8,8,8,8,8,6,0,8
arena_verona10.jpg,6,8,8,6,8,6,6,8,8,6,8,8,8,8,0
Type,Final-R,Final-R,Final-R,Final-R,Final-R,Final-R,Final-R,Final-R,Final-R,Final-R,Final-R,Final-R,Final-R,Final-R,Final-R
arena_verona12.jpg,0,10,10,4,10,10,8,9,10,10,10,12,10,12,10
arena_verona13.jpg,10,0,8,10,10,10,10,7,8,12,10,10,10,10,8
arena_verona9.jpg,10,8,0,10,6,10,10,9,8,8,8,8,8,12,12
arena_verona1.jpg,4,10,10,0,10,6,6,9,8,8,8,8,6,10,8
arena_verona6.jpg,10,10,6,10,0,10,10,9,8,10,8,10,10,10,12
arena_verona3.jpg,10,10,10,6,10,0,6,9,8,8,10,8,8,10,8
arena_verona2.jpg,8,10,10,6,10,6,0,9,8,8,10,8,8,10,8
arena_verona4.jpg,9,7,9,9,9,9,9,0,7,11,11,9,9,9,9
arena_verona14.jpg,10,8,8,8,8,8,8,7,0,10,10,8,8,10,10
arena_verona5.jpg,10,12,8,8,10,8,8,11,10,0,8,8,8,12,10
arena_verona11.jpg,10,10,8,8,8,10,10,11,10,8,0,8,8,10,12
arena_verona0.jpg,12,10,8,8,10,8,8,9,8,8,8,0,6,10,10
arena_verona8.jpg,10,10,8,6,10,8,8,9,8,8,8,6,0,8,10
arena_verona7.jpg,12,10,12,10,10,10,10,9,10,12,10,10,8,0,10
arena_verona10.jpg,10,8,12,8,12,8,8,9,10,10,12,10,10,10,0
