,due_torri1.jpg,due_torri14.jpg,due_torri5.jpg,due_torri2.jpg,due_torri12.jpg,due_torri4.jpg,due_torri0.jpg,due_torri9.jpg,due_torri7.jpg,due_torri11.jpg,due_torri6.jpg,due_torri10.jpg,due_torri13.jpg,due_torri3.jpg,due_torri8.jpg
Type,Meta,Meta,Meta,Meta,Meta,Meta,Meta,Meta,Meta,Meta,Meta,Meta,Meta,Meta,Meta
due_torri1.jpg,0,5,5,4,4,4,5,4,5,5,6,4,4,4,5
due_torri14.jpg,5,0,5,5,4,3,6,6,5,7,5,5,5,6,5
due_torri5.jpg,5,5,0,4,3,4,4,3,5,5,4,4,4,4,5
due_torri2.jpg,4,5,4,0,2,4,6,5,6,6,6,6,5,5,4
due_torri12.jpg,4,4,3,2,0,4,6,4,6,5,6,5,4,4,4
due_torri4.jpg,4,3,4,4,4,0,5,6,4,7,3,5,6,6,6
due_torri0.jpg,5,6,4,6,6,5,0,3,4,6,4,4,5,5,5
due_torri9.jpg,4,6,3,5,4,6,3,0,4,4,5,3,3,3,4
due_torri7.jpg,5,5,5,6,6,4,4,4,0,6,2,3,5,6,6
due_torri11.jpg,5,7,5,6,5,7,6,4,6,0,7,5,4,5,6
due_torri6.jpg,6,5,4,6,6,3,4,5,2,7,0,4,6,6,6
due_torri10.jpg,4,5,4,6,5,5,4,3,3,5,4,0,3,5,6
due_torri13.jpg,4,5,4,5,4,6,5,3,5,4,6,3,0,4,4
due_torri3.jpg,4,6,4,5,4,6,5,3,6,5,6,5,4,0,4
due_torri8.jpg,5,5,5,4,4,6,5,4,6,6,6,6,4,4,0
Type,R-Meta,R-Meta,R-Meta,R-Meta,R-Meta,R-Meta,R-Meta,R-Meta,R-Meta,R-Meta,R-Meta,R-Meta,R-Meta,R-Meta,R-Meta
due_torri1.jpg,0,2,3,3,3,2,5,1,1,2,4,1,1,3,4
due_torri14.jpg,2,0,3,3,3,2,7,3,3,4,4,3,3,5,4
due_torri5.jpg,3,3,0,4,2,1,4,2,4,3,3,2,2,4,5
due_torri2.jpg,3,3,4,0,2,3,8,4,4,5,5,4,4,6,3
due_torri12.jpg,3,3,2,2,0,3,6,2,4,3,5,2,2,4,3
due_torri4.jpg,2,2,1,3,3,0,5,3,3,4,2,3,3,5,4
due_torri0.jpg,5,7,4,8,6,5,0,4,4,3,5,4,4,2,7
due_torri9.jpg,1,3,2,4,2,3,4,0,2,1,5,0,0,2,5
due_torri7.jpg,1,3,4,4,4,3,4,2,0,1,3,2,2,2,3
due_torri11.jpg,2,4,3,5,3,4,3,1,1,0,4,1,1,1,4
due_torri6.jpg,4,4,3,5,5,2,5,5,3,4,0,5,5,5,4
due_torri10.jpg,1,3,2,4,2,3,4,0,2,1,5,0,0,2,5
due_torri13.jpg,1,3,2,4,2,3,4,0,2,1,5,0,0,2,5
due_torri3.jpg,3,5,4,6,4,5,2,2,2,1,5,2,2,0,5
due_torri8.jpg,4,4,5,3,3,4,7,5,3,4,4,5,5,5,0
Type,Content,Content,Content,Content,Content,Content,Content,Content,Content,Content,Content,Content,Content,Content,Content
due_torri1.jpg,0,13,12,13,11,13,13,12,12,12,12,13,13,13,12
due_torri14.jpg,13,0,13,12,13,13,13,12,11,12,13,12,12,13,13
due_torri5.jpg,12,13,0,12,13,12,11,13,13,13,12,13,13,13,11
due_torri2.jpg,13,12,12,0,13,12,12,13,11,11,13,13,13,13,13
due_torri12.jpg,11,13,13,13,0,12,13,12,13,13,13,12,13,11,13
due_torri4.jpg,13,13,12,12,12,0,12,13,13,12,13,13,13,12,12
due_torri0.jpg,13,13,11,12,13,12,0,13,13,12,12,13,12,13,12
due_torri9.jpg,12,12,13,13,12,13,13,0,13,13,12,12,13,12,13
due_torri7.jpg,12,11,13,11,13,13,13,13,0,12,13,13,13,11,13
due_torri11.jpg,12,12,13,11,13,12,12,13,12,0,12,13,12,13,12
due_torri6.jpg,12,13,12,13,13,13,12,12,13,12,0,12,13,12,12
due_torri10.jpg,13,12,13,13,12,13,13,12,13,13,12,0,13,12,11
due_torri13.jpg,13,12,13,13,13,13,12,13,13,12,13,13,0,13,13
due_torri3.jpg,13,13,13,13,11,12,13,12,11,13,12,12,13,0,13
due_torri8.jpg,12,13,11,13,13,12,12,13,13,12,12,11,13,13,0
Type,R-Content,R-Content,R-Content,R-Content,R-Content,R-Content,R-Content,R-Content,R-Content,R-Content,R-Content,R-Content,R-Content,R-Content,R-Content
due_torri1.jpg,0,6,5,6,8,5,5,4,7,8,6,4,8,7,3
due_torri14.jpg,6,0,7,6,8,5,7,4,7,4,8,6,10,7,5
due_torri5.jpg,5,7,0,3,7,6,2,7,6,9,5,5,7,8,4
due_torri2.jpg,6,6,3,0,6,9,3,6,7,8,8,4,6,5,3
due_torri12.jpg,8,8,7,6,0,7,5,8,9,10,6,6,2,3,5
due_torri4.jpg,5,5,6,9,7,0,6,7,8,7,5,5,7,8,6
due_torri0.jpg,5,7,2,3,5,6,0,7,4,7,5,5,5,6,4
due_torri9.jpg,4,4,7,6,8,7,7,0,5,8,6,4,8,7,3
due_torri7.jpg,7,7,6,7,9,8,4,5,0,5,7,9,9,8,8
due_torri11.jpg,8,4,9,8,10,7,7,8,5,0,10,10,12,7,9
due_torri6.jpg,6,8,5,8,6,5,5,6,7,10,0,4,4,9,5
due_torri10.jpg,4,6,5,4,6,5,5,4,9,10,4,0,4,5,1
due_torri13.jpg,8,10,7,6,2,7,5,8,9,12,4,4,0,5,5
due_torri3.jpg,7,7,8,5,3,8,6,7,8,7,9,5,5,0,4
due_torri8.jpg,3,5,4,3,5,6,4,3,8,9,5,1,5,4,0
Type,Final-R,Final-R,Final-R,Final-R,Final-R,Final-R,Final-R,Final-R,Final-R,Final-R,Final-R,Final-R,Final-R,Final-R,Final-R
due_torri1.jpg,0,2,3,3,3,2,5,1,1,2,4,1,1,3,4
due_torri14.jpg,2,0,3,3,3,2,7,3,3,4,4,3,3,5,4
due_torri5.jpg,3,3,0,4,2,1,4,2,4,3,3,2,2,4,5
due_torri2.jpg,3,3,4,0,2,3,8,4,4,5,5,4,4,6,3
due_torri12.jpg,3,3,2,2,0,3,6,2,4,3,5,2,2,4,3
due_torri4.jpg,2,2,1,3,3,0,5,3,3,4,2,3,3,5,4
due_torri0.jpg,5,7,4,8,6,5,0,4,4,3,5,4,4,2,7
due_torri9.jpg,1,3,2,4,2,3,4,0,2,1,5,0,0,2,5
due_torri7.jpg,1,3,4,4,4,3,4,2,0,1,3,2,2,2,3
due_torri11.jpg,2,4,3,5,3,4,3,1,1,0,4,1,1,1,4
due_torri6.jpg,4,4,3,5,5,2,5,5,3,4,0,5,5,5,4
due_torri10.jpg,1,3,2,4,2,3,4,0,2,1,5,0,0,2,5
due_torri13.jpg,1,3,2,4,2,3,4,0,2,1,5,0,0,2,5
due_torri3.jpg,3,5,4,6,4,5,2,2,2,1,5,2,2,0,5
due_torri8.jpg,4,4,5,3,3,4,7,5,3,4,4,5,5,5,0
