,statua_libertà14.jpg,statua_libertà13.jpg,statua_libertà7.jpg,statua_libertà2.jpg,statua_libertà10.jpg,statua_libertà0.jpg,statua_libertà5.jpg,statua_libertà6.jpg,statua_libertà11.jpg,statua_libertà8.jpg,statua_libertà9.jpg,statua_libertà1.jpg,statua_libertà12.jpg,statua_libertà4.jpg,statua_libertà3.jpg
Type,Meta,Meta,Meta,Meta,Meta,Meta,Meta,Meta,Meta,Meta,Meta,Meta,Meta,Meta,Meta
statua_libertà14.jpg,0,4,4,3,2,3,1,2,4,3,3,4,4,3,3
statua_libertà13.jpg,4,0,6,5,4,4,4,5,3,6,3,4,4,5,6
statua_libertà7.jpg,4,6,0,4,4,2,3,4,5,2,5,4,5,5,3
statua_libertà2.jpg,3,5,4,0,3,3,2,4,4,4,3,4,5,4,3
statua_libertà10.jpg,2,4,4,3,0,3,2,3,3,3,4,3,4,4,3
statua_libertà0.jpg,3,4,2,3,3,0,2,4,3,3,4,4,5,5,3
statua_libertà5.jpg,1,4,3,2,2,2,0,2,4,3,2,4,5,3,2
statua_libertà6.jpg,2,5,4,4,3,4,2,0,4,3,4,4,6,2,3
statua_libertà11.jpg,4,3,5,4,3,3,4,4,0,5,5,1,4,5,5
statua_libertà8.jpg,3,6,2,4,3,3,3,3,5,0,5,5,6,4,3
statua_libertà9.jpg,3,3,5,3,4,4,2,4,5,5,0,5,4,4,4
statua_libertà1.jpg,4,4,4,4,3,4,4,4,1,5,5,0,3,5,5
statua_libertà12.jpg,4,4,5,5,4,5,5,6,4,6,4,3,0,6,6
statua_libertà4.jpg,3,5,5,4,4,5,3,2,5,4,4,5,6,0,4
statua_libertà3.jpg,3,6,3,3,3,3,2,3,5,3,4,5,6,4,0
Type,R-Meta,R-Meta,R-Meta,R-Meta,R-Meta,R-Meta,R-Meta,R-Meta,R-Meta,R-Meta,R-Meta,R-Meta,R-Meta,R-Meta,R-Meta
statua_libertà14.jpg,0,2,3,1,2,3,0,0,3,2,1,3,5,0,1
statua_libertà13.jpg,2,0,5,3,4,3,2,2,3,4,1,5,3,2,3
statua_libertà7.jpg,3,5,0,2,3,2,3,3,4,1,4,2,4,3,2
statua_libertà2.jpg,1,3,2,0,1,2,1,1,2,1,2,2,4,1,0
statua_libertà10.jpg,2,4,3,1,0,3,2,2,1,2,3,1,3,2,1
statua_libertà0.jpg,3,3,2,2,3,0,3,3,2,1,2,4,4,3,2
statua_libertà5.jpg,0,2,3,1,2,3,0,0,3,2,1,3,5,0,1
statua_libertà6.jpg,0,2,3,1,2,3,0,0,3,2,1,3,5,0,1
statua_libertà11.jpg,3,3,4,2,1,2,3,3,0,3,2,2,2,3,2
statua_libertà8.jpg,2,4,1,1,2,1,2,2,3,0,3,3,5,2,1
statua_libertà9.jpg,1,1,4,2,3,2,1,1,2,3,0,4,4,1,2
statua_libertà1.jpg,3,5,2,2,1,4,3,3,2,3,4,0,2,3,2
statua_libertà12.jpg,5,3,4,4,3,4,5,5,2,5,4,2,0,5,4
statua_libertà4.jpg,0,2,3,1,2,3,0,0,3,2,1,3,5,0,1
statua_libertà3.jpg,1,3,2,0,1,2,1,1,2,1,2,2,4,1,0
Type,Content,Content,Content,Content,Content,Content,Content,Content,Content,Content,Content,Content,Content,Content,Content
statua_libertà14.jpg,0,13,11,11,13,11,11,13,11,12,13,13,10,11,13
statua_libertà13.jpg,13,0,12,13,13,12,13,13,13,13,13,12,13,13,13
statua_libertà7.jpg,11,12,0,13,13,11,13,13,9,12,12,11,13,10,13
statua_libertà2.jpg,11,13,13,0,13,13,12,13,12,12,13,12,13,13,13
statua_libertà10.jpg,13,13,13,13,0,13,12,10,13,13,11,13,13,13,11
statua_libertà0.jpg,11,12,11,13,13,0,13,13,12,12,11,13,11,11,13
statua_libertà5.jpg,11,13,13,12,12,13,0,13,10,13,12,13,13,13,13
statua_libertà6.jpg,13,13,13,13,10,13,13,0,12,12,10,13,13,13,12
statua_libertà11.jpg,11,13,9,12,13,12,10,12,0,13,13,12,12,11,13
statua_libertà8.jpg,12,13,12,12,13,12,13,12,13,0,13,12,13,11,12
statua_libertà9.jpg,13,13,12,13,11,11,12,10,13,13,0,12,13,13,12
statua_libertà1.jpg,13,12,11,12,13,13,13,13,12,12,12,0,13,12,12
statua_libertà12.jpg,10,13,13,13,13,11,13,13,12,13,13,13,0,13,13
statua_libertà4.jpg,11,13,10,13,13,11,13,13,11,11,13,12,13,0,13
statua_libertà3.jpg,13,13,13,13,11,13,13,12,13,12,12,12,13,13,0
Type,R-Content,R-Content,R-Content,R-Content,R-Content,R-Content,R-Content,R-Content,R-Content,R-Content,R-Content,R-Content,R-Content,R-Content,R-Content
statua_libertà14.jpg,0,8,8,8,8,6,7,9,8,11,10,11,10,8,11
statua_libertà13.jpg,8,0,8,8,6,10,7,11,6,11,12,11,12,8,11
statua_libertà7.jpg,8,8,0,12,6,6,7,11,8,11,10,7,12,8,9
statua_libertà2.jpg,8,8,12,0,12,12,9,9,8,11,10,11,8,12,13
statua_libertà10.jpg,8,6,6,12,0,8,7,9,6,11,10,9,10,6,7
statua_libertà0.jpg,6,10,6,12,8,0,9,11,8,11,8,7,10,6,9
statua_libertà5.jpg,7,7,7,9,7,9,0,10,5,12,9,10,11,7,12
statua_libertà6.jpg,9,11,11,9,9,11,10,0,11,10,7,8,7,7,8
statua_libertà11.jpg,8,6,8,8,6,8,5,11,0,13,8,9,10,8,9
statua_libertà8.jpg,11,11,11,11,11,11,12,10,13,0,9,8,11,9,8
statua_libertà9.jpg,10,12,10,10,10,8,9,7,8,9,0,5,12,8,7
statua_libertà1.jpg,11,11,7,11,9,7,10,8,9,8,5,0,9,9,8
statua_libertà12.jpg,10,12,12,8,10,10,11,7,10,11,12,9,0,12,9
statua_libertà4.jpg,8,8,8,12,6,6,7,7,8,9,8,9,12,0,9
statua_libertà3.jpg,11,11,9,13,7,9,12,8,9,8,7,8,9,9,0
Type,Final-R,Final-R,Final-R,Final-R,Final-R,Final-R,Final-R,Final-R,Final-R,Final-R,Final-R,Final-R,Final-R,Final-R,Final-R
statua_libertà14.jpg,0,2,3,1,2,3,0,0,3,2,1,3,5,0,1
statua_libertà13.jpg,2,0,5,3,4,3,2,2,3,4,1,5,3,2,3
statua_libertà7.jpg,3,5,0,2,3,2,3,3,4,1,4,2,4,3,2
statua_libertà2.jpg,1,3,2,0,1,2,1,1,2,1,2,2,4,1,0
statua_libertà10.jpg,2,4,3,1,0,3,2,2,1,2,3,1,3,2,1
statua_libertà0.jpg,3,3,2,2,3,0,3,3,2,1,2,4,4,3,2
statua_libertà5.jpg,0,2,3,1,2,3,0,0,3,2,1,3,5,0,1
statua_libertà6.jpg,0,2,3,1,2,3,0,0,3,2,1,3,5,0,1
statua_libertà11.jpg,3,3,4,2,1,2,3,3,0,3,2,2,2,3,2
statua_libertà8.jpg,2,4,1,1,2,1,2,2,3,0,3,3,5,2,1
statua_libertà9.jpg,1,1,4,2,3,2,1,1,2,3,0,4,4,1,2
statua_libertà1.jpg,3,5,2,2,1,4,3,3,2,3,4,0,2,3,2
statua_libertà12.jpg,5,3,4,4,3,4,5,5,2,5,4,2,0,5,4
statua_libertà4.jpg,0,2,3,1,2,3,0,0,3,2,1,3,5,0,1
statua_libertà3.jpg,1,3,2,0,1,2,1,1,2,1,2,2,4,1,0
