,il_bacio0.jpg,il_bacio3.jpg,il_bacio4.jpg,il_bacio7.jpg,il_bacio12.jpg,il_bacio10.jpg,il_bacio2.jpg,il_bacio5.jpg,il_bacio11.jpg,il_bacio6.jpg,il_bacio13.jpg,il_bacio9.jpg,il_bacio14.jpg,il_bacio1.jpg,il_bacio8.jpg
Type,Meta,Meta,Meta,Meta,Meta,Meta,Meta,Meta,Meta,Meta,Meta,Meta,Meta,Meta,Meta
il_bacio0.jpg,0,5,5,6,6,5,5,4,6,4,6,3,4,7,7
il_bacio3.jpg,5,0,4,4,4,6,6,4,4,4,3,5,6,4,5
il_bacio4.jpg,5,4,0,6,3,6,5,4,4,4,5,5,5,6,4
il_bacio7.jpg,6,4,6,0,5,6,5,5,5,5,4,5,5,4,4
il_bacio12.jpg,6,4,3,5,0,3,3,3,2,3,5,5,4,4,5
il_bacio10.jpg,5,6,6,6,3,0,4,4,4,4,5,5,5,5,7
il_bacio2.jpg,5,6,5,5,3,4,0,3,4,4,5,5,3,4,6
il_bacio5.jpg,4,4,4,5,3,4,3,0,4,4,3,2,5,4,5
il_bacio11.jpg,6,4,4,5,2,4,4,4,0,3,5,5,4,3,5
il_bacio6.jpg,4,4,4,5,3,4,4,4,3,0,5,4,5,4,6
il_bacio13.jpg,6,3,5,4,5,5,5,3,5,5,0,4,6,3,5
il_bacio9.jpg,3,5,5,5,5,5,5,2,5,4,4,0,5,5,5
il_bacio14.jpg,4,6,5,5,4,5,3,5,4,5,6,5,0,5,5
il_bacio1.jpg,7,4,6,4,4,5,4,4,3,4,3,5,5,0,5
il_bacio8.jpg,7,5,4,4,5,7,6,5,5,6,5,5,5,5,0
Type,Content,Content,Content,Content,Content,Content,Content,Content,Content,Content,Content,Content,Content,Content,Content
il_bacio0.jpg,0,5,9,8,11,7,7,13,11,9,8,11,12,8,12
il_bacio3.jpg,5,0,9,7,11,8,6,13,12,9,9,11,12,7,11
il_bacio4.jpg,9,9,0,10,10,10,9,12,10,8,7,11,12,10,11
il_bacio7.jpg,8,7,10,0,11,9,9,13,12,6,12,12,13,9,11
il_bacio12.jpg,11,11,10,11,0,12,11,13,9,11,11,8,12,13,12
il_bacio10.jpg,7,8,10,9,12,0,10,12,12,10,9,11,12,9,12
il_bacio2.jpg,7,6,9,9,11,10,0,12,11,9,11,12,12,10,11
il_bacio5.jpg,13,13,12,13,13,12,12,0,13,11,12,13,12,12,13
il_bacio11.jpg,11,12,10,12,9,12,11,13,0,12,12,9,13,12,9
il_bacio6.jpg,9,9,8,6,11,10,9,11,12,0,10,12,12,11,11
il_bacio13.jpg,8,9,7,12,11,9,11,12,12,10,0,11,11,9,12
il_bacio9.jpg,11,11,11,12,8,11,12,13,9,12,11,0,11,12,11
il_bacio14.jpg,12,12,12,13,12,12,12,12,13,12,11,11,0,13,12
il_bacio1.jpg,8,7,10,9,13,9,10,12,12,11,9,12,13,0,10
il_bacio8.jpg,12,11,11,11,12,12,11,13,9,11,12,11,12,10,0
Type,Final-R,Final-R,Final-R,Final-R,Final-R,Final-R,Final-R,Final-R,Final-R,Final-R,Final-R,Final-R,Final-R,Final-R,Final-R
il_bacio0.jpg,0,16,25,20,31,17,19,27,32,23,19,20,23,23,29
il_bacio3.jpg,16,0,19,10,25,19,19,25,28,19,21,22,25,19,25
il_bacio4.jpg,25,19,0,23,20,24,22,26,25,22,16,25,24,24,18
il_bacio7.jpg,20,10,23,0,27,21,19,29,30,17,25,28,25,21,25
il_bacio12.jpg,31,25,20,27,0,26,20,28,17,22,26,25,24,30,26
il_bacio10.jpg,17,19,24,21,26,0,22,26,25,20,18,23,24,20,28
il_bacio2.jpg,19,19,22,19,20,22,0,22,27,18,26,27,22,24,28
il_bacio5.jpg,27,25,26,29,28,26,22,0,29,22,24,25,26,26,28
il_bacio11.jpg,32,28,25,30,17,25,27,29,0,25,29,26,29,27,25
il_bacio6.jpg,23,19,22,17,22,20,18,22,25,0,24,23,22,26,22
il_bacio13.jpg,19,21,16,25,26,18,26,24,29,24,0,23,28,20,24
il_bacio9.jpg,20,22,25,28,25,23,27,25,26,23,23,0,25,29,27
il_bacio14.jpg,23,25,24,25,24,24,22,26,29,22,28,25,0,32,26
il_bacio1.jpg,23,19,24,21,30,20,24,26,27,26,20,29,32,0,24
il_bacio8.jpg,29,25,18,25,26,28,28,28,25,22,24,27,26,24,0
