,reggia_caserta11.jpg,reggia_caserta2.jpg,reggia_caserta14.jpg,reggia_caserta9.jpg,reggia_caserta10.jpg,reggia_caserta7.jpg,reggia_caserta8.jpg,reggia_caserta6.jpg,reggia_caserta1.jpg,reggia_caserta0.jpg,reggia_caserta5.jpg,reggia_caserta3.jpg,reggia_caserta12.jpg,reggia_caserta13.jpg,reggia_caserta4.jpg
Type,Meta,Meta,Meta,Meta,Meta,Meta,Meta,Meta,Meta,Meta,Meta,Meta,Meta,Meta,Meta
reggia_caserta11.jpg,0,5,6,3,4,3,4,2,1,4,3,5,3,3,4
reggia_caserta2.jpg,5,0,5,6,6,5,6,4,6,4,4,4,6,4,5
reggia_caserta14.jpg,6,5,0,6,3,5,5,6,5,3,4,4,4,5,3
reggia_caserta9.jpg,3,6,6,0,4,4,4,3,3,5,5,4,3,3,4
reggia_caserta10.jpg,4,6,3,4,0,4,6,4,3,3,4,5,2,5,1
reggia_caserta7.jpg,3,5,5,4,4,0,5,2,4,3,3,5,5,3,4
reggia_caserta8.jpg,4,6,5,4,6,5,0,6,4,6,6,5,5,5,6
reggia_caserta6.jpg,2,4,6,3,4,2,6,0,3,4,3,5,4,3,4
reggia_caserta1.jpg,1,6,5,3,3,4,4,3,0,3,4,4,2,4,3
reggia_caserta0.jpg,4,4,3,5,3,3,6,4,3,0,4,4,4,4,2
reggia_caserta5.jpg,3,4,4,5,4,3,6,3,4,4,0,5,5,5,4
reggia_caserta3.jpg,5,4,4,4,5,5,5,5,4,4,5,0,4,3,5
reggia_caserta12.jpg,3,6,4,3,2,5,5,4,2,4,5,4,0,4,2
reggia_caserta13.jpg,3,4,5,3,5,3,5,3,4,4,5,3,4,0,5
reggia_caserta4.jpg,4,5,3,4,1,4,6,4,3,2,4,5,2,5,0
Type,R-Meta,R-Meta,R-Meta,R-Meta,R-Meta,R-Meta,R-Meta,R-Meta,R-Meta,R-Meta,R-Meta,R-Meta,R-Meta,R-Meta,R-Meta
reggia_caserta11.jpg,0,2,2,2,2,2,0,2,0,2,2,2,2,2,2
reggia_caserta2.jpg,2,0,2,2,2,2,2,2,2,0,2,2,2,2,0
reggia_caserta14.jpg,2,2,0,2,2,2,2,2,2,2,0,2,2,2,2
reggia_caserta9.jpg,2,2,2,0,2,0,2,0,2,2,2,0,2,0,2
reggia_caserta10.jpg,2,2,2,2,0,2,2,2,2,2,2,2,2,2,2
reggia_caserta7.jpg,2,2,2,0,2,0,2,0,2,2,2,0,2,0,2
reggia_caserta8.jpg,0,2,2,2,2,2,0,2,0,2,2,2,2,2,2
reggia_caserta6.jpg,2,2,2,0,2,0,2,0,2,2,2,0,2,0,2
reggia_caserta1.jpg,0,2,2,2,2,2,0,2,0,2,2,2,2,2,2
reggia_caserta0.jpg,2,0,2,2,2,2,2,2,2,0,2,2,2,2,0
reggia_caserta5.jpg,2,2,0,2,2,2,2,2,2,2,0,2,2,2,2
reggia_caserta3.jpg,2,2,2,0,2,0,2,0,2,2,2,0,2,0,2
reggia_caserta12.jpg,2,2,2,2,2,2,2,2,2,2,2,2,0,2,2
reggia_caserta13.jpg,2,2,2,0,2,0,2,0,2,2,2,0,2,0,2
reggia_caserta4.jpg,2,0,2,2,2,2,2,2,2,0,2,2,2,2,0
Type,Content,Content,Content,Content,Content,Content,Content,Content,Content,Content,Content,Content,Content,Content,Content
reggia_caserta11.jpg,0,12,13,12,13,12,13,12,11,13,13,13,12,13,13
reggia_caserta2.jpg,12,0,12,13,11,13,10,13,13,13,12,13,13,13,11
reggia_caserta14.jpg,13,12,0,12,13,11,12,10,11,12,12,13,10,12,13
reggia_caserta9.jpg,12,13,12,0,12,13,11,12,13,11,12,12,12,11,12
reggia_caserta10.jpg,13,11,13,12,0,13,11,12,13,12,13,13,13,12,0
reggia_caserta7.jpg,12,13,11,13,13,0,13,13,13,13,13,13,9,13,13
reggia_caserta8.jpg,13,10,12,11,11,13,0,13,12,11,12,13,13,13,11
reggia_caserta6.jpg,12,13,10,12,12,13,13,0,11,12,12,13,12,12,12
reggia_caserta1.jpg,11,13,11,13,13,13,12,11,0,12,12,11,13,12,13
reggia_caserta0.jpg,13,13,12,11,12,13,11,12,12,0,13,12,11,10,12
reggia_caserta5.jpg,13,12,12,12,13,13,12,12,12,13,0,11,13,13,13
reggia_caserta3.jpg,13,13,13,12,13,13,13,13,11,12,11,0,13,13,13
reggia_caserta12.jpg,12,13,10,12,13,9,13,12,13,11,13,13,0,12,13
reggia_caserta13.jpg,13,13,12,11,12,13,13,12,12,10,13,13,12,0,12
reggia_caserta4.jpg,13,11,13,12,0,13,11,12,13,12,13,13,13,12,0
Type,R-Content,R-Content,R-Content,R-Content,R-Content,R-Content,R-Content,R-Content,R-Content,R-Content,R-Content,R-Content,R-Content,R-Content,R-Content
reggia_caserta11.jpg,0,6,5,8,7,3,8,8,5,8,8,8,6,7,7
reggia_caserta2.jpg,6,0,7,8,5,7,6,8,5,8,8,8,8,7,5
reggia_caserta14.jpg,5,7,0,5,6,4,7,5,6,5,7,5,3,4,6
reggia_caserta9.jpg,8,8,5,0,5,7,8,4,7,6,6,4,6,5,5
reggia_caserta10.jpg,7,5,6,5,0,6,5,3,4,7,7,7,7,6,0
reggia_caserta7.jpg,3,7,4,7,6,0,7,7,4,7,7,7,3,6,6
reggia_caserta8.jpg,8,6,7,8,5,7,0,8,5,4,6,8,8,5,5
reggia_caserta6.jpg,8,8,5,4,3,7,8,0,7,6,8,6,6,5,3
reggia_caserta1.jpg,5,5,6,7,4,4,5,7,0,7,5,5,5,6,4
reggia_caserta0.jpg,8,8,5,6,7,7,4,6,7,0,8,6,4,3,7
reggia_caserta5.jpg,8,8,7,6,7,7,6,8,5,8,0,6,8,7,7
reggia_caserta3.jpg,8,8,5,4,7,7,8,6,5,6,6,0,6,5,7
reggia_caserta12.jpg,6,8,3,6,7,3,8,6,5,4,8,6,0,5,7
reggia_caserta13.jpg,7,7,4,5,6,6,5,5,6,3,7,5,5,0,6
reggia_caserta4.jpg,7,5,6,5,0,6,5,3,4,7,7,7,7,6,0
Type,Final-R,Final-R,Final-R,Final-R,Final-R,Final-R,Final-R,Final-R,Final-R,Final-R,Final-R,Final-R,Final-R,Final-R,Final-R
reggia_caserta11.jpg,0,6,5,8,7,3,8,8,5,8,8,8,6,7,7
reggia_caserta2.jpg,6,0,7,8,5,7,6,8,5,8,8,8,8,7,5
reggia_caserta14.jpg,5,7,0,5,6,4,7,5,6,5,7,5,3,4,6
reggia_caserta9.jpg,8,8,5,0,5,7,8,4,7,6,6,4,6,5,5
reggia_caserta10.jpg,7,5,6,5,0,6,5,3,4,7,7,7,7,6,0
reggia_caserta7.jpg,3,7,4,7,6,0,7,7,4,7,7,7,3,6,6
reggia_caserta8.jpg,8,6,7,8,5,7,0,8,5,4,6,8,8,5,5
reggia_caserta6.jpg,8,8,5,4,3,7,8,0,7,6,8,6,6,5,3
reggia_caserta1.jpg,5,5,6,7,4,4,5,7,0,7,5,5,5,6,4
reggia_caserta0.jpg,8,8,5,6,7,7,4,6,7,0,8,6,4,3,7
reggia_caserta5.jpg,8,8,7,6,7,7,6,8,5,8,0,6,8,7,7
reggia_caserta3.jpg,8,8,5,4,7,7,8,6,5,6,6,0,6,5,7
reggia_caserta12.jpg,6,8,3,6,7,3,8,6,5,4,8,6,0,5,7
reggia_caserta13.jpg,7,7,4,5,6,6,5,5,6,3,7,5,5,0,6
reggia_caserta4.jpg,7,5,6,5,0,6,5,3,4,7,7,7,7,6,0
