,cinque_terre10.jpg,cinque_terre2.jpg,cinque_terre7.jpg,cinque_terre4.jpg,cinque_terre0.jpg,cinque_terre8.jpg,cinque_terre1.jpg,cinque_terre9.jpg,cinque_terre3.jpg,cinque_terre5.jpg,cinque_terre6.jpg,cinque_terre14.jpg,cinque_terre12.jpg,cinque_terre11.jpg,cinque_terre13.jpg
Type,SHA256,SHA256,SHA256,SHA256,SHA256,SHA256,SHA256,SHA256,SHA256,SHA256,SHA256,SHA256,SHA256,SHA256,SHA256
cinque_terre10.jpg,0,60,60,63,58,56,60,58,61,58,58,62,59,59,58
cinque_terre2.jpg,60,0,62,61,61,61,62,60,59,60,62,62,63,60,61
cinque_terre7.jpg,60,62,0,57,62,62,61,59,59,64,59,58,63,56,61
cinque_terre4.jpg,63,61,57,0,61,63,61,60,58,59,57,59,59,63,58
cinque_terre0.jpg,58,61,62,61,0,58,61,60,64,59,61,62,59,61,61
cinque_terre8.jpg,56,61,62,63,58,0,57,62,61,61,61,63,60,62,57
cinque_terre1.jpg,60,62,61,61,61,57,0,62,63,59,60,55,60,61,61
cinque_terre9.jpg,58,60,59,60,60,62,62,0,58,57,57,60,59,59,59
cinque_terre3.jpg,61,59,59,58,64,61,63,58,0,63,59,61,59,59,58
cinque_terre5.jpg,58,60,64,59,59,61,59,57,63,0,60,61,61,62,60
cinque_terre6.jpg,58,62,59,57,61,61,60,57,59,60,0,62,60,60,64
cinque_terre14.jpg,62,62,58,59,62,63,55,60,61,61,62,0,60,61,60
cinque_terre12.jpg,59,63,63,59,59,60,60,59,59,61,60,60,0,59,56
cinque_terre11.jpg,59,60,56,63,61,62,61,59,59,62,60,61,59,0,61
cinque_terre13.jpg,58,61,61,58,61,57,61,59,58,60,64,60,56,61,0
Type,Final-R,Final-R,Final-R,Final-R,Final-R,Final-R,Final-R,Final-R,Final-R,Final-R,Final-R,Final-R,Final-R,Final-R,Final-R
cinque_terre10.jpg,0,6,6,6,4,3,3,4,6,2,6,5,2,3,4
cinque_terre2.jpg,6,0,2,2,4,3,5,2,2,4,2,3,4,5,2
cinque_terre7.jpg,6,2,0,4,2,3,5,2,0,6,2,1,4,3,4
cinque_terre4.jpg,6,2,4,0,4,5,3,4,4,4,2,3,6,7,2
cinque_terre0.jpg,4,4,2,4,0,3,3,4,2,4,4,1,4,3,4
cinque_terre8.jpg,3,3,3,5,3,0,2,3,3,5,3,4,1,2,5
cinque_terre1.jpg,3,5,5,3,3,2,0,5,5,5,3,4,3,4,5
cinque_terre9.jpg,4,2,2,4,4,3,5,0,2,4,2,3,4,3,2
cinque_terre3.jpg,6,2,0,4,2,3,5,2,0,6,2,1,4,3,4
cinque_terre5.jpg,2,4,6,4,4,5,5,4,6,0,6,5,4,5,2
cinque_terre6.jpg,6,2,2,2,4,3,3,2,2,6,0,3,4,5,4
cinque_terre14.jpg,5,3,1,3,1,4,4,3,1,5,3,0,5,4,3
cinque_terre12.jpg,2,4,4,6,4,1,3,4,4,4,4,5,0,3,6
cinque_terre11.jpg,3,5,3,7,3,2,4,3,3,5,5,4,3,0,5
cinque_terre13.jpg,4,2,4,2,4,5,5,2,4,2,4,3,6,5,0
