,torre_pisa0.jpg,torre_pisa5.jpg,torre_pisa11.jpg,torre_pisa13.jpg,torre_pisa12.jpg,torre_pisa3.jpg,torre_pisa4.jpg,torre_pisa10.jpg,torre_pisa7.jpg,torre_pisa1.jpg,torre_pisa6.jpg,torre_pisa9.jpg,torre_pisa8.jpg,torre_pisa2.jpg,torre_pisa14.jpg
Type,Meta,Meta,Meta,Meta,Meta,Meta,Meta,Meta,Meta,Meta,Meta,Meta,Meta,Meta,Meta
torre_pisa0.jpg,0,2,4,4,5,4,4,4,5,3,3,3,3,5,4
torre_pisa5.jpg,2,0,3,3,5,3,5,4,4,3,3,2,2,5,4
torre_pisa11.jpg,4,3,0,4,6,2,5,5,3,5,3,4,3,4,4
torre_pisa13.jpg,4,3,4,0,4,3,6,3,3,4,4,5,4,6,4
torre_pisa12.jpg,5,5,6,4,0,5,7,4,5,5,5,6,6,6,5
torre_pisa3.jpg,4,3,2,3,5,0,4,4,2,4,4,4,3,5,2
torre_pisa4.jpg,4,5,5,6,7,4,0,6,5,5,6,5,5,6,4
torre_pisa10.jpg,4,4,5,3,4,4,6,0,4,2,4,5,5,5,3
torre_pisa7.jpg,5,4,3,3,5,2,5,4,0,5,5,5,3,5,3
torre_pisa1.jpg,3,3,5,4,5,4,5,2,5,0,4,4,4,5,3
torre_pisa6.jpg,3,3,3,4,5,4,6,4,5,4,0,3,4,3,5
torre_pisa9.jpg,3,2,4,5,6,4,5,5,5,4,3,0,3,4,4
torre_pisa8.jpg,3,2,3,4,6,3,5,5,3,4,4,3,0,5,4
torre_pisa2.jpg,5,5,4,6,6,5,6,5,5,5,3,4,5,0,5
torre_pisa14.jpg,4,4,4,4,5,2,4,3,3,3,5,4,4,5,0
Type,R-Meta,R-Meta,R-Meta,R-Meta,R-Meta,R-Meta,R-Meta,R-Meta,R-Meta,R-Meta,R-Meta,R-Meta,R-Meta,R-Meta,R-Meta
torre_pisa0.jpg,0,3,5,3,3,5,5,3,5,5,3,3,5,7,3
torre_pisa5.jpg,3,0,6,4,4,4,8,4,6,4,4,0,4,8,2
torre_pisa11.jpg,5,6,0,6,6,2,8,6,4,8,4,6,4,6,4
torre_pisa13.jpg,3,4,6,0,4,6,8,4,6,6,4,4,6,8,4
torre_pisa12.jpg,3,4,6,4,0,6,6,2,6,2,4,4,6,4,4
torre_pisa3.jpg,5,4,2,6,6,0,8,6,4,6,4,4,2,6,2
torre_pisa4.jpg,5,8,8,8,6,8,0,8,8,6,8,8,8,8,8
torre_pisa10.jpg,3,4,6,4,2,6,8,0,6,4,4,4,6,6,4
torre_pisa7.jpg,5,6,4,6,6,4,8,6,0,8,6,6,2,6,4
torre_pisa1.jpg,5,4,8,6,2,6,6,4,8,0,6,4,6,6,4
torre_pisa6.jpg,3,4,4,4,4,4,8,4,6,6,0,4,6,6,4
torre_pisa9.jpg,3,0,6,4,4,4,8,4,6,4,4,0,4,8,2
torre_pisa8.jpg,5,4,4,6,6,2,8,6,2,6,6,4,0,6,2
torre_pisa2.jpg,7,8,6,8,4,6,8,6,6,6,6,8,6,0,6
torre_pisa14.jpg,3,2,4,4,4,2,8,4,4,4,4,2,2,6,0
Type,Content,Content,Content,Content,Content,Content,Content,Content,Content,Content,Content,Content,Content,Content,Content
torre_pisa0.jpg,0,13,13,13,11,13,11,12,12,13,12,13,12,11,12
torre_pisa5.jpg,13,0,13,13,13,12,12,12,13,12,12,13,12,13,13
torre_pisa11.jpg,13,13,0,12,13,13,13,13,13,13,12,12,9,12,13
torre_pisa13.jpg,13,13,12,0,13,13,13,13,12,13,13,13,13,12,13
torre_pisa12.jpg,11,13,13,13,0,13,11,13,13,12,13,13,12,12,13
torre_pisa3.jpg,13,12,13,13,13,0,13,13,11,13,11,12,13,11,13
torre_pisa4.jpg,11,12,13,13,11,13,0,12,13,13,12,12,12,13,13
torre_pisa10.jpg,12,12,13,13,13,13,12,0,13,13,11,11,13,13,13
torre_pisa7.jpg,12,13,13,12,13,11,13,13,0,13,13,13,13,12,11
torre_pisa1.jpg,13,12,13,13,12,13,13,13,13,0,13,13,13,13,13
torre_pisa6.jpg,12,12,12,13,13,11,12,11,13,13,0,12,12,13,12
torre_pisa9.jpg,13,13,12,13,13,12,12,11,13,13,12,0,11,12,13
torre_pisa8.jpg,12,12,9,13,12,13,12,13,13,13,12,11,0,13,13
torre_pisa2.jpg,11,13,12,12,12,11,13,13,12,13,13,12,13,0,12
torre_pisa14.jpg,12,13,13,13,13,13,13,13,11,13,12,13,13,12,0
Type,R-Content,R-Content,R-Content,R-Content,R-Content,R-Content,R-Content,R-Content,R-Content,R-Content,R-Content,R-Content,R-Content,R-Content,R-Content
torre_pisa0.jpg,0,9,12,11,9,12,10,8,8,13,13,13,8,7,11
torre_pisa5.jpg,9,0,13,10,10,13,9,11,11,14,12,12,11,10,14
torre_pisa11.jpg,12,13,0,9,9,10,12,12,12,11,11,11,6,11,11
torre_pisa13.jpg,11,10,9,0,12,13,9,11,9,12,10,12,13,14,14
torre_pisa12.jpg,9,10,9,12,0,7,11,11,11,8,12,12,9,10,10
torre_pisa3.jpg,12,13,10,13,7,0,12,12,12,11,9,13,8,13,13
torre_pisa4.jpg,10,9,12,9,11,12,0,10,8,9,13,11,12,11,13
torre_pisa10.jpg,8,11,12,11,11,12,10,0,10,13,13,11,12,11,11
torre_pisa7.jpg,8,11,12,9,11,12,8,10,0,11,11,11,10,9,11
torre_pisa1.jpg,13,14,11,12,8,11,9,13,11,0,14,14,13,12,12
torre_pisa6.jpg,13,12,11,10,12,9,13,13,11,14,0,12,11,14,12
torre_pisa9.jpg,13,12,11,12,12,13,11,11,11,14,12,0,11,10,10
torre_pisa8.jpg,8,11,6,13,9,8,12,12,10,13,11,11,0,7,11
torre_pisa2.jpg,7,10,11,14,10,13,11,11,9,12,14,10,7,0,12
torre_pisa14.jpg,11,14,11,14,10,13,13,11,11,12,12,10,11,12,0
Type,Final-R,Final-R,Final-R,Final-R,Final-R,Final-R,Final-R,Final-R,Final-R,Final-R,Final-R,Final-R,Final-R,Final-R,Final-R
torre_pisa0.jpg,0,9,13,10,10,15,13,9,12,14,12,13,13,13,13
torre_pisa5.jpg,9,0,14,11,11,14,12,12,13,13,13,10,12,14,12
torre_pisa11.jpg,13,14,0,13,9,10,16,12,13,13,11,14,6,10,12
torre_pisa13.jpg,10,11,13,0,12,17,13,13,14,14,12,13,17,19,13
torre_pisa12.jpg,10,11,9,12,0,9,15,9,14,8,10,13,13,11,11
torre_pisa3.jpg,15,14,10,17,9,0,18,16,15,13,9,16,8,12,14
torre_pisa4.jpg,13,12,16,13,15,18,0,14,13,13,17,18,18,18,18
torre_pisa10.jpg,9,12,12,13,9,16,14,0,15,13,11,14,16,14,10
torre_pisa7.jpg,12,13,13,14,14,15,13,15,0,16,14,15,11,13,15
torre_pisa1.jpg,14,13,13,14,8,13,13,13,16,0,14,15,15,13,13
torre_pisa6.jpg,12,13,11,12,10,9,17,11,14,14,0,13,11,15,13
torre_pisa9.jpg,13,10,14,13,13,16,18,14,15,15,13,0,12,14,10
torre_pisa8.jpg,13,12,6,17,13,8,18,16,11,15,11,12,0,12,12
torre_pisa2.jpg,13,14,10,19,11,12,18,14,13,13,15,14,12,0,14
torre_pisa14.jpg,13,12,12,13,11,14,18,10,15,13,13,10,12,14,0
