,fontana_trevi6.jpg,fontana_trevi11.jpg,fontana_trevi5.jpg,fontana_trevi13.jpg,fontana_trevi3.jpg,fontana_trevi8.jpg,fontana_trevi2.jpg,fontana_trevi0.jpg,fontana_trevi7.jpg,fontana_trevi9.jpg,fontana_trevi10.jpg,fontana_trevi1.jpg,fontana_trevi4.jpg,fontana_trevi14.jpg,fontana_trevi12.jpg
Type,SHA256,SHA256,SHA256,SHA256,SHA256,SHA256,SHA256,SHA256,SHA256,SHA256,SHA256,SHA256,SHA256,SHA256,SHA256
fontana_trevi6.jpg,0,62,58,62,61,62,62,62,59,59,63,62,58,58,62
fontana_trevi11.jpg,62,0,63,62,60,63,59,62,60,59,60,60,60,58,60
fontana_trevi5.jpg,58,63,0,58,59,61,61,60,60,60,63,59,60,60,55
fontana_trevi13.jpg,62,62,58,0,57,61,60,62,61,59,60,61,62,60,62
fontana_trevi3.jpg,61,60,59,57,0,64,62,60,58,59,63,61,58,58,62
fontana_trevi8.jpg,62,63,61,61,64,0,58,61,63,59,61,59,63,57,58
fontana_trevi2.jpg,62,59,61,60,62,58,0,58,62,63,60,57,56,60,59
fontana_trevi0.jpg,62,62,60,62,60,61,58,0,62,58,57,57,62,61,60
fontana_trevi7.jpg,59,60,60,61,58,63,62,62,0,58,59,55,63,60,58
fontana_trevi9.jpg,59,59,60,59,59,59,63,58,58,0,62,61,63,60,59
fontana_trevi10.jpg,63,60,63,60,63,61,60,57,59,62,0,58,60,62,62
fontana_trevi1.jpg,62,60,59,61,61,59,57,57,55,61,58,0,60,58,61
fontana_trevi4.jpg,58,60,60,62,58,63,56,62,63,63,60,60,0,63,59
fontana_trevi14.jpg,58,58,60,60,58,57,60,61,60,60,62,58,63,0,61
fontana_trevi12.jpg,62,60,55,62,62,58,59,60,58,59,62,61,59,61,0
Type,Final-R,Final-R,Final-R,Final-R,Final-R,Final-R,Final-R,Final-R,Final-R,Final-R,Final-R,Final-R,Final-R,Final-R,Final-R
fontana_trevi6.jpg,0,8,6,8,8,6,6,8,8,8,8,8,8,8,8
fontana_trevi11.jpg,8,0,8,8,8,8,8,8,8,8,8,8,6,8,8
fontana_trevi5.jpg,6,8,0,8,8,8,8,6,8,8,8,8,8,8,8
fontana_trevi13.jpg,8,8,8,0,8,8,8,8,8,8,8,6,8,4,8
fontana_trevi3.jpg,8,8,8,8,0,8,8,8,6,8,8,8,8,8,8
fontana_trevi8.jpg,6,8,8,8,8,0,6,8,8,8,8,8,6,8,6
fontana_trevi2.jpg,6,8,8,8,8,6,0,8,8,8,8,8,6,8,8
fontana_trevi0.jpg,8,8,6,8,8,8,8,0,8,8,8,8,8,8,8
fontana_trevi7.jpg,8,8,8,8,6,8,8,8,0,8,8,8,8,8,8
fontana_trevi9.jpg,8,8,8,8,8,8,8,8,8,0,8,8,8,8,8
fontana_trevi10.jpg,8,8,8,8,8,8,8,8,8,8,0,8,8,8,8
fontana_trevi1.jpg,8,8,8,6,8,8,8,8,8,8,8,0,8,8,8
fontana_trevi4.jpg,8,6,8,8,8,6,6,8,8,8,8,8,0,8,8
fontana_trevi14.jpg,8,8,8,4,8,8,8,8,8,8,8,8,8,0,8
fontana_trevi12.jpg,8,8,8,8,8,6,8,8,8,8,8,8,8,8,0
