Img-Name,SHA256,Final-R
fontana_trevi6.jpg,a428a99dec58f174b75c3a6848a91ca616cb721374a4d64905359af7b50506b8,"[0, 0, 0, 0, 0, 0, 1, 0, 1, 1, 0, 0, 0, 0, 0, 0, 0, 0, 0, 1, 1, 0, 0, 1, 1, 0, 0, 0, 0, 1, 0, 0]"
fontana_trevi11.jpg,1a80f2eac7de34f9962a51a4704671b488aaafd3dbf085e35e5226c22edf5818,"[0, 0, 1, 1, 1, 0, 0, 0, 0, 0, 1, 0, 0, 0, 0, 0, 0, 0, 0, 1, 1, 0, 0, 0, 1, 1, 0, 0, 0, 0, 0, 0]"
fontana_trevi5.jpg,5b2f722906ba653d45dec7c6ee1b5026a7e94bc0739a3301c46f91d07f3501ef,"[1, 1, 0, 0, 0, 0, 1, 0, 0, 1, 0, 0, 0, 0, 0, 1, 1, 0, 0, 0, 0, 0, 0, 0, 0, 0, 0, 0, 0, 1, 0, 0]"
fontana_trevi13.jpg,6a6184672a270006ce9eda6501fdb02a7de7b03c30c10dc290eaf4b4ee43b15f,"[0, 0, 1, 0, 0, 1, 1, 1, 0, 0, 1, 0, 0, 0, 0, 0, 0, 0, 0, 0, 1, 0, 0, 0, 0, 0, 0, 0, 1, 0, 0, 1]"
fontana_trevi3.jpg,05541ec7cbb7b066daee268240369c56f4085dcd492f0733d2c03740fc21b709,"[1, 0, 1, 0, 0, 0, 1, 1, 0, 1, 0, 0, 0, 1, 0, 0, 0, 0, 0, 1, 0, 0, 1, 0, 0, 0, 0, 0, 0, 0, 0, 0]"
fontana_trevi8.jpg,927fdf0cdcca482fa4154dda940e8fd783c6b864a0c3c4f4c72c7581619be38b,"[0, 1, 0, 0, 1, 0, 0, 0, 0, 0, 0, 1, 1, 0, 0, 1, 0, 0, 0, 0, 1, 0, 0, 1, 0, 0, 1, 0, 0, 0, 0, 0]"
fontana_trevi2.jpg,bc0f54ff19cc023c1277a00c92e631556f9e12f95871a1f4763c237f8f4f5f43,"[0, 0, 0, 1, 0, 0, 0, 0, 0, 0, 0, 0, 1, 0, 0, 0, 0, 0, 0, 0, 1, 1, 0, 0, 0, 1, 0, 0, 1, 0, 0, 1]"
fontana_trevi0.jpg,c8be55c8961fb89173391736bb9a313d00de3196421d987df5cc4ec436fb0f51,"[0, 0, 0, 0, 1, 0, 0, 0, 1, 0, 0, 0, 0, 0, 0, 0, 0, 1, 0, 0, 0, 0, 1, 0, 0, 0, 0, 0, 0, 1, 0, 0]"
fontana_trevi7.jpg,7e9b6318c6382dd95606b09c6f305941cdef66b72cd4d733026ecfa797939e6d,"[0, 1, 0, 0, 0, 0, 0, 1, 0, 0, 0, 0, 0, 1, 0, 0, 0, 0, 0, 1, 0, 0, 0, 1, 1, 1, 0, 0, 1, 0, 0, 0]"
fontana_trevi9.jpg,fabcfe3863f83e8e1a1d7322ce287c3b1ac4d7346c034852c56e16d4faa31276,"[0, 0, 1, 0, 0, 0, 0, 0, 0, 0, 0, 0, 0, 0, 1, 0, 0, 0, 1, 0, 1, 0, 1, 0, 1, 0, 0, 1, 0, 0, 0, 0]"
fontana_trevi10.jpg,c0b887ef5f319ef502c91e93b07ca4004b92b9f1f6daf5ca99a37bee329990f1,"[1, 0, 0, 0, 0, 0, 0, 0, 0, 0, 1, 0, 0, 0, 1, 1, 0, 1, 0, 1, 0, 1, 0, 0, 0, 0, 0, 0, 0, 0, 0, 0]"
fontana_trevi1.jpg,e20003a95fc868de3b37f009b931e0be803864b583d93baa43a44639bb4bbf6c,"[0, 0, 0, 0, 0, 0, 0, 0, 0, 1, 1, 0, 1, 0, 0, 0, 0, 0, 0, 0, 0, 1, 0, 0, 0, 1, 0, 0, 0, 0, 1, 0]"
fontana_trevi4.jpg,a460a9d6bb1ca6a58757070e63c30257feb29d2f6f3c359896b0282b733057c3,"[0, 0, 0, 1, 0, 1, 0, 0, 0, 0, 0, 1, 0, 0, 1, 1, 0, 0, 0, 0, 0, 0, 1, 1, 1, 0, 0, 0, 0, 0, 0, 0]"
fontana_trevi14.jpg,b18e903cd5c0fb42062c9374c6af608681265c61e5239735a3b50c37efffb1d4,"[0, 1, 1, 0, 0, 0, 1, 0, 0, 0, 0, 0, 0, 0, 0, 0, 0, 0, 0, 0, 1, 1, 0, 1, 0, 0, 0, 0, 1, 0, 0, 0]"
fontana_trevi12.jpg,49820d48c66c572195e0b4e6990c079236cd48b0188e400bcfd1f4eb7fcf7ec6,"[0, 1, 0, 0, 0, 0, 1, 0, 1, 0, 0, 1, 0, 0, 0, 0, 1, 0, 1, 0, 0, 0, 0, 0, 0, 0, 0, 0, 0, 0, 0, 0]"
