,san_petronio1.jpg,san_petronio6.jpg,san_petronio5.jpg,san_petronio0.jpg,san_petronio8.jpg,san_petronio11.jpg,san_petronio13.jpg,san_petronio12.jpg,san_petronio3.jpg,san_petronio9.jpg,san_petronio2.jpg,san_petronio7.jpg,san_petronio4.jpg,san_petronio10.jpg,san_petronio14.jpg
Type,SHA256,SHA256,SHA256,SHA256,SHA256,SHA256,SHA256,SHA256,SHA256,SHA256,SHA256,SHA256,SHA256,SHA256,SHA256
san_petronio1.jpg,0,58,60,60,60,60,61,58,59,63,59,61,61,60,58
san_petronio6.jpg,58,0,59,58,54,58,61,58,61,59,57,59,60,61,60
san_petronio5.jpg,60,59,0,60,58,60,58,61,59,58,55,62,61,59,63
san_petronio0.jpg,60,58,60,0,58,59,60,60,61,60,62,60,60,60,60
san_petronio8.jpg,60,54,58,58,0,61,58,61,62,56,60,56,61,63,59
san_petronio11.jpg,60,58,60,59,61,0,58,60,57,59,63,62,60,60,62
san_petronio13.jpg,61,61,58,60,58,58,0,61,61,60,63,59,59,60,60
san_petronio12.jpg,58,58,61,60,61,60,61,0,61,59,59,61,58,57,62
san_petronio3.jpg,59,61,59,61,62,57,61,61,0,60,62,60,58,61,60
san_petronio9.jpg,63,59,58,60,56,59,60,59,60,0,61,57,59,63,58
san_petronio2.jpg,59,57,55,62,60,63,63,59,62,61,0,61,58,60,61
san_petronio7.jpg,61,59,62,60,56,62,59,61,60,57,61,0,61,58,62
san_petronio4.jpg,61,60,61,60,61,60,59,58,58,59,58,61,0,58,61
san_petronio10.jpg,60,61,59,60,63,60,60,57,61,63,60,58,58,0,59
san_petronio14.jpg,58,60,63,60,59,62,60,62,60,58,61,62,61,59,0
Type,Final-R,Final-R,Final-R,Final-R,Final-R,Final-R,Final-R,Final-R,Final-R,Final-R,Final-R,Final-R,Final-R,Final-R,Final-R
san_petronio1.jpg,0,16,16,16,16,15,14,16,15,16,16,15,16,14,16
san_petronio6.jpg,16,0,16,14,16,15,16,14,15,14,14,15,16,16,16
san_petronio5.jpg,16,16,0,12,16,15,16,16,15,16,16,15,14,16,16
san_petronio0.jpg,16,14,12,0,14,15,16,14,15,16,16,15,16,16,14
san_petronio8.jpg,16,16,16,14,0,15,14,14,15,16,16,15,16,16,16
san_petronio11.jpg,15,15,15,15,15,0,15,15,14,15,15,14,15,15,15
san_petronio13.jpg,14,16,16,16,14,15,0,16,15,16,14,15,16,16,14
san_petronio12.jpg,16,14,16,14,14,15,16,0,15,14,16,15,16,16,16
san_petronio3.jpg,15,15,15,15,15,14,15,15,0,13,15,14,15,13,15
san_petronio9.jpg,16,14,16,16,16,15,16,14,13,0,16,13,16,16,16
san_petronio2.jpg,16,14,16,16,16,15,14,16,15,16,0,13,16,14,16
san_petronio7.jpg,15,15,15,15,15,14,15,15,14,13,13,0,15,13,15
san_petronio4.jpg,16,16,14,16,16,15,16,16,15,16,16,15,0,16,14
san_petronio10.jpg,14,16,16,16,16,15,16,16,13,16,14,13,16,0,16
san_petronio14.jpg,16,16,16,14,16,15,14,16,15,16,16,15,14,16,0
