,pantheon8.jpg,pantheon4.jpg,pantheon1.jpg,pantheon12.jpg,pantheon0.jpg,pantheon2.jpg,pantheon9.jpg,pantheon14.jpg,pantheon7.jpg,pantheon13.jpg,pantheon10.jpg,pantheon3.jpg,pantheon11.jpg,pantheon6.jpg,pantheon5.jpg
Type,SHA256,SHA256,SHA256,SHA256,SHA256,SHA256,SHA256,SHA256,SHA256,SHA256,SHA256,SHA256,SHA256,SHA256,SHA256
pantheon8.jpg,0,58,57,58,61,57,61,63,60,57,60,61,63,64,59
pantheon4.jpg,58,0,57,63,63,58,59,60,60,59,60,59,63,63,62
pantheon1.jpg,57,57,0,58,64,61,63,60,58,62,57,61,60,63,60
pantheon12.jpg,58,63,58,0,61,64,63,63,60,59,62,60,62,61,59
pantheon0.jpg,61,63,64,61,0,62,62,58,61,62,60,59,62,60,62
pantheon2.jpg,57,58,61,64,62,0,58,60,62,62,59,61,61,62,56
pantheon9.jpg,61,59,63,63,62,58,0,61,59,59,60,58,59,57,63
pantheon14.jpg,63,60,60,63,58,60,61,0,60,61,57,59,59,59,61
pantheon7.jpg,60,60,58,60,61,62,59,60,0,63,59,58,60,62,61
pantheon13.jpg,57,59,62,59,62,62,59,61,63,0,58,62,62,61,60
pantheon10.jpg,60,60,57,62,60,59,60,57,59,58,0,59,62,61,58
pantheon3.jpg,61,59,61,60,59,61,58,59,58,62,59,0,57,62,61
pantheon11.jpg,63,63,60,62,62,61,59,59,60,62,62,57,0,60,58
pantheon6.jpg,64,63,63,61,60,62,57,59,62,61,61,62,60,0,62
pantheon5.jpg,59,62,60,59,62,56,63,61,61,60,58,61,58,62,0
Type,Final-R,Final-R,Final-R,Final-R,Final-R,Final-R,Final-R,Final-R,Final-R,Final-R,Final-R,Final-R,Final-R,Final-R,Final-R
pantheon8.jpg,0,16,16,15,16,16,16,16,16,16,16,16,16,16,16
pantheon4.jpg,16,0,16,15,16,14,16,16,16,16,16,16,16,16,16
pantheon1.jpg,16,16,0,15,16,16,16,16,16,16,16,16,16,16,16
pantheon12.jpg,15,15,15,0,15,15,15,15,15,15,15,15,15,15,15
pantheon0.jpg,16,16,16,15,0,16,16,16,16,16,16,16,16,16,16
pantheon2.jpg,16,14,16,15,16,0,16,16,16,16,16,16,16,16,14
pantheon9.jpg,16,16,16,15,16,16,0,16,16,16,16,16,16,16,16
pantheon14.jpg,16,16,16,15,16,16,16,0,16,14,16,16,16,14,16
pantheon7.jpg,16,16,16,15,16,16,16,16,0,14,16,16,16,16,16
pantheon13.jpg,16,16,16,15,16,16,16,14,14,0,16,16,16,16,16
pantheon10.jpg,16,16,16,15,16,16,16,16,16,16,0,16,16,16,16
pantheon3.jpg,16,16,16,15,16,16,16,16,16,16,16,0,16,14,16
pantheon11.jpg,16,16,16,15,16,16,16,16,16,16,16,16,0,16,16
pantheon6.jpg,16,16,16,15,16,16,16,14,16,16,16,14,16,0,16
pantheon5.jpg,16,16,16,15,16,14,16,16,16,16,16,16,16,16,0
