,torre_pisa3.jpg,torre_pisa0.jpg,torre_pisa4.jpg,torre_pisa14.jpg,torre_pisa1.jpg,torre_pisa6.jpg,torre_pisa12.jpg,torre_pisa13.jpg,torre_pisa9.jpg,torre_pisa5.jpg,torre_pisa7.jpg,torre_pisa2.jpg,torre_pisa10.jpg,torre_pisa11.jpg,torre_pisa8.jpg
Type,SHA256,SHA256,SHA256,SHA256,SHA256,SHA256,SHA256,SHA256,SHA256,SHA256,SHA256,SHA256,SHA256,SHA256,SHA256
torre_pisa3.jpg,0,61,60,61,62,63,59,61,59,61,60,60,58,60,59
torre_pisa0.jpg,61,0,59,58,62,63,62,59,60,59,62,59,59,62,60
torre_pisa4.jpg,60,59,0,63,60,61,63,63,61,58,59,57,59,58,62
torre_pisa14.jpg,61,58,63,0,62,58,61,59,59,62,62,58,62,62,62
torre_pisa1.jpg,62,62,60,62,0,62,62,62,60,61,63,59,59,54,59
torre_pisa6.jpg,63,63,61,58,62,0,62,61,61,63,63,57,58,59,61
torre_pisa12.jpg,59,62,63,61,62,62,0,62,62,62,62,62,58,63,59
torre_pisa13.jpg,61,59,63,59,62,61,62,0,62,61,59,61,61,61,58
torre_pisa9.jpg,59,60,61,59,60,61,62,62,0,62,57,58,59,62,60
torre_pisa5.jpg,61,59,58,62,61,63,62,61,62,0,60,61,57,58,62
torre_pisa7.jpg,60,62,59,62,63,63,62,59,57,60,0,60,59,61,59
torre_pisa2.jpg,60,59,57,58,59,57,62,61,58,61,60,0,60,55,63
torre_pisa10.jpg,58,59,59,62,59,58,58,61,59,57,59,60,0,62,60
torre_pisa11.jpg,60,62,58,62,54,59,63,61,62,58,61,55,62,0,61
torre_pisa8.jpg,59,60,62,62,59,61,59,58,60,62,59,63,60,61,0
Type,Final-R,Final-R,Final-R,Final-R,Final-R,Final-R,Final-R,Final-R,Final-R,Final-R,Final-R,Final-R,Final-R,Final-R,Final-R
torre_pisa3.jpg,0,13,7,7,10,2,8,9,5,6,6,9,6,8,9
torre_pisa0.jpg,13,0,8,10,7,13,7,6,8,9,7,8,7,9,4
torre_pisa4.jpg,7,8,0,4,7,9,9,8,2,11,9,12,9,5,8
torre_pisa14.jpg,7,10,4,0,5,7,7,6,6,13,9,10,7,5,10
torre_pisa1.jpg,10,7,7,5,0,10,8,3,7,10,10,9,10,6,9
torre_pisa6.jpg,2,13,9,7,10,0,8,11,7,6,8,9,6,6,9
torre_pisa12.jpg,8,7,9,7,8,8,0,9,9,12,6,7,4,12,3
torre_pisa13.jpg,9,6,8,6,3,11,9,0,8,9,7,8,9,9,10
torre_pisa9.jpg,5,8,2,6,7,7,9,8,0,9,7,12,9,7,8
torre_pisa5.jpg,6,9,11,13,10,6,12,9,9,0,8,7,10,8,9
torre_pisa7.jpg,6,7,9,9,10,8,6,7,7,8,0,7,8,12,7
torre_pisa2.jpg,9,8,12,10,9,9,7,8,12,7,7,0,9,9,10
torre_pisa10.jpg,6,7,9,7,10,6,4,9,9,10,8,9,0,10,3
torre_pisa11.jpg,8,9,5,5,6,6,12,9,7,8,12,9,10,0,11
torre_pisa8.jpg,9,4,8,10,9,9,3,10,8,9,7,10,3,11,0
