,ponte_vecchio4.jpg,ponte_vecchio8.jpg,ponte_vecchio2.jpg,ponte_vecchio6.jpg,ponte_vecchio0.jpg,ponte_vecchio13.jpg,ponte_vecchio11.jpg,ponte_vecchio14.jpg,ponte_vecchio1.jpg,ponte_vecchio3.jpg,ponte_vecchio7.jpg,ponte_vecchio9.jpg,ponte_vecchio12.jpg,ponte_vecchio10.jpg,ponte_vecchio5.jpg
Type,SHA256,SHA256,SHA256,SHA256,SHA256,SHA256,SHA256,SHA256,SHA256,SHA256,SHA256,SHA256,SHA256,SHA256,SHA256
ponte_vecchio4.jpg,0,56,58,60,58,60,61,63,60,60,59,61,60,61,64
ponte_vecchio8.jpg,56,0,61,62,59,62,61,62,58,62,63,60,61,60,62
ponte_vecchio2.jpg,58,61,0,63,62,62,61,56,59,61,59,59,59,63,59
ponte_vecchio6.jpg,60,62,63,0,61,59,55,61,59,60,61,60,61,62,60
ponte_vecchio0.jpg,58,59,62,61,0,61,60,63,57,57,57,60,60,62,59
ponte_vecchio13.jpg,60,62,62,59,61,0,59,59,61,58,62,61,61,64,61
ponte_vecchio11.jpg,61,61,61,55,60,59,0,58,61,58,61,60,64,58,59
ponte_vecchio14.jpg,63,62,56,61,63,59,58,0,59,56,58,60,59,64,62
ponte_vecchio1.jpg,60,58,59,59,57,61,61,59,0,63,57,59,63,60,62
ponte_vecchio3.jpg,60,62,61,60,57,58,58,56,63,0,61,59,59,57,56
ponte_vecchio7.jpg,59,63,59,61,57,62,61,58,57,61,0,60,61,61,58
ponte_vecchio9.jpg,61,60,59,60,60,61,60,60,59,59,60,0,58,59,60
ponte_vecchio12.jpg,60,61,59,61,60,61,64,59,63,59,61,58,0,61,57
ponte_vecchio10.jpg,61,60,63,62,62,64,58,64,60,57,61,59,61,0,62
ponte_vecchio5.jpg,64,62,59,60,59,61,59,62,62,56,58,60,57,62,0
Type,Final-R,Final-R,Final-R,Final-R,Final-R,Final-R,Final-R,Final-R,Final-R,Final-R,Final-R,Final-R,Final-R,Final-R,Final-R
ponte_vecchio4.jpg,0,16,16,16,14,16,14,16,16,16,16,14,14,16,16
ponte_vecchio8.jpg,16,0,16,16,16,16,16,16,16,16,14,16,16,16,16
ponte_vecchio2.jpg,16,16,0,16,16,16,16,16,16,16,16,16,16,16,16
ponte_vecchio6.jpg,16,16,16,0,16,16,16,16,16,16,16,16,16,16,14
ponte_vecchio0.jpg,14,16,16,16,0,16,16,16,16,14,16,16,16,16,16
ponte_vecchio13.jpg,16,16,16,16,16,0,16,16,16,16,16,16,16,16,16
ponte_vecchio11.jpg,14,16,16,16,16,16,0,16,16,16,16,16,16,16,16
ponte_vecchio14.jpg,16,16,16,16,16,16,16,0,16,16,16,16,12,14,16
ponte_vecchio1.jpg,16,16,16,16,16,16,16,16,0,16,16,16,16,16,16
ponte_vecchio3.jpg,16,16,16,16,14,16,16,16,16,0,16,16,16,16,16
ponte_vecchio7.jpg,16,14,16,16,16,16,16,16,16,16,0,16,16,14,16
ponte_vecchio9.jpg,14,16,16,16,16,16,16,16,16,16,16,0,14,16,16
ponte_vecchio12.jpg,14,16,16,16,16,16,16,12,16,16,16,14,0,14,16
ponte_vecchio10.jpg,16,16,16,16,16,16,16,14,16,16,14,16,14,0,16
ponte_vecchio5.jpg,16,16,16,14,16,16,16,16,16,16,16,16,16,16,0
