Img-Name,SHA256,Final-R
torre_pisa3.jpg,dad15f32da74ac38d3e6bb6235975da2a9ea6492a0eb97e13ac4bd8e9b800a8d,"[0, 1, 1, 0, 0, 0, 0, 0, 0, 0, 0, 0, 0, 1, 1, 0, 0, 0, 1, 0, 0, 0, 0, 0, 1, 0, 0, 0, 0, 0, 0, 0]"
torre_pisa0.jpg,ed8abaef1c82977748c1b8ba79a3b00ca56c3df68a8ccf1498c36720d9cbdb3b,"[1, 0, 0, 0, 0, 0, 0, 0, 0, 0, 0, 0, 1, 0, 0, 1, 0, 0, 0, 0, 1, 0, 1, 1, 0, 0, 1, 1, 0, 0, 0, 0]"
torre_pisa4.jpg,c0a8f55ff040788e58f6182daf0fed1503fb6ae6be7fc9754124d9672c714327,"[0, 0, 0, 0, 0, 0, 1, 1, 0, 0, 0, 0, 0, 1, 1, 0, 0, 0, 0, 0, 0, 1, 0, 0, 0, 0, 0, 0, 0, 0, 0, 1]"
torre_pisa14.jpg,ee124a96cabeb5692e01e704bcdc103e5e7134890805e045d81e727db806f09d,"[0, 0, 0, 0, 1, 1, 0, 0, 0, 1, 0, 0, 0, 0, 0, 0, 0, 0, 0, 0, 0, 0, 1, 0, 0, 0, 0, 0, 0, 1, 1, 0]"
torre_pisa1.jpg,7c4e1ee4a9123e8104da74ccc088853620356085d593790f51d2b84586a8e5e9,"[0, 1, 0, 0, 1, 1, 0, 0, 0, 1, 0, 0, 1, 0, 0, 1, 0, 0, 0, 0, 0, 0, 1, 0, 0, 0, 0, 0, 0, 0, 0, 0]"
torre_pisa6.jpg,fe65207df5b5e452cb055bf8fd41a2c9f4a1d86e4551537da94596da0802d521,"[0, 1, 0, 0, 0, 0, 0, 0, 0, 1, 0, 0, 0, 0, 1, 0, 0, 0, 1, 0, 0, 0, 0, 0, 1, 0, 1, 0, 0, 1, 0, 0]"
torre_pisa12.jpg,bd3124b7ece6039ea55720540cc99feb214a831209bef79cbb55089931e0b75c,"[0, 0, 0, 0, 0, 0, 0, 0, 0, 0, 0, 1, 0, 0, 0, 0, 0, 0, 1, 0, 1, 0, 0, 1, 0, 1, 0, 0, 1, 0, 1, 0]"
torre_pisa13.jpg,08c4331437515800600ef7d6d43c93d44e2231fc77cb0f21557306f67f829bd5,"[1, 1, 0, 0, 0, 0, 0, 0, 0, 0, 0, 0, 0, 0, 0, 0, 0, 0, 0, 0, 1, 1, 1, 0, 0, 0, 0, 0, 1, 0, 0, 0]"
torre_pisa9.jpg,318289fda6780e418e7f224ee20053bffa2ba0073d0c1a6dc2186d5790fba086,"[0, 1, 0, 0, 0, 0, 1, 1, 0, 0, 0, 0, 0, 1, 1, 0, 0, 0, 0, 0, 0, 0, 0, 1, 0, 0, 0, 0, 0, 1, 0, 1]"
torre_pisa5.jpg,66d7e31f666757d1b9c2d0b2652b1720c5f4575ac95f29800f0bdf18bcae5eb3,"[1, 0, 0, 0, 0, 0, 0, 0, 0, 0, 0, 0, 0, 0, 0, 0, 0, 1, 1, 1, 0, 0, 0, 0, 1, 0, 1, 0, 0, 0, 0, 1]"
torre_pisa7.jpg,47568511133b796865aab2d09a054b40ca281444cdb245fbc4fc4e0ef5424467,"[1, 0, 0, 0, 1, 0, 0, 1, 1, 0, 0, 0, 0, 0, 1, 0, 1, 1, 0, 0, 0, 0, 0, 0, 0, 0, 0, 1, 0, 0, 0, 0]"
torre_pisa2.jpg,4425650c4a0218598e602e2bf8af5e18bb069083e9eb4583d11297d07a37d923,"[0, 0, 0, 1, 0, 0, 0, 0, 0, 0, 0, 1, 1, 0, 0, 0, 1, 0, 0, 0, 0, 0, 0, 0, 1, 1, 0, 0, 0, 0, 0, 0]"
torre_pisa10.jpg,bf0de34a5fd2b27e78455bc260a09dcbc8f70d0dbd9b25bcea66454a18f0a474,"[0, 0, 1, 0, 0, 0, 0, 0, 0, 0, 1, 1, 0, 1, 0, 0, 0, 0, 0, 0, 1, 0, 0, 0, 0, 0, 0, 0, 1, 0, 1, 0]"
torre_pisa11.jpg,bc53cccd42323f8951996a15ad6417aab4e5b19697c67d8f01029c689e39356a,"[0, 0, 0, 0, 0, 0, 0, 0, 1, 1, 1, 0, 0, 1, 0, 1, 0, 0, 0, 0, 0, 1, 1, 0, 0, 0, 0, 0, 0, 0, 0, 0]"
torre_pisa8.jpg,01fb1b47ab75fa9fd907695c8af86d6b057619c4f723bfa2cab1e62e6225cb0a,"[0, 0, 1, 0, 1, 0, 0, 1, 0, 0, 1, 1, 0, 0, 1, 0, 0, 0, 0, 0, 0, 0, 0, 0, 0, 0, 0, 0, 1, 0, 0, 1]"
