,cinque_terre4.jpg,cinque_terre13.jpg,cinque_terre11.jpg,cinque_terre2.jpg,cinque_terre5.jpg,cinque_terre7.jpg,cinque_terre12.jpg,cinque_terre10.jpg,cinque_terre6.jpg,cinque_terre14.jpg,cinque_terre3.jpg,cinque_terre0.jpg,cinque_terre1.jpg,cinque_terre8.jpg,cinque_terre9.jpg
Type,Meta,Meta,Meta,Meta,Meta,Meta,Meta,Meta,Meta,Meta,Meta,Meta,Meta,Meta,Meta
cinque_terre4.jpg,0,6,4,6,4,5,6,6,5,6,4,4,4,5,3
cinque_terre13.jpg,6,0,5,6,7,6,6,3,7,4,6,5,5,6,7
cinque_terre11.jpg,4,5,0,3,3,6,3,4,6,4,4,4,2,5,3
cinque_terre2.jpg,6,6,3,0,3,6,2,5,7,5,5,5,3,5,3
cinque_terre5.jpg,4,7,3,3,0,4,2,5,7,4,5,6,4,4,1
cinque_terre7.jpg,5,6,6,6,4,0,5,4,6,4,6,4,6,3,5
cinque_terre12.jpg,6,6,3,2,2,5,0,4,7,4,5,5,3,5,3
cinque_terre10.jpg,6,3,4,5,5,4,4,0,7,3,5,4,4,5,6
cinque_terre6.jpg,5,7,6,7,7,6,7,7,0,7,7,5,6,6,7
cinque_terre14.jpg,6,4,4,5,4,4,4,3,7,0,5,5,4,4,5
cinque_terre3.jpg,4,6,4,5,5,6,5,5,7,5,0,4,3,5,4
cinque_terre0.jpg,4,5,4,5,6,4,5,4,5,5,4,0,3,4,5
cinque_terre1.jpg,4,5,2,3,4,6,3,4,6,4,3,3,0,4,3
cinque_terre8.jpg,5,6,5,5,4,3,5,5,6,4,5,4,4,0,3
cinque_terre9.jpg,3,7,3,3,1,5,3,6,7,5,4,5,3,3,0
Type,R-Meta,R-Meta,R-Meta,R-Meta,R-Meta,R-Meta,R-Meta,R-Meta,R-Meta,R-Meta,R-Meta,R-Meta,R-Meta,R-Meta,R-Meta
cinque_terre4.jpg,0,6,4,8,6,6,8,6,4,6,6,4,6,8,6
cinque_terre13.jpg,6,0,6,8,8,8,8,6,8,6,6,6,6,8,8
cinque_terre11.jpg,4,6,0,4,2,6,4,4,8,4,4,4,2,6,2
cinque_terre2.jpg,8,8,4,0,4,6,4,6,8,6,6,6,4,6,2
cinque_terre5.jpg,6,8,2,4,0,6,2,4,8,4,6,6,4,6,2
cinque_terre7.jpg,6,8,6,6,6,0,6,6,6,6,6,4,6,4,6
cinque_terre12.jpg,8,8,4,4,2,6,0,6,8,6,6,6,4,6,4
cinque_terre10.jpg,6,6,4,6,4,6,6,0,8,4,6,6,6,6,4
cinque_terre6.jpg,4,8,8,8,8,6,8,8,0,8,8,6,6,6,8
cinque_terre14.jpg,6,6,4,6,4,6,6,4,8,0,6,6,6,4,4
cinque_terre3.jpg,6,6,4,6,6,6,6,6,8,6,0,4,4,6,6
cinque_terre0.jpg,4,6,4,6,6,4,6,6,6,6,4,0,4,6,6
cinque_terre1.jpg,6,6,2,4,4,6,4,6,6,6,4,4,0,4,4
cinque_terre8.jpg,8,8,6,6,6,4,6,6,6,4,6,6,4,0,6
cinque_terre9.jpg,6,8,2,2,2,6,4,4,8,4,6,6,4,6,0
Type,Content,Content,Content,Content,Content,Content,Content,Content,Content,Content,Content,Content,Content,Content,Content
cinque_terre4.jpg,0,13,13,12,11,12,13,12,13,12,10,11,12,13,12
cinque_terre13.jpg,13,0,12,12,13,13,13,12,12,13,13,12,13,13,12
cinque_terre11.jpg,13,12,0,12,13,12,13,13,12,13,12,13,13,13,13
cinque_terre2.jpg,12,12,12,0,12,11,13,12,13,11,12,11,13,13,12
cinque_terre5.jpg,11,13,13,12,0,13,13,13,13,12,13,13,13,13,12
cinque_terre7.jpg,12,13,12,11,13,0,13,10,13,13,10,13,13,13,13
cinque_terre12.jpg,13,13,13,13,13,13,0,13,11,12,13,12,12,13,12
cinque_terre10.jpg,12,12,13,12,13,10,13,0,13,12,10,12,13,13,13
cinque_terre6.jpg,13,12,12,13,13,13,11,13,0,13,13,12,12,12,13
cinque_terre14.jpg,12,13,13,11,12,13,12,12,13,0,13,13,13,12,12
cinque_terre3.jpg,10,13,12,12,13,10,13,10,13,13,0,13,12,12,13
cinque_terre0.jpg,11,12,13,11,13,13,12,12,12,13,13,0,13,12,13
cinque_terre1.jpg,12,13,13,13,13,13,12,13,12,13,12,13,0,12,13
cinque_terre8.jpg,13,13,13,13,13,13,13,13,12,12,12,12,12,0,12
cinque_terre9.jpg,12,12,13,12,12,13,12,13,13,12,13,13,13,12,0
Type,R-Content,R-Content,R-Content,R-Content,R-Content,R-Content,R-Content,R-Content,R-Content,R-Content,R-Content,R-Content,R-Content,R-Content,R-Content
cinque_terre4.jpg,0,13,13,11,11,13,9,11,11,11,12,11,13,13,8
cinque_terre13.jpg,13,0,14,14,14,14,12,12,8,14,13,12,14,14,7
cinque_terre11.jpg,13,14,0,14,14,12,14,14,14,14,11,14,12,14,13
cinque_terre2.jpg,11,14,14,0,12,14,14,14,14,12,13,12,14,14,11
cinque_terre5.jpg,11,14,14,12,0,12,14,12,14,12,11,12,12,14,11
cinque_terre7.jpg,13,14,12,14,12,0,14,12,14,14,7,14,12,12,13
cinque_terre12.jpg,9,12,14,14,14,14,0,8,10,12,13,12,14,14,11
cinque_terre10.jpg,11,12,14,14,12,12,8,0,12,14,11,12,14,14,11
cinque_terre6.jpg,11,8,14,14,14,14,10,12,0,14,13,14,14,14,13
cinque_terre14.jpg,11,14,14,12,12,14,12,14,14,0,13,14,12,14,11
cinque_terre3.jpg,12,13,11,13,11,7,13,11,13,13,0,13,11,13,12
cinque_terre0.jpg,11,12,14,12,12,14,12,12,14,14,13,0,12,12,9
cinque_terre1.jpg,13,14,12,14,12,12,14,14,14,12,11,12,0,14,13
cinque_terre8.jpg,13,14,14,14,14,12,14,14,14,14,13,12,14,0,13
cinque_terre9.jpg,8,7,13,11,11,13,11,11,13,11,12,9,13,13,0
Type,Final-R,Final-R,Final-R,Final-R,Final-R,Final-R,Final-R,Final-R,Final-R,Final-R,Final-R,Final-R,Final-R,Final-R,Final-R
cinque_terre4.jpg,0,19,17,18,17,19,17,16,15,14,18,14,19,20,13
cinque_terre13.jpg,19,0,18,19,20,18,16,17,16,17,17,17,18,15,14
cinque_terre11.jpg,17,18,0,17,16,18,18,17,22,17,15,17,14,19,14
cinque_terre2.jpg,18,19,17,0,15,19,15,18,21,14,18,16,17,18,11
cinque_terre5.jpg,17,20,16,15,0,18,16,15,22,15,17,15,16,17,12
cinque_terre7.jpg,19,18,18,19,18,0,20,17,20,17,13,17,18,13,18
cinque_terre12.jpg,17,16,18,15,16,20,0,11,18,17,19,15,18,17,12
cinque_terre10.jpg,16,17,17,18,15,17,11,0,19,16,16,18,19,18,15
cinque_terre6.jpg,15,16,22,21,22,20,18,19,0,19,19,19,20,19,20
cinque_terre14.jpg,14,17,17,14,15,17,17,16,19,0,18,18,17,16,11
cinque_terre3.jpg,18,17,15,18,17,13,19,16,19,18,0,16,15,18,17
cinque_terre0.jpg,14,17,17,16,15,17,15,18,19,18,16,0,15,16,15
cinque_terre1.jpg,19,18,14,17,16,18,18,19,20,17,15,15,0,17,16
cinque_terre8.jpg,20,15,19,18,17,13,17,18,19,16,18,16,17,0,17
cinque_terre9.jpg,13,14,14,11,12,18,12,15,20,11,17,15,16,17,0
