,il_bacio8.jpg,il_bacio0.jpg,il_bacio9.jpg,il_bacio12.jpg,il_bacio5.jpg,il_bacio13.jpg,il_bacio4.jpg,il_bacio6.jpg,il_bacio3.jpg,il_bacio1.jpg,il_bacio11.jpg,il_bacio10.jpg,il_bacio2.jpg,il_bacio14.jpg,il_bacio7.jpg
Type,SHA256,SHA256,SHA256,SHA256,SHA256,SHA256,SHA256,SHA256,SHA256,SHA256,SHA256,SHA256,SHA256,SHA256,SHA256
il_bacio8.jpg,0,60,59,58,61,62,60,60,60,61,61,58,56,56,59
il_bacio0.jpg,60,0,57,61,62,61,60,59,58,61,61,58,62,63,63
il_bacio9.jpg,59,57,0,62,61,58,59,59,60,60,55,59,63,61,58
il_bacio12.jpg,58,61,62,0,58,61,60,60,60,60,62,62,61,59,60
il_bacio5.jpg,61,62,61,58,0,62,61,59,60,61,58,60,60,61,60
il_bacio13.jpg,62,61,58,61,62,0,59,60,61,62,62,62,57,58,58
il_bacio4.jpg,60,60,59,60,61,59,0,60,62,60,61,62,62,62,60
il_bacio6.jpg,60,59,59,60,59,60,60,0,62,63,57,59,60,58,58
il_bacio3.jpg,60,58,60,60,60,61,62,62,0,60,62,62,58,59,60
il_bacio1.jpg,61,61,60,60,61,62,60,63,60,0,63,61,59,56,60
il_bacio11.jpg,61,61,55,62,58,62,61,57,62,63,0,61,61,62,61
il_bacio10.jpg,58,58,59,62,60,62,62,59,62,61,61,0,62,62,62
il_bacio2.jpg,56,62,63,61,60,57,62,60,58,59,61,62,0,62,62
il_bacio14.jpg,56,63,61,59,61,58,62,58,59,56,62,62,62,0,61
il_bacio7.jpg,59,63,58,60,60,58,60,58,60,60,61,62,62,61,0
Type,Final-R,Final-R,Final-R,Final-R,Final-R,Final-R,Final-R,Final-R,Final-R,Final-R,Final-R,Final-R,Final-R,Final-R,Final-R
il_bacio8.jpg,0,6,6,1,4,4,2,4,2,4,1,4,1,4,4
il_bacio0.jpg,6,0,4,5,4,4,6,4,4,4,5,4,7,6,6
il_bacio9.jpg,6,4,0,5,4,2,4,2,6,4,5,2,5,2,2
il_bacio12.jpg,1,5,5,0,5,3,3,3,3,3,0,3,2,5,5
il_bacio5.jpg,4,4,4,5,0,2,4,4,4,4,5,4,3,4,2
il_bacio13.jpg,4,4,2,3,2,0,4,2,4,4,3,2,3,4,2
il_bacio4.jpg,2,6,4,3,4,4,0,2,2,6,3,4,3,2,2
il_bacio6.jpg,4,4,2,3,4,2,2,0,4,6,3,4,5,4,2
il_bacio3.jpg,2,4,6,3,4,4,2,4,0,6,3,4,3,4,4
il_bacio1.jpg,4,4,4,3,4,4,6,6,6,0,3,2,3,4,6
il_bacio11.jpg,1,5,5,0,5,3,3,3,3,3,0,3,2,5,5
il_bacio10.jpg,4,4,2,3,4,2,4,4,4,2,3,0,3,2,4
il_bacio2.jpg,1,7,5,2,3,3,3,5,3,3,2,3,0,3,3
il_bacio14.jpg,4,6,2,5,4,4,2,4,4,4,5,2,3,0,2
il_bacio7.jpg,4,6,2,5,2,2,2,2,4,6,5,4,3,2,0
