,arco_trionfo1.jpg,arco_trionfo12.jpg,arco_trionfo9.jpg,arco_trionfo8.jpg,arco_trionfo11.jpg,arco_trionfo3.jpg,arco_trionfo6.jpg,arco_trionfo13.jpg,arco_trionfo4.jpg,arco_trionfo10.jpg,arco_trionfo5.jpg,arco_trionfo2.jpg,arco_trionfo7.jpg,arco_trionfo14.jpg,arco_trionfo0.jpg
Type,Meta,Meta,Meta,Meta,Meta,Meta,Meta,Meta,Meta,Meta,Meta,Meta,Meta,Meta,Meta
arco_trionfo1.jpg,0,4,5,5,4,5,7,5,4,3,5,7,5,5,6
arco_trionfo12.jpg,4,0,5,4,5,4,6,6,4,3,5,7,6,5,7
arco_trionfo9.jpg,5,5,0,6,4,6,5,6,4,4,5,6,6,5,5
arco_trionfo8.jpg,5,4,6,0,5,3,4,6,4,4,4,6,5,5,6
arco_trionfo11.jpg,4,5,4,5,0,5,5,5,4,4,4,7,5,4,6
arco_trionfo3.jpg,5,4,6,3,5,0,5,5,4,4,4,7,6,5,5
arco_trionfo6.jpg,7,6,5,4,5,5,0,6,5,6,4,6,6,5,5
arco_trionfo13.jpg,5,6,6,6,5,5,6,0,6,6,6,7,6,6,7
arco_trionfo4.jpg,4,4,4,4,4,4,5,6,0,3,3,6,5,3,5
arco_trionfo10.jpg,3,3,4,4,4,4,6,6,3,0,4,7,4,4,6
arco_trionfo5.jpg,5,5,5,4,4,4,4,6,3,4,0,5,4,3,4
arco_trionfo2.jpg,7,7,6,6,7,7,6,7,6,7,5,0,7,5,4
arco_trionfo7.jpg,5,6,6,5,5,6,6,6,5,4,4,7,0,5,6
arco_trionfo14.jpg,5,5,5,5,4,5,5,6,3,4,3,5,5,0,4
arco_trionfo0.jpg,6,7,5,6,6,5,5,7,5,6,4,4,6,4,0
Type,R-Meta,R-Meta,R-Meta,R-Meta,R-Meta,R-Meta,R-Meta,R-Meta,R-Meta,R-Meta,R-Meta,R-Meta,R-Meta,R-Meta,R-Meta
arco_trionfo1.jpg,0,0,4,0,2,0,4,2,0,0,2,3,2,2,3
arco_trionfo12.jpg,0,0,4,0,2,0,4,2,0,0,2,3,2,2,3
arco_trionfo9.jpg,4,4,0,4,2,4,2,2,4,4,4,1,4,2,1
arco_trionfo8.jpg,0,0,4,0,2,0,4,2,0,0,2,3,2,2,3
arco_trionfo11.jpg,2,2,2,2,0,2,2,0,2,2,2,3,2,2,3
arco_trionfo3.jpg,0,0,4,0,2,0,4,2,0,0,2,3,2,2,3
arco_trionfo6.jpg,4,4,2,4,2,4,0,2,4,4,4,3,4,4,3
arco_trionfo13.jpg,2,2,2,2,0,2,2,0,2,2,2,3,2,2,3
arco_trionfo4.jpg,0,0,4,0,2,0,4,2,0,0,2,3,2,2,3
arco_trionfo10.jpg,0,0,4,0,2,0,4,2,0,0,2,3,2,2,3
arco_trionfo5.jpg,2,2,4,2,2,2,4,2,2,2,0,3,0,2,3
arco_trionfo2.jpg,3,3,1,3,3,3,3,3,3,3,3,0,3,1,0
arco_trionfo7.jpg,2,2,4,2,2,2,4,2,2,2,0,3,0,2,3
arco_trionfo14.jpg,2,2,2,2,2,2,4,2,2,2,2,1,2,0,1
arco_trionfo0.jpg,3,3,1,3,3,3,3,3,3,3,3,0,3,1,0
Type,Content,Content,Content,Content,Content,Content,Content,Content,Content,Content,Content,Content,Content,Content,Content
arco_trionfo1.jpg,0,13,13,13,13,13,12,13,13,13,13,12,12,13,13
arco_trionfo12.jpg,13,0,13,12,13,13,13,13,13,13,13,11,12,13,13
arco_trionfo9.jpg,13,13,0,12,13,13,11,13,12,13,11,10,13,13,12
arco_trionfo8.jpg,13,12,12,0,13,13,13,13,12,12,13,12,12,13,9
arco_trionfo11.jpg,13,13,13,13,0,13,12,10,13,13,13,12,12,12,12
arco_trionfo3.jpg,13,13,13,13,13,0,12,13,12,12,13,13,12,12,12
arco_trionfo6.jpg,12,13,11,13,12,12,0,11,13,12,12,12,11,13,13
arco_trionfo13.jpg,13,13,13,13,10,13,11,0,13,13,13,12,12,12,13
arco_trionfo4.jpg,13,13,12,12,13,12,13,13,0,11,13,13,13,13,12
arco_trionfo10.jpg,13,13,13,12,13,12,12,13,11,0,13,13,13,13,13
arco_trionfo5.jpg,13,13,11,13,13,13,12,13,13,13,0,11,13,13,13
arco_trionfo2.jpg,12,11,10,12,12,13,12,12,13,13,11,0,12,13,12
arco_trionfo7.jpg,12,12,13,12,12,12,11,12,13,13,13,12,0,13,13
arco_trionfo14.jpg,13,13,13,13,12,12,13,12,13,13,13,13,13,0,11
arco_trionfo0.jpg,13,13,12,9,12,12,13,13,12,13,13,12,13,11,0
Type,R-Content,R-Content,R-Content,R-Content,R-Content,R-Content,R-Content,R-Content,R-Content,R-Content,R-Content,R-Content,R-Content,R-Content,R-Content
arco_trionfo1.jpg,0,5,8,4,8,8,8,8,8,6,7,8,7,8,7
arco_trionfo12.jpg,5,0,7,5,5,7,7,7,7,7,6,5,6,7,6
arco_trionfo9.jpg,8,7,0,8,8,6,4,8,6,8,3,6,7,8,7
arco_trionfo8.jpg,4,5,8,0,6,8,8,8,6,6,7,6,7,6,5
arco_trionfo11.jpg,8,5,8,6,0,8,6,4,6,8,7,4,5,6,5
arco_trionfo3.jpg,8,7,6,8,8,0,6,8,6,6,5,8,7,8,7
arco_trionfo6.jpg,8,7,4,8,6,6,0,4,6,8,3,6,5,8,7
arco_trionfo13.jpg,8,7,8,8,4,8,4,0,6,8,7,6,5,8,7
arco_trionfo4.jpg,8,7,6,6,6,6,6,6,0,8,5,2,7,6,5
arco_trionfo10.jpg,6,7,8,6,8,6,8,8,8,0,7,8,7,8,7
arco_trionfo5.jpg,7,6,3,7,7,5,3,7,5,7,0,5,6,7,6
arco_trionfo2.jpg,8,5,6,6,4,8,6,6,2,8,5,0,7,6,5
arco_trionfo7.jpg,7,6,7,7,5,7,5,5,7,7,6,7,0,5,4
arco_trionfo14.jpg,8,7,8,6,6,8,8,8,6,8,7,6,5,0,3
arco_trionfo0.jpg,7,6,7,5,5,7,7,7,5,7,6,5,4,3,0
Type,Final-R,Final-R,Final-R,Final-R,Final-R,Final-R,Final-R,Final-R,Final-R,Final-R,Final-R,Final-R,Final-R,Final-R,Final-R
arco_trionfo1.jpg,0,5,9,4,7,6,9,7,7,5,8,10,8,9,9
arco_trionfo12.jpg,5,0,10,5,6,5,8,8,6,6,7,7,7,8,8
arco_trionfo9.jpg,9,10,0,11,10,9,4,8,10,10,7,7,11,10,8
arco_trionfo8.jpg,4,5,11,0,7,6,11,9,5,5,8,8,8,7,7
arco_trionfo11.jpg,7,6,10,7,0,9,8,4,8,8,9,7,7,8,8
arco_trionfo3.jpg,6,5,9,6,9,0,9,9,5,5,6,10,8,9,9
arco_trionfo6.jpg,9,8,4,11,8,9,0,6,10,10,7,7,9,10,8
arco_trionfo13.jpg,7,8,8,9,4,9,6,0,8,8,7,7,5,8,8
arco_trionfo4.jpg,7,6,10,5,8,5,10,8,0,8,5,5,7,8,8
arco_trionfo10.jpg,5,6,10,5,8,5,10,8,8,0,9,11,9,10,10
arco_trionfo5.jpg,8,7,7,8,9,6,7,7,5,9,0,6,6,9,9
arco_trionfo2.jpg,10,7,7,8,7,10,7,7,5,11,6,0,8,7,5
arco_trionfo7.jpg,8,7,11,8,7,8,9,5,7,9,6,8,0,7,7
arco_trionfo14.jpg,9,8,10,7,8,9,10,8,8,10,9,7,7,0,4
arco_trionfo0.jpg,9,8,8,7,8,9,8,8,8,10,9,5,7,4,0
