Img-Name,Meta,R-Meta,Content,R-Content,Final-R
statua_libertà14.jpg,AAA7C7A6CQJRFDLT,"[0, 1, 1, 0, 1, 0, 1, 1]",EEA6YERTSZU42MVW,"[0, 0, 1, 0, 1, 1, 1, 1]","[0, 1, 1, 0, 1, 0, 1, 1]"
statua_libertà13.jpg,AAA5H5R6CQJRFDLT,"[0, 1, 1, 0, 1, 1, 1, 0]",EEA2NIQZ3URZ36KC,"[0, 1, 1, 1, 0, 1, 1, 0]","[0, 1, 1, 0, 1, 1, 1, 0]"
statua_libertà7.jpg,AAA7CXZ2AQJRFDLT,"[1, 1, 1, 0, 1, 0, 0, 1]",EEAZYZYYNUZ4SRXD,"[0, 1, 1, 0, 1, 1, 0, 0]","[1, 1, 1, 0, 1, 0, 0, 1]"
statua_libertà2.jpg,AAA7G7Z3CQJRFDLT,"[0, 1, 1, 1, 1, 0, 0, 1]",EEA62FSTEXLCTTMK,"[1, 0, 0, 1, 1, 1, 1, 0]","[0, 1, 1, 1, 1, 0, 0, 1]"
statua_libertà10.jpg,AAA7C7RKCQJRFDLT,"[0, 1, 1, 1, 1, 0, 0, 1]",EEA3SRZUYMMMWZW2,"[0, 0, 1, 1, 0, 1, 0, 0]","[0, 1, 1, 1, 1, 0, 0, 1]"
statua_libertà0.jpg,AAA7C5Z2CQJRFDLT,"[0, 1, 1, 0, 1, 1, 0, 1]",EEAZFG3ZQYG4ZM3J,"[0, 1, 1, 0, 1, 1, 0, 1]","[0, 1, 1, 0, 1, 1, 0, 1]"
statua_libertà5.jpg,AAA7C7Z6CQJRFDLT,"[0, 1, 1, 0, 1, 0, 1, 1]",EEA4JEKT52KVW2UU,"[0, 0, 1, 0, 1, 1, 1, 0]","[0, 1, 1, 0, 1, 0, 1, 1]"
statua_libertà6.jpg,AAA7C7I6DQJRFDLT,"[0, 1, 1, 0, 1, 0, 1, 1]",EEA3GWLECKMWM5WO,"[0, 0, 0, 1, 0, 1, 0, 1]","[0, 1, 1, 0, 1, 0, 1, 1]"
statua_libertà11.jpg,AAA7H5IKCQJRFDLT,"[0, 1, 1, 1, 1, 1, 0, 1]",EEAZYZYTZFXJM2JU,"[0, 0, 1, 0, 1, 1, 1, 0]","[0, 1, 1, 1, 1, 1, 0, 1]"
statua_libertà8.jpg,AAA7C7J2AQJRFDLT,"[0, 1, 1, 0, 1, 0, 0, 1]",EEA6GGBQNBNDP3HH,"[1, 1, 1, 1, 1, 1, 1, 1]","[0, 1, 1, 0, 1, 0, 0, 1]"
statua_libertà9.jpg,AAA5D7Z6CQJRFDLT,"[0, 1, 1, 0, 1, 1, 1, 1]",EEA3HTKYQHGHJJWO,"[1, 1, 1, 1, 1, 1, 0, 1]","[0, 1, 1, 0, 1, 1, 1, 1]"
statua_libertà1.jpg,AAA7HXIKCQJRFDLT,"[1, 1, 1, 1, 1, 0, 0, 1]",EEAYHDYNDJRET37D,"[0, 1, 1, 1, 1, 1, 1, 0]","[1, 1, 1, 1, 1, 0, 0, 1]"
statua_libertà12.jpg,AAA5KXAKCQJRFDLT,"[1, 1, 1, 1, 1, 1, 0, 0]",EEA5MK3FZQJK2MVN,"[0, 1, 0, 1, 0, 1, 1, 0]","[1, 1, 1, 1, 1, 1, 0, 0]"
statua_libertà4.jpg,AAA7L7B6DQJRFDLT,"[0, 1, 1, 0, 1, 0, 1, 1]",EEAZY2EGOON4Y3DG,"[0, 0, 1, 1, 1, 1, 0, 1]","[0, 1, 1, 0, 1, 0, 1, 1]"
statua_libertà3.jpg,AAA7C7Z7KQJRFDLT,"[0, 1, 1, 0, 1, 0, 0, 1]",EEA3RQBH2JC54ZPR,"[1, 1, 1, 1, 0, 1, 0, 0]","[0, 1, 1, 0, 1, 0, 0, 1]"
