,hamburger2.jpg,hamburger0.jpg,hamburger11.jpg,hamburger14.jpg,hamburger1.jpg,hamburger10.jpg,hamburger9.jpg,hamburger8.jpg,hamburger6.jpg,hamburger3.jpg,hamburger5.jpg,hamburger4.jpg,hamburger13.jpg,hamburger7.jpg,hamburger12.jpg
Type,Meta,Meta,Meta,Meta,Meta,Meta,Meta,Meta,Meta,Meta,Meta,Meta,Meta,Meta,Meta
hamburger2.jpg,0,3,2,4,5,5,4,4,5,4,4,3,1,4,5
hamburger0.jpg,3,0,3,4,3,4,4,6,3,4,5,3,3,4,4
hamburger11.jpg,2,3,0,4,5,5,5,5,5,5,5,4,2,5,5
hamburger14.jpg,4,4,4,0,6,4,5,6,5,5,2,3,4,5,3
hamburger1.jpg,5,3,5,6,0,4,4,4,3,4,5,5,5,4,4
hamburger10.jpg,5,4,5,4,4,0,3,5,1,2,4,4,5,3,3
hamburger9.jpg,4,4,5,5,4,3,0,3,3,3,3,2,5,2,4
hamburger8.jpg,4,6,5,6,4,5,3,0,5,5,4,4,5,3,5
hamburger6.jpg,5,3,5,5,3,1,3,5,0,2,4,4,5,3,2
hamburger3.jpg,4,4,5,5,4,2,3,5,2,0,4,4,4,3,3
hamburger5.jpg,4,5,5,2,5,4,3,4,4,4,0,3,5,3,2
hamburger4.jpg,3,3,4,3,5,4,2,4,4,4,3,0,4,3,5
hamburger13.jpg,1,3,2,4,5,5,5,5,5,4,5,4,0,5,5
hamburger7.jpg,4,4,5,5,4,3,2,3,3,3,3,3,5,0,4
hamburger12.jpg,5,4,5,3,4,3,4,5,2,3,2,5,5,4,0
Type,R-Meta,R-Meta,R-Meta,R-Meta,R-Meta,R-Meta,R-Meta,R-Meta,R-Meta,R-Meta,R-Meta,R-Meta,R-Meta,R-Meta,R-Meta
hamburger2.jpg,0,2,1,5,2,5,2,3,4,3,3,3,0,3,5
hamburger0.jpg,2,0,3,5,2,3,2,5,2,1,5,3,2,3,3
hamburger11.jpg,1,3,0,6,3,6,3,4,5,4,4,4,1,4,6
hamburger14.jpg,5,5,6,0,7,4,5,6,5,6,2,4,5,6,4
hamburger1.jpg,2,2,3,7,0,5,2,3,4,3,5,3,2,3,5
hamburger10.jpg,5,3,6,4,5,0,3,6,1,2,6,4,5,4,2
hamburger9.jpg,2,2,3,5,2,3,0,3,2,3,3,1,2,1,3
hamburger8.jpg,3,5,4,6,3,6,3,0,5,6,4,4,3,2,6
hamburger6.jpg,4,2,5,5,4,1,2,5,0,1,5,3,4,3,1
hamburger3.jpg,3,1,4,6,3,2,3,6,1,0,6,4,3,4,2
hamburger5.jpg,3,5,4,2,5,6,3,4,5,6,0,2,3,4,4
hamburger4.jpg,3,3,4,4,3,4,1,4,3,4,2,0,3,2,4
hamburger13.jpg,0,2,1,5,2,5,2,3,4,3,3,3,0,3,5
hamburger7.jpg,3,3,4,6,3,4,1,2,3,4,4,2,3,0,4
hamburger12.jpg,5,3,6,4,5,2,3,6,1,2,4,4,5,4,0
Type,Content,Content,Content,Content,Content,Content,Content,Content,Content,Content,Content,Content,Content,Content,Content
hamburger2.jpg,0,13,13,12,13,13,12,13,13,12,12,13,10,12,13
hamburger0.jpg,13,0,13,13,13,13,13,12,13,11,13,13,13,13,11
hamburger11.jpg,13,13,0,13,12,13,13,13,13,12,12,13,12,13,12
hamburger14.jpg,12,13,13,0,13,13,12,13,13,13,13,13,13,13,13
hamburger1.jpg,13,13,12,13,0,13,13,13,12,12,11,13,13,12,13
hamburger10.jpg,13,13,13,13,13,0,13,13,10,13,13,12,13,11,13
hamburger9.jpg,12,13,13,12,13,13,0,13,13,13,13,13,13,12,11
hamburger8.jpg,13,12,13,13,13,13,13,0,12,13,13,13,13,13,13
hamburger6.jpg,13,13,13,13,12,10,13,12,0,12,12,13,13,12,12
hamburger3.jpg,12,11,12,13,12,13,13,13,12,0,11,13,12,13,13
hamburger5.jpg,12,13,12,13,11,13,13,13,12,11,0,13,13,10,13
hamburger4.jpg,13,13,13,13,13,12,13,13,13,13,13,0,13,13,13
hamburger13.jpg,10,13,12,13,13,13,13,13,13,12,13,13,0,12,13
hamburger7.jpg,12,13,13,13,12,11,12,13,12,13,10,13,12,0,13
hamburger12.jpg,13,11,12,13,13,13,11,13,12,13,13,13,13,13,0
Type,R-Content,R-Content,R-Content,R-Content,R-Content,R-Content,R-Content,R-Content,R-Content,R-Content,R-Content,R-Content,R-Content,R-Content,R-Content
hamburger2.jpg,0,11,8,9,13,8,8,8,8,13,12,10,8,10,11
hamburger0.jpg,11,0,7,10,10,11,11,9,9,8,7,9,5,11,6
hamburger11.jpg,8,7,0,11,7,12,12,10,10,9,8,12,10,8,7
hamburger14.jpg,9,10,11,0,12,11,11,9,9,10,11,11,7,9,12
hamburger1.jpg,13,10,7,12,0,13,13,11,11,10,7,11,11,7,12
hamburger10.jpg,8,11,12,11,13,0,10,12,8,7,8,6,8,8,11
hamburger9.jpg,8,11,12,11,13,10,0,6,8,9,10,8,12,10,9
hamburger8.jpg,8,9,10,9,11,12,6,0,8,13,8,10,10,10,7
hamburger6.jpg,8,9,10,9,11,8,8,8,0,9,8,10,8,10,5
hamburger3.jpg,13,8,9,10,10,7,9,13,9,0,7,9,11,7,10
hamburger5.jpg,12,7,8,11,7,8,10,8,8,7,0,10,10,10,9
hamburger4.jpg,10,9,12,11,11,6,8,10,10,9,10,0,10,10,9
hamburger13.jpg,8,5,10,7,11,8,12,10,8,11,10,10,0,12,9
hamburger7.jpg,10,11,8,9,7,8,10,10,10,7,10,10,12,0,13
hamburger12.jpg,11,6,7,12,12,11,9,7,5,10,9,9,9,13,0
Type,Final-R,Final-R,Final-R,Final-R,Final-R,Final-R,Final-R,Final-R,Final-R,Final-R,Final-R,Final-R,Final-R,Final-R,Final-R
hamburger2.jpg,0,2,1,5,2,5,2,3,4,3,3,3,0,3,5
hamburger0.jpg,2,0,3,5,2,3,2,5,2,1,5,3,2,3,3
hamburger11.jpg,1,3,0,6,3,6,3,4,5,4,4,4,1,4,6
hamburger14.jpg,5,5,6,0,7,4,5,6,5,6,2,4,5,6,4
hamburger1.jpg,2,2,3,7,0,5,2,3,4,3,5,3,2,3,5
hamburger10.jpg,5,3,6,4,5,0,3,6,1,2,6,4,5,4,2
hamburger9.jpg,2,2,3,5,2,3,0,3,2,3,3,1,2,1,3
hamburger8.jpg,3,5,4,6,3,6,3,0,5,6,4,4,3,2,6
hamburger6.jpg,4,2,5,5,4,1,2,5,0,1,5,3,4,3,1
hamburger3.jpg,3,1,4,6,3,2,3,6,1,0,6,4,3,4,2
hamburger5.jpg,3,5,4,2,5,6,3,4,5,6,0,2,3,4,4
hamburger4.jpg,3,3,4,4,3,4,1,4,3,4,2,0,3,2,4
hamburger13.jpg,0,2,1,5,2,5,2,3,4,3,3,3,0,3,5
hamburger7.jpg,3,3,4,6,3,4,1,2,3,4,4,2,3,0,4
hamburger12.jpg,5,3,6,4,5,2,3,6,1,2,4,4,5,4,0
