,san_luca11.jpg,san_luca14.jpg,san_luca2.jpg,san_luca1.jpg,san_luca12.jpg,san_luca3.jpg,san_luca5.jpg,san_luca13.jpg,san_luca0.jpg,san_luca8.jpg,san_luca10.jpg,san_luca9.jpg,san_luca7.jpg,san_luca6.jpg,san_luca4.jpg
Type,Meta,Meta,Meta,Meta,Meta,Meta,Meta,Meta,Meta,Meta,Meta,Meta,Meta,Meta,Meta
san_luca11.jpg,0,6,7,4,6,5,6,5,5,4,6,4,6,7,7
san_luca14.jpg,6,0,5,6,4,5,7,6,6,4,6,6,6,6,6
san_luca2.jpg,7,5,0,7,7,6,6,7,7,7,6,7,6,5,6
san_luca1.jpg,4,6,7,0,6,6,6,6,5,4,7,6,6,6,5
san_luca12.jpg,6,4,7,6,0,6,7,5,6,5,6,6,5,7,7
san_luca3.jpg,5,5,6,6,6,0,6,6,5,6,5,4,6,6,7
san_luca5.jpg,6,7,6,6,7,6,0,5,5,5,5,5,6,6,5
san_luca13.jpg,5,6,7,6,5,6,5,0,5,5,3,5,6,6,6
san_luca0.jpg,5,6,7,5,6,5,5,5,0,6,7,3,5,6,6
san_luca8.jpg,4,4,7,4,5,6,5,5,6,0,6,4,6,7,4
san_luca10.jpg,6,6,6,7,6,5,5,3,7,6,0,6,6,5,6
san_luca9.jpg,4,6,7,6,6,4,5,5,3,4,6,0,6,7,6
san_luca7.jpg,6,6,6,6,5,6,6,6,5,6,6,6,0,4,4
san_luca6.jpg,7,6,5,6,7,6,6,6,6,7,5,7,4,0,4
san_luca4.jpg,7,6,6,5,7,7,5,6,6,4,6,6,4,4,0
Type,R-Meta,R-Meta,R-Meta,R-Meta,R-Meta,R-Meta,R-Meta,R-Meta,R-Meta,R-Meta,R-Meta,R-Meta,R-Meta,R-Meta,R-Meta
san_luca11.jpg,0,5,3,2,5,3,3,3,3,2,5,4,3,4,5
san_luca14.jpg,5,0,6,3,2,4,6,4,4,5,6,5,4,5,6
san_luca2.jpg,3,6,0,3,6,4,4,6,6,5,4,7,4,3,4
san_luca1.jpg,2,3,3,0,3,1,3,3,3,2,5,4,1,2,3
san_luca12.jpg,5,2,6,3,0,4,6,4,4,5,6,5,4,5,6
san_luca3.jpg,3,4,4,1,4,0,4,4,4,3,6,5,2,3,4
san_luca5.jpg,3,6,4,3,6,4,0,4,2,3,4,3,4,3,4
san_luca13.jpg,3,4,6,3,4,4,4,0,2,3,2,3,2,3,4
san_luca0.jpg,3,4,6,3,4,4,2,2,0,3,4,1,4,5,6
san_luca8.jpg,2,5,5,2,5,3,3,3,3,0,5,2,3,4,3
san_luca10.jpg,5,6,4,5,6,6,4,2,4,5,0,5,4,3,4
san_luca9.jpg,4,5,7,4,5,5,3,3,1,2,5,0,5,6,5
san_luca7.jpg,3,4,4,1,4,2,4,2,4,3,4,5,0,1,2
san_luca6.jpg,4,5,3,2,5,3,3,3,5,4,3,6,1,0,1
san_luca4.jpg,5,6,4,3,6,4,4,4,6,3,4,5,2,1,0
Type,Content,Content,Content,Content,Content,Content,Content,Content,Content,Content,Content,Content,Content,Content,Content
san_luca11.jpg,0,13,12,12,12,12,11,12,12,13,13,12,12,13,12
san_luca14.jpg,13,0,9,12,12,13,12,13,13,13,13,13,13,13,12
san_luca2.jpg,12,9,0,12,12,13,12,13,13,12,12,13,13,12,13
san_luca1.jpg,12,12,12,0,13,12,12,13,10,12,12,13,13,13,11
san_luca12.jpg,12,12,12,13,0,13,13,13,13,12,12,13,12,12,13
san_luca3.jpg,12,13,13,12,13,0,13,12,11,13,13,13,13,13,13
san_luca5.jpg,11,12,12,12,13,13,0,13,13,13,12,12,13,11,12
san_luca13.jpg,12,13,13,13,13,12,13,0,9,13,13,13,13,13,10
san_luca0.jpg,12,13,13,10,13,11,13,9,0,13,13,12,13,13,12
san_luca8.jpg,13,13,12,12,12,13,13,13,13,0,13,12,12,13,12
san_luca10.jpg,13,13,12,12,12,13,12,13,13,13,0,11,13,12,12
san_luca9.jpg,12,13,13,13,13,13,12,13,12,12,11,0,11,13,13
san_luca7.jpg,12,13,13,13,12,13,13,13,13,12,13,11,0,13,12
san_luca6.jpg,13,13,12,13,12,13,11,13,13,13,12,13,13,0,13
san_luca4.jpg,12,12,13,11,13,13,12,10,12,12,12,13,12,13,0
Type,R-Content,R-Content,R-Content,R-Content,R-Content,R-Content,R-Content,R-Content,R-Content,R-Content,R-Content,R-Content,R-Content,R-Content,R-Content
san_luca11.jpg,0,11,10,13,10,9,10,7,10,7,8,10,10,8,9
san_luca14.jpg,11,0,5,8,9,12,9,10,11,10,9,9,7,7,8
san_luca2.jpg,10,5,0,7,8,13,12,11,12,11,6,6,8,6,11
san_luca1.jpg,13,8,7,0,11,12,9,12,9,12,11,11,11,7,10
san_luca12.jpg,10,9,8,11,0,11,8,9,10,11,8,10,8,8,9
san_luca3.jpg,9,12,13,12,11,0,13,8,9,10,13,13,11,11,10
san_luca5.jpg,10,9,12,9,8,13,0,9,8,11,12,10,10,8,9
san_luca13.jpg,7,10,11,12,9,8,9,0,5,10,11,11,9,9,8
san_luca0.jpg,10,11,12,9,10,9,8,5,0,11,12,10,10,10,9
san_luca8.jpg,7,10,11,12,11,10,11,10,11,0,11,11,9,11,8
san_luca10.jpg,8,9,6,11,8,13,12,11,12,11,0,6,6,6,9
san_luca9.jpg,10,9,6,11,10,13,10,11,10,11,6,0,6,10,9
san_luca7.jpg,10,7,8,11,8,11,10,9,10,9,6,6,0,8,7
san_luca6.jpg,8,7,6,7,8,11,8,9,10,11,6,10,8,0,9
san_luca4.jpg,9,8,11,10,9,10,9,8,9,8,9,9,7,9,0
Type,Final-R,Final-R,Final-R,Final-R,Final-R,Final-R,Final-R,Final-R,Final-R,Final-R,Final-R,Final-R,Final-R,Final-R,Final-R
san_luca11.jpg,0,5,3,2,5,3,3,3,3,2,5,4,3,4,5
san_luca14.jpg,5,0,6,3,2,4,6,4,4,5,6,5,4,5,6
san_luca2.jpg,3,6,0,3,6,4,4,6,6,5,4,7,4,3,4
san_luca1.jpg,2,3,3,0,3,1,3,3,3,2,5,4,1,2,3
san_luca12.jpg,5,2,6,3,0,4,6,4,4,5,6,5,4,5,6
san_luca3.jpg,3,4,4,1,4,0,4,4,4,3,6,5,2,3,4
san_luca5.jpg,3,6,4,3,6,4,0,4,2,3,4,3,4,3,4
san_luca13.jpg,3,4,6,3,4,4,4,0,2,3,2,3,2,3,4
san_luca0.jpg,3,4,6,3,4,4,2,2,0,3,4,1,4,5,6
san_luca8.jpg,2,5,5,2,5,3,3,3,3,0,5,2,3,4,3
san_luca10.jpg,5,6,4,5,6,6,4,2,4,5,0,5,4,3,4
san_luca9.jpg,4,5,7,4,5,5,3,3,1,2,5,0,5,6,5
san_luca7.jpg,3,4,4,1,4,2,4,2,4,3,4,5,0,1,2
san_luca6.jpg,4,5,3,2,5,3,3,3,5,4,3,6,1,0,1
san_luca4.jpg,5,6,4,3,6,4,4,4,6,3,4,5,2,1,0
