,colosseo9.jpg,colosseo10.jpg,colosseo3.jpg,colosseo1.jpg,colosseo14.jpg,colosseo7.jpg,colosseo12.jpg,colosseo4.jpg,colosseo6.jpg,colosseo8.jpg,colosseo11.jpg,colosseo5.jpg,colosseo0.jpg,colosseo2.jpg,colosseo13.jpg
Type,Meta,Meta,Meta,Meta,Meta,Meta,Meta,Meta,Meta,Meta,Meta,Meta,Meta,Meta,Meta
colosseo9.jpg,0,3,5,6,4,4,4,3,5,5,4,6,3,5,5
colosseo10.jpg,3,0,4,5,3,3,4,4,5,4,3,6,3,4,4
colosseo3.jpg,5,4,0,6,4,5,3,4,6,5,4,3,4,4,3
colosseo1.jpg,6,5,6,0,4,4,4,5,6,3,3,5,6,4,5
colosseo14.jpg,4,3,4,4,0,4,3,5,6,3,1,6,3,4,4
colosseo7.jpg,4,3,5,4,4,0,5,3,3,2,4,5,4,4,5
colosseo12.jpg,4,4,3,4,3,5,0,3,6,4,3,5,5,4,3
colosseo4.jpg,3,4,4,5,5,3,3,0,4,4,5,3,5,5,5
colosseo6.jpg,5,5,6,6,6,3,6,4,0,4,6,6,4,6,6
colosseo8.jpg,5,4,5,3,3,2,4,4,4,0,3,5,5,4,5
colosseo11.jpg,4,3,4,3,1,4,3,5,6,3,0,6,3,4,4
colosseo5.jpg,6,6,3,5,6,5,5,3,6,5,6,0,6,5,5
colosseo0.jpg,3,3,4,6,3,4,5,5,4,5,3,6,0,4,5
colosseo2.jpg,5,4,4,4,4,4,4,5,6,4,4,5,4,0,4
colosseo13.jpg,5,4,3,5,4,5,3,5,6,5,4,5,5,4,0
Type,R-Meta,R-Meta,R-Meta,R-Meta,R-Meta,R-Meta,R-Meta,R-Meta,R-Meta,R-Meta,R-Meta,R-Meta,R-Meta,R-Meta,R-Meta
colosseo9.jpg,0,0,2,2,0,2,2,4,4,2,0,4,0,2,2
colosseo10.jpg,0,0,2,2,0,2,2,4,4,2,0,4,0,2,2
colosseo3.jpg,2,2,0,4,2,4,0,2,4,4,2,2,2,4,2
colosseo1.jpg,2,2,4,0,2,0,4,2,2,0,2,2,2,2,4
colosseo14.jpg,0,0,2,2,0,2,2,4,4,2,0,4,0,2,2
colosseo7.jpg,2,2,4,0,2,0,4,2,2,0,2,2,2,2,4
colosseo12.jpg,2,2,0,4,2,4,0,2,4,4,2,2,2,4,2
colosseo4.jpg,4,4,2,2,4,2,2,0,2,2,4,0,4,4,4
colosseo6.jpg,4,4,4,2,4,2,4,2,0,2,4,2,4,4,4
colosseo8.jpg,2,2,4,0,2,0,4,2,2,0,2,2,2,2,4
colosseo11.jpg,0,0,2,2,0,2,2,4,4,2,0,4,0,2,2
colosseo5.jpg,4,4,2,2,4,2,2,0,2,2,4,0,4,4,4
colosseo0.jpg,0,0,2,2,0,2,2,4,4,2,0,4,0,2,2
colosseo2.jpg,2,2,4,2,2,2,4,4,4,2,2,4,2,0,4
colosseo13.jpg,2,2,2,4,2,4,2,4,4,4,2,4,2,4,0
Type,Content,Content,Content,Content,Content,Content,Content,Content,Content,Content,Content,Content,Content,Content,Content
colosseo9.jpg,0,11,12,12,13,13,11,12,12,12,13,13,13,12,13
colosseo10.jpg,11,0,13,12,13,13,10,12,12,13,12,13,13,12,10
colosseo3.jpg,12,13,0,13,12,13,13,13,13,13,13,11,13,13,12
colosseo1.jpg,12,12,13,0,12,12,13,13,12,12,13,12,12,12,13
colosseo14.jpg,13,13,12,12,0,11,13,13,13,13,13,12,13,13,12
colosseo7.jpg,13,13,13,12,11,0,12,13,11,13,13,13,10,12,13
colosseo12.jpg,11,10,13,13,13,12,0,12,13,12,13,12,12,12,12
colosseo4.jpg,12,12,13,13,13,13,12,0,13,12,13,13,12,13,13
colosseo6.jpg,12,12,13,12,13,11,13,13,0,13,12,13,12,11,11
colosseo8.jpg,12,13,13,12,13,13,12,12,13,0,11,12,13,13,13
colosseo11.jpg,13,12,13,13,13,13,13,13,12,11,0,11,13,13,11
colosseo5.jpg,13,13,11,12,12,13,12,13,13,12,11,0,13,13,13
colosseo0.jpg,13,13,13,12,13,10,12,12,12,13,13,13,0,12,13
colosseo2.jpg,12,12,13,12,13,12,12,13,11,13,13,13,12,0,13
colosseo13.jpg,13,10,12,13,12,13,12,13,11,13,11,13,13,13,0
Type,R-Content,R-Content,R-Content,R-Content,R-Content,R-Content,R-Content,R-Content,R-Content,R-Content,R-Content,R-Content,R-Content,R-Content,R-Content
colosseo9.jpg,0,5,8,5,8,6,4,6,6,6,7,8,6,8,7
colosseo10.jpg,5,0,7,2,7,5,7,5,5,7,6,7,5,5,6
colosseo3.jpg,8,7,0,7,6,4,8,8,6,8,5,4,8,6,1
colosseo1.jpg,5,2,7,0,5,5,7,5,5,7,6,7,5,5,6
colosseo14.jpg,8,7,6,5,0,6,8,6,6,6,5,6,8,8,5
colosseo7.jpg,6,5,4,5,6,0,6,8,4,8,5,6,4,4,5
colosseo12.jpg,4,7,8,7,8,6,0,8,8,6,7,6,6,8,7
colosseo4.jpg,6,5,8,5,6,8,8,0,8,4,7,6,8,8,7
colosseo6.jpg,6,5,6,5,6,4,8,8,0,8,5,6,6,4,5
colosseo8.jpg,6,7,8,7,6,8,6,4,8,0,7,6,8,8,7
colosseo11.jpg,7,6,5,6,5,5,7,7,5,7,0,5,5,7,4
colosseo5.jpg,8,7,4,7,6,6,6,6,6,6,5,0,8,8,3
colosseo0.jpg,6,5,8,5,8,4,6,8,6,8,5,8,0,6,7
colosseo2.jpg,8,5,6,5,8,4,8,8,4,8,7,8,6,0,7
colosseo13.jpg,7,6,1,6,5,5,7,7,5,7,4,3,7,7,0
Type,Final-R,Final-R,Final-R,Final-R,Final-R,Final-R,Final-R,Final-R,Final-R,Final-R,Final-R,Final-R,Final-R,Final-R,Final-R
colosseo9.jpg,0,4,7,6,6,5,5,9,7,6,4,10,4,6,6
colosseo10.jpg,4,0,7,4,6,3,7,9,7,8,4,10,2,4,6
colosseo3.jpg,7,7,0,9,7,6,6,8,6,11,5,5,7,9,1
colosseo1.jpg,6,4,9,0,6,3,9,7,5,6,6,8,4,4,8
colosseo14.jpg,6,6,7,6,0,5,9,9,9,8,4,10,6,8,6
colosseo7.jpg,5,3,6,3,5,0,8,8,4,7,3,7,3,3,5
colosseo12.jpg,5,7,6,9,9,8,0,8,10,9,7,7,7,9,7
colosseo4.jpg,9,9,8,7,9,8,8,0,8,5,9,5,9,9,9
colosseo6.jpg,7,7,6,5,9,4,10,8,0,9,7,5,7,7,5
colosseo8.jpg,6,8,11,6,8,7,9,5,9,0,8,8,8,8,10
colosseo11.jpg,4,4,5,6,4,3,7,9,7,8,0,8,4,6,4
colosseo5.jpg,10,10,5,8,10,7,7,5,5,8,8,0,10,10,6
colosseo0.jpg,4,2,7,4,6,3,7,9,7,8,4,10,0,4,6
colosseo2.jpg,6,4,9,4,8,3,9,9,7,8,6,10,4,0,8
colosseo13.jpg,6,6,1,8,6,5,7,9,5,10,4,6,6,8,0
