Img-Name,Meta,R-Meta,Content,R-Content,Final-R
ponte_vecchio5.jpg,AAA365RXHYZ2HRD3,"[1, 1, 1, 1, 0, 1, 0, 0]",EEAYOVDJK224QO3M,"[0, 1, 1, 0, 1, 1, 1, 1]","[1, 1, 1, 1, 1, 1, 1, 1]"
ponte_vecchio7.jpg,AAA34RRHJYZ2HRD3,"[1, 1, 1, 1, 0, 0, 0, 0]",EEA5NKN2BRZ5ERB5,"[0, 0, 1, 1, 0, 1, 0, 0]","[1, 1, 1, 1, 0, 1, 0, 0]"
ponte_vecchio6.jpg,AAA3UYRHNQZ2HRD3,"[1, 1, 1, 1, 0, 0, 0, 0]",EEAZLK7AQQXORN42,"[0, 1, 1, 1, 0, 1, 1, 1]","[1, 1, 1, 1, 0, 1, 1, 1]"
ponte_vecchio9.jpg,AAA347R5HQZ2HRD3,"[0, 1, 1, 1, 0, 1, 0, 1]",EEAYLEXLOJ6J4FIL,"[0, 1, 1, 0, 1, 1, 1, 0]","[0, 1, 1, 1, 1, 1, 1, 1]"
ponte_vecchio4.jpg,AAA34XRHFYZ2HRD3,"[1, 1, 1, 1, 0, 0, 0, 0]",EEA5LAVM7EVPJYIL,"[1, 1, 0, 0, 1, 1, 0, 0]","[1, 1, 1, 1, 1, 1, 0, 0]"
ponte_vecchio1.jpg,AAA3MURHPYZ2HRD3,"[1, 1, 1, 1, 0, 1, 0, 0]",EEAYR4MVFAX7JVB5,"[0, 1, 0, 0, 1, 1, 1, 1]","[1, 1, 1, 1, 1, 1, 1, 1]"
ponte_vecchio2.jpg,AAA362RDXYZ2HRD3,"[0, 1, 1, 1, 1, 0, 0, 0]",EEAZLLOOFMVA4HMO,"[1, 1, 1, 0, 1, 1, 0, 1]","[1, 1, 1, 1, 1, 1, 0, 1]"
ponte_vecchio13.jpg,AAA3O3RXPYZ2HRD3,"[1, 1, 1, 1, 0, 0, 0, 0]",EEA5LKRO2A57NVAB,"[0, 1, 1, 1, 0, 1, 1, 1]","[1, 1, 1, 1, 0, 1, 1, 1]"
ponte_vecchio11.jpg,AAA7OX5PHYZ2HRD3,"[1, 1, 1, 1, 0, 0, 0, 1]",EEA7J34LHARIPNLA,"[0, 1, 0, 1, 1, 1, 1, 1]","[1, 1, 1, 1, 1, 1, 1, 1]"
ponte_vecchio8.jpg,AAA34VRAFYZ2HRD3,"[0, 1, 1, 1, 0, 0, 1, 0]",EEAYFUGSOQ6Z7BZH,"[1, 1, 1, 1, 0, 1, 0, 0]","[1, 1, 1, 1, 0, 1, 1, 0]"
ponte_vecchio10.jpg,AAA367RXPQZ2HRD3,"[1, 1, 1, 1, 0, 0, 0, 1]",EEA5JQ3K6Q53AHQ2,"[1, 1, 1, 1, 0, 1, 0, 0]","[1, 1, 1, 1, 0, 1, 0, 1]"
ponte_vecchio14.jpg,AAA3MXRHXQZ2HRD3,"[1, 1, 1, 1, 0, 0, 0, 0]",EEAYDEGU7U76FSQO,"[0, 1, 0, 1, 0, 1, 1, 1]","[1, 1, 1, 1, 0, 1, 1, 1]"
ponte_vecchio0.jpg,AAA365RLXQZ2HRD3,"[0, 1, 1, 1, 1, 1, 0, 0]",EEAYLFWA2QYD527N,"[0, 1, 1, 0, 1, 1, 1, 0]","[0, 1, 1, 1, 1, 1, 1, 0]"
ponte_vecchio12.jpg,AAA36TRPP4Z2HRD3,"[1, 1, 1, 1, 1, 0, 0, 0]",EEA5NIJFKYSXXOFU,"[1, 1, 0, 0, 0, 1, 1, 1]","[1, 1, 1, 1, 1, 1, 1, 1]"
ponte_vecchio3.jpg,AAA7OVRHNYZ2HRD3,"[1, 1, 1, 1, 0, 0, 1, 1]",EEAZJPW4WMRUWFYD,"[1, 0, 1, 0, 1, 1, 1, 0]","[1, 1, 1, 1, 1, 1, 1, 1]"
