,basilica_santa_croce1.jpg,basilica_santa_croce7.jpg,basilica_santa_croce13.jpg,basilica_santa_croce12.jpg,basilica_santa_croce8.jpg,basilica_santa_croce11.jpg,basilica_santa_croce9.jpg,basilica_santa_croce4.jpg,basilica_santa_croce6.jpg,basilica_santa_croce5.jpg,basilica_santa_croce3.jpg,basilica_santa_croce2.jpg,basilica_santa_croce10.jpg,basilica_santa_croce0.jpg,basilica_santa_croce14.jpg
Type,SHA256,SHA256,SHA256,SHA256,SHA256,SHA256,SHA256,SHA256,SHA256,SHA256,SHA256,SHA256,SHA256,SHA256,SHA256
basilica_santa_croce1.jpg,0,61,62,61,60,58,60,62,62,57,60,61,60,62,60
basilica_santa_croce7.jpg,61,0,63,63,60,58,61,59,60,61,63,64,58,62,58
basilica_santa_croce13.jpg,62,63,0,62,63,58,63,60,60,61,61,59,58,58,61
basilica_santa_croce12.jpg,61,63,62,0,59,60,60,55,64,59,61,61,62,59,61
basilica_santa_croce8.jpg,60,60,63,59,0,60,61,57,59,59,60,60,61,59,59
basilica_santa_croce11.jpg,58,58,58,60,60,0,60,55,58,62,59,61,62,58,56
basilica_santa_croce9.jpg,60,61,63,60,61,60,0,57,58,58,61,59,60,60,60
basilica_santa_croce4.jpg,62,59,60,55,57,55,57,0,60,58,61,62,62,61,61
basilica_santa_croce6.jpg,62,60,60,64,59,58,58,60,0,62,61,63,59,63,61
basilica_santa_croce5.jpg,57,61,61,59,59,62,58,58,62,0,61,60,59,62,61
basilica_santa_croce3.jpg,60,63,61,61,60,59,61,61,61,61,0,59,63,63,61
basilica_santa_croce2.jpg,61,64,59,61,60,61,59,62,63,60,59,0,61,60,60
basilica_santa_croce10.jpg,60,58,58,62,61,62,60,62,59,59,63,61,0,59,62
basilica_santa_croce0.jpg,62,62,58,59,59,58,60,61,63,62,63,60,59,0,62
basilica_santa_croce14.jpg,60,58,61,61,59,56,60,61,61,61,61,60,62,62,0
Type,Final-R,Final-R,Final-R,Final-R,Final-R,Final-R,Final-R,Final-R,Final-R,Final-R,Final-R,Final-R,Final-R,Final-R,Final-R
basilica_santa_croce1.jpg,0,30,29,32,32,27,31,30,30,27,32,30,32,29,32
basilica_santa_croce7.jpg,30,0,31,30,32,27,31,30,28,25,32,32,30,31,30
basilica_santa_croce13.jpg,29,31,0,31,31,28,28,31,29,28,29,29,31,30,31
basilica_santa_croce12.jpg,32,30,31,0,32,29,29,32,32,31,30,30,32,29,30
basilica_santa_croce8.jpg,32,32,31,32,0,25,31,30,26,29,28,32,30,25,26
basilica_santa_croce11.jpg,27,27,28,29,25,0,26,29,27,28,29,29,29,26,25
basilica_santa_croce9.jpg,31,31,28,29,31,26,0,27,31,26,29,31,31,30,31
basilica_santa_croce4.jpg,30,30,31,32,30,29,27,0,28,31,28,30,32,27,32
basilica_santa_croce6.jpg,30,28,29,32,26,27,31,28,0,23,28,32,28,29,28
basilica_santa_croce5.jpg,27,25,28,31,29,28,26,31,23,0,31,29,29,30,31
basilica_santa_croce3.jpg,32,32,29,30,28,29,29,28,28,31,0,28,28,31,32
basilica_santa_croce2.jpg,30,32,29,30,32,29,31,30,32,29,28,0,30,29,32
basilica_santa_croce10.jpg,32,30,31,32,30,29,31,32,28,29,28,30,0,29,30
basilica_santa_croce0.jpg,29,31,30,29,25,26,30,27,29,30,31,29,29,0,29
basilica_santa_croce14.jpg,32,30,31,30,26,25,31,32,28,31,32,32,30,29,0
