,san_petronio6.jpg,san_petronio1.jpg,san_petronio14.jpg,san_petronio8.jpg,san_petronio0.jpg,san_petronio5.jpg,san_petronio13.jpg,san_petronio12.jpg,san_petronio11.jpg,san_petronio7.jpg,san_petronio2.jpg,san_petronio3.jpg,san_petronio10.jpg,san_petronio4.jpg,san_petronio9.jpg
Type,Meta,Meta,Meta,Meta,Meta,Meta,Meta,Meta,Meta,Meta,Meta,Meta,Meta,Meta,Meta
san_petronio6.jpg,0,4,4,2,4,3,4,4,4,1,4,2,4,2,6
san_petronio1.jpg,4,0,4,4,5,3,4,3,1,3,3,4,3,3,6
san_petronio14.jpg,4,4,0,4,3,3,4,5,3,4,4,4,3,4,5
san_petronio8.jpg,2,4,4,0,4,3,3,4,4,2,4,3,4,3,6
san_petronio0.jpg,4,5,3,4,0,2,5,6,4,4,4,4,4,5,3
san_petronio5.jpg,3,3,3,3,2,0,4,5,2,3,2,3,4,4,5
san_petronio13.jpg,4,4,4,3,5,4,0,5,4,4,4,4,4,4,6
san_petronio12.jpg,4,3,5,4,6,5,5,0,4,3,5,5,4,3,5
san_petronio11.jpg,4,1,3,4,4,2,4,4,0,3,3,4,3,3,6
san_petronio7.jpg,1,3,4,2,4,3,4,3,3,0,4,2,3,1,6
san_petronio2.jpg,4,3,4,4,4,2,4,5,3,4,0,4,4,4,4
san_petronio3.jpg,2,4,4,3,4,3,4,5,4,2,4,0,4,3,6
san_petronio10.jpg,4,3,3,4,4,4,4,4,3,3,4,4,0,2,4
san_petronio4.jpg,2,3,4,3,5,4,4,3,3,1,4,3,2,0,5
san_petronio9.jpg,6,6,5,6,3,5,6,5,6,6,4,6,4,5,0
Type,R-Meta,R-Meta,R-Meta,R-Meta,R-Meta,R-Meta,R-Meta,R-Meta,R-Meta,R-Meta,R-Meta,R-Meta,R-Meta,R-Meta,R-Meta
san_petronio6.jpg,0,0,1,0,1,0,1,3,0,0,1,0,1,1,3
san_petronio1.jpg,0,0,1,0,1,0,1,3,0,0,1,0,1,1,3
san_petronio14.jpg,1,1,0,1,2,1,2,4,1,1,2,1,2,2,4
san_petronio8.jpg,0,0,1,0,1,0,1,3,0,0,1,0,1,1,3
san_petronio0.jpg,1,1,2,1,0,1,2,4,1,1,2,1,2,2,2
san_petronio5.jpg,0,0,1,0,1,0,1,3,0,0,1,0,1,1,3
san_petronio13.jpg,1,1,2,1,2,1,0,2,1,1,2,1,2,2,2
san_petronio12.jpg,3,3,4,3,4,3,2,0,3,3,4,3,4,4,4
san_petronio11.jpg,0,0,1,0,1,0,1,3,0,0,1,0,1,1,3
san_petronio7.jpg,0,0,1,0,1,0,1,3,0,0,1,0,1,1,3
san_petronio2.jpg,1,1,2,1,2,1,2,4,1,1,0,1,2,2,4
san_petronio3.jpg,0,0,1,0,1,0,1,3,0,0,1,0,1,1,3
san_petronio10.jpg,1,1,2,1,2,1,2,4,1,1,2,1,0,0,2
san_petronio4.jpg,1,1,2,1,2,1,2,4,1,1,2,1,0,0,2
san_petronio9.jpg,3,3,4,3,2,3,2,4,3,3,4,3,2,2,0
Type,Content,Content,Content,Content,Content,Content,Content,Content,Content,Content,Content,Content,Content,Content,Content
san_petronio6.jpg,0,13,13,12,11,11,13,11,11,12,12,12,13,13,12
san_petronio1.jpg,13,0,12,13,11,13,12,12,13,13,12,13,13,11,12
san_petronio14.jpg,13,12,0,13,11,11,12,13,12,12,13,12,11,12,12
san_petronio8.jpg,12,13,13,0,13,12,11,13,12,12,13,13,11,12,13
san_petronio0.jpg,11,11,11,13,0,10,13,11,12,12,12,12,13,11,11
san_petronio5.jpg,11,13,11,12,10,0,12,12,10,11,10,12,12,13,12
san_petronio13.jpg,13,12,12,11,13,12,0,12,13,13,13,12,11,13,13
san_petronio12.jpg,11,12,13,13,11,12,12,0,12,13,12,13,12,11,9
san_petronio11.jpg,11,13,12,12,12,10,13,12,0,12,11,13,12,12,11
san_petronio7.jpg,12,13,12,12,12,11,13,13,12,0,12,13,13,12,12
san_petronio2.jpg,12,12,13,13,12,10,13,12,11,12,0,12,13,12,11
san_petronio3.jpg,12,13,12,13,12,12,12,13,13,13,12,0,12,13,13
san_petronio10.jpg,13,13,11,11,13,12,11,12,12,13,13,12,0,13,13
san_petronio4.jpg,13,11,12,12,11,13,13,11,12,12,12,13,13,0,10
san_petronio9.jpg,12,12,12,13,11,12,13,9,11,12,11,13,13,10,0
Type,R-Content,R-Content,R-Content,R-Content,R-Content,R-Content,R-Content,R-Content,R-Content,R-Content,R-Content,R-Content,R-Content,R-Content,R-Content
san_petronio6.jpg,0,7,11,7,9,11,11,11,9,6,10,7,7,9,11
san_petronio1.jpg,7,0,10,10,10,14,12,10,10,11,13,10,10,8,10
san_petronio14.jpg,11,10,0,10,12,12,12,8,12,9,9,8,12,12,10
san_petronio8.jpg,7,10,10,0,8,12,10,12,12,9,11,10,4,10,10
san_petronio0.jpg,9,10,12,8,0,12,12,10,10,11,11,10,8,10,8
san_petronio5.jpg,11,14,12,12,12,0,8,10,8,9,5,12,12,12,10
san_petronio13.jpg,11,12,12,10,12,8,0,10,12,9,9,12,10,8,10
san_petronio12.jpg,11,10,8,12,10,10,10,0,12,9,11,12,12,10,8
san_petronio11.jpg,9,10,12,12,10,8,12,12,0,11,9,12,10,12,12
san_petronio7.jpg,6,11,9,9,11,9,9,9,11,0,10,9,9,9,11
san_petronio2.jpg,10,13,9,11,11,5,9,11,9,10,0,9,13,11,7
san_petronio3.jpg,7,10,8,10,10,12,12,12,12,9,9,0,10,10,10
san_petronio10.jpg,7,10,12,4,8,12,10,12,10,9,13,10,0,10,12
san_petronio4.jpg,9,8,12,10,10,12,8,10,12,9,11,10,10,0,8
san_petronio9.jpg,11,10,10,10,8,10,10,8,12,11,7,10,12,8,0
Type,Final-R,Final-R,Final-R,Final-R,Final-R,Final-R,Final-R,Final-R,Final-R,Final-R,Final-R,Final-R,Final-R,Final-R,Final-R
san_petronio6.jpg,0,5,10,7,9,11,10,14,6,6,10,5,7,7,11
san_petronio1.jpg,5,0,9,8,8,12,9,11,7,9,11,6,6,4,8
san_petronio14.jpg,10,9,0,9,11,11,12,10,8,8,8,7,11,11,11
san_petronio8.jpg,7,8,9,0,8,12,9,13,9,9,11,8,4,8,10
san_petronio0.jpg,9,8,11,8,0,12,11,13,9,11,11,8,8,8,6
san_petronio5.jpg,11,12,11,12,12,0,5,11,5,9,5,10,12,10,10
san_petronio13.jpg,10,9,12,9,11,5,0,10,8,8,8,11,9,7,9
san_petronio12.jpg,14,11,10,13,13,11,10,0,12,12,12,13,13,11,7
san_petronio11.jpg,6,7,8,9,9,5,8,12,0,8,6,9,9,7,9
san_petronio7.jpg,6,9,8,9,11,9,8,12,8,0,10,7,9,7,11
san_petronio2.jpg,10,11,8,11,11,5,8,12,6,10,0,7,13,11,9
san_petronio3.jpg,5,6,7,8,8,10,11,13,9,7,7,0,8,8,10
san_petronio10.jpg,7,6,11,4,8,12,9,13,9,9,13,8,0,6,10
san_petronio4.jpg,7,4,11,8,8,10,7,11,7,7,11,8,6,0,8
san_petronio9.jpg,11,8,11,10,6,10,9,7,9,11,9,10,10,8,0
