,arco_trionfo11.jpg,arco_trionfo4.jpg,arco_trionfo9.jpg,arco_trionfo12.jpg,arco_trionfo8.jpg,arco_trionfo13.jpg,arco_trionfo2.jpg,arco_trionfo1.jpg,arco_trionfo5.jpg,arco_trionfo3.jpg,arco_trionfo0.jpg,arco_trionfo7.jpg,arco_trionfo10.jpg,arco_trionfo14.jpg,arco_trionfo6.jpg
Type,Meta,Meta,Meta,Meta,Meta,Meta,Meta,Meta,Meta,Meta,Meta,Meta,Meta,Meta,Meta
arco_trionfo11.jpg,0,5,4,3,5,5,5,5,6,5,4,5,6,6,5
arco_trionfo4.jpg,5,0,4,6,1,5,4,3,4,3,3,5,4,4,3
arco_trionfo9.jpg,4,4,0,5,4,6,4,6,4,4,3,5,5,6,2
arco_trionfo12.jpg,3,6,5,0,6,4,5,5,6,5,4,4,6,6,6
arco_trionfo8.jpg,5,1,4,6,0,4,4,4,4,3,4,5,3,4,3
arco_trionfo13.jpg,5,5,6,4,4,0,6,3,5,4,5,4,4,6,6
arco_trionfo2.jpg,5,4,4,5,4,6,0,6,6,5,4,6,4,6,4
arco_trionfo1.jpg,5,3,6,5,4,3,6,0,6,5,5,3,5,5,6
arco_trionfo5.jpg,6,4,4,6,4,5,6,6,0,3,3,6,5,5,4
arco_trionfo3.jpg,5,3,4,5,3,4,5,5,3,0,3,4,4,5,4
arco_trionfo0.jpg,4,3,3,4,4,5,4,5,3,3,0,6,5,6,4
arco_trionfo7.jpg,5,5,5,4,5,4,6,3,6,4,6,0,5,6,5
arco_trionfo10.jpg,6,4,5,6,3,4,4,5,5,4,5,5,0,5,5
arco_trionfo14.jpg,6,4,6,6,4,6,6,5,5,5,6,6,5,0,6
arco_trionfo6.jpg,5,3,2,6,3,6,4,6,4,4,4,5,5,6,0
Type,Content,Content,Content,Content,Content,Content,Content,Content,Content,Content,Content,Content,Content,Content,Content
arco_trionfo11.jpg,0,13,13,13,13,10,12,13,13,13,12,12,13,12,12
arco_trionfo4.jpg,13,0,12,13,12,13,13,13,13,12,12,13,11,13,13
arco_trionfo9.jpg,13,12,0,13,12,13,10,13,11,13,12,13,13,13,11
arco_trionfo12.jpg,13,13,13,0,12,13,11,13,13,13,13,12,13,13,13
arco_trionfo8.jpg,13,12,12,12,0,13,12,13,13,13,9,12,12,13,13
arco_trionfo13.jpg,10,13,13,13,13,0,12,13,13,13,13,12,13,12,11
arco_trionfo2.jpg,12,13,10,11,12,12,0,12,11,13,12,12,13,13,12
arco_trionfo1.jpg,13,13,13,13,13,13,12,0,13,13,13,12,13,13,12
arco_trionfo5.jpg,13,13,11,13,13,13,11,13,0,13,13,13,13,13,12
arco_trionfo3.jpg,13,12,13,13,13,13,13,13,13,0,12,12,12,12,12
arco_trionfo0.jpg,12,12,12,13,9,13,12,13,13,12,0,13,13,11,13
arco_trionfo7.jpg,12,13,13,12,12,12,12,12,13,12,13,0,13,13,11
arco_trionfo10.jpg,13,11,13,13,12,13,13,13,13,12,13,13,0,13,12
arco_trionfo14.jpg,12,13,13,13,13,12,13,13,13,12,11,13,13,0,13
arco_trionfo6.jpg,12,13,11,13,13,11,12,12,12,12,13,11,12,13,0
Type,Final-R,Final-R,Final-R,Final-R,Final-R,Final-R,Final-R,Final-R,Final-R,Final-R,Final-R,Final-R,Final-R,Final-R,Final-R
arco_trionfo11.jpg,0,8,8,6,10,10,10,8,12,10,6,10,12,12,8
arco_trionfo4.jpg,8,0,6,12,2,10,8,6,8,6,6,8,8,8,4
arco_trionfo9.jpg,8,6,0,10,6,12,8,10,8,8,6,10,10,10,2
arco_trionfo12.jpg,6,12,10,0,12,8,6,10,12,10,8,8,10,12,10
arco_trionfo8.jpg,10,2,6,12,0,8,8,8,8,6,8,8,6,6,4
arco_trionfo13.jpg,10,10,12,8,8,0,10,6,10,8,10,8,6,10,12
arco_trionfo2.jpg,10,8,8,6,8,10,0,12,10,8,6,10,8,12,6
arco_trionfo1.jpg,8,6,10,10,8,6,12,0,12,10,10,4,10,10,10
arco_trionfo5.jpg,12,8,8,12,8,10,10,12,0,6,6,12,6,8,8
arco_trionfo3.jpg,10,6,8,10,6,8,8,10,6,0,6,8,6,10,8
arco_trionfo0.jpg,6,6,6,8,8,10,6,10,6,6,0,12,6,12,6
arco_trionfo7.jpg,10,8,10,8,8,8,10,4,12,8,12,0,10,10,10
arco_trionfo10.jpg,12,8,10,10,6,6,8,10,6,6,6,10,0,8,10
arco_trionfo14.jpg,12,8,10,12,6,10,12,10,8,10,12,10,8,0,10
arco_trionfo6.jpg,8,4,2,10,4,12,6,10,8,8,6,10,10,10,0
