,colosseo9.jpg,colosseo10.jpg,colosseo3.jpg,colosseo1.jpg,colosseo14.jpg,colosseo7.jpg,colosseo12.jpg,colosseo4.jpg,colosseo6.jpg,colosseo8.jpg,colosseo11.jpg,colosseo5.jpg,colosseo0.jpg,colosseo2.jpg,colosseo13.jpg
Type,Meta,Meta,Meta,Meta,Meta,Meta,Meta,Meta,Meta,Meta,Meta,Meta,Meta,Meta,Meta
colosseo9.jpg,0,3,5,6,4,4,4,3,5,5,4,6,3,5,5
colosseo10.jpg,3,0,4,5,3,3,4,4,5,4,3,6,3,4,4
colosseo3.jpg,5,4,0,6,4,5,3,4,6,5,4,3,4,4,3
colosseo1.jpg,6,5,6,0,4,4,4,5,6,3,3,5,6,4,5
colosseo14.jpg,4,3,4,4,0,4,3,5,6,3,1,6,3,4,4
colosseo7.jpg,4,3,5,4,4,0,5,3,3,2,4,5,4,4,5
colosseo12.jpg,4,4,3,4,3,5,0,3,6,4,3,5,5,4,3
colosseo4.jpg,3,4,4,5,5,3,3,0,4,4,5,3,5,5,5
colosseo6.jpg,5,5,6,6,6,3,6,4,0,4,6,6,4,6,6
colosseo8.jpg,5,4,5,3,3,2,4,4,4,0,3,5,5,4,5
colosseo11.jpg,4,3,4,3,1,4,3,5,6,3,0,6,3,4,4
colosseo5.jpg,6,6,3,5,6,5,5,3,6,5,6,0,6,5,5
colosseo0.jpg,3,3,4,6,3,4,5,5,4,5,3,6,0,4,5
colosseo2.jpg,5,4,4,4,4,4,4,5,6,4,4,5,4,0,4
colosseo13.jpg,5,4,3,5,4,5,3,5,6,5,4,5,5,4,0
Type,R-Meta,R-Meta,R-Meta,R-Meta,R-Meta,R-Meta,R-Meta,R-Meta,R-Meta,R-Meta,R-Meta,R-Meta,R-Meta,R-Meta,R-Meta
colosseo9.jpg,0,2,4,6,2,4,4,6,5,4,2,7,2,4,3
colosseo10.jpg,2,0,2,4,0,2,2,4,5,2,0,5,2,2,1
colosseo3.jpg,4,2,0,6,2,4,0,2,5,4,2,3,4,4,1
colosseo1.jpg,6,4,6,0,4,2,6,4,3,2,4,3,4,4,5
colosseo14.jpg,2,0,2,4,0,2,2,4,5,2,0,5,2,2,1
colosseo7.jpg,4,2,4,2,2,0,4,2,3,0,2,3,4,2,3
colosseo12.jpg,4,2,0,6,2,4,0,2,5,4,2,3,4,4,1
colosseo4.jpg,6,4,2,4,4,2,2,0,3,2,4,1,6,4,3
colosseo6.jpg,5,5,5,3,5,3,5,3,0,3,5,4,3,5,4
colosseo8.jpg,4,2,4,2,2,0,4,2,3,0,2,3,4,2,3
colosseo11.jpg,2,0,2,4,0,2,2,4,5,2,0,5,2,2,1
colosseo5.jpg,7,5,3,3,5,3,3,1,4,3,5,0,7,5,4
colosseo0.jpg,2,2,4,4,2,4,4,6,3,4,2,7,0,4,3
colosseo2.jpg,4,2,4,4,2,2,4,4,5,2,2,5,4,0,3
colosseo13.jpg,3,1,1,5,1,3,1,3,4,3,1,4,3,3,0
Type,Content,Content,Content,Content,Content,Content,Content,Content,Content,Content,Content,Content,Content,Content,Content
colosseo9.jpg,0,11,12,12,13,13,11,12,12,12,13,13,13,12,13
colosseo10.jpg,11,0,13,12,13,13,10,12,12,13,12,13,13,12,10
colosseo3.jpg,12,13,0,13,12,13,13,13,13,13,13,11,13,13,12
colosseo1.jpg,12,12,13,0,12,12,13,13,12,12,13,12,12,12,13
colosseo14.jpg,13,13,12,12,0,11,13,13,13,13,13,12,13,13,12
colosseo7.jpg,13,13,13,12,11,0,12,13,11,13,13,13,10,12,13
colosseo12.jpg,11,10,13,13,13,12,0,12,13,12,13,12,12,12,12
colosseo4.jpg,12,12,13,13,13,13,12,0,13,12,13,13,12,13,13
colosseo6.jpg,12,12,13,12,13,11,13,13,0,13,12,13,12,11,11
colosseo8.jpg,12,13,13,12,13,13,12,12,13,0,11,12,13,13,13
colosseo11.jpg,13,12,13,13,13,13,13,13,12,11,0,11,13,13,11
colosseo5.jpg,13,13,11,12,12,13,12,13,13,12,11,0,13,13,13
colosseo0.jpg,13,13,13,12,13,10,12,12,12,13,13,13,0,12,13
colosseo2.jpg,12,12,13,12,13,12,12,13,11,13,13,13,12,0,13
colosseo13.jpg,13,10,12,13,12,13,12,13,11,13,11,13,13,13,0
Type,R-Content,R-Content,R-Content,R-Content,R-Content,R-Content,R-Content,R-Content,R-Content,R-Content,R-Content,R-Content,R-Content,R-Content,R-Content
colosseo9.jpg,0,8,11,9,12,11,9,10,13,8,10,11,10,13,12
colosseo10.jpg,8,0,11,7,10,11,11,8,9,10,12,7,10,9,8
colosseo3.jpg,11,11,0,8,11,10,12,11,10,11,13,10,9,10,9
colosseo1.jpg,9,7,8,0,7,8,12,9,6,9,11,8,9,10,9
colosseo14.jpg,12,10,11,7,0,7,13,8,5,8,10,9,10,11,6
colosseo7.jpg,11,11,10,8,7,0,12,11,8,13,11,10,5,8,11
colosseo12.jpg,9,11,12,12,13,12,0,11,14,11,11,8,11,10,9
colosseo4.jpg,10,8,11,9,8,11,11,0,7,8,12,9,12,9,8
colosseo6.jpg,13,9,10,6,5,8,14,7,0,7,13,8,11,8,7
colosseo8.jpg,8,10,11,9,8,13,11,8,7,0,10,11,12,13,8
colosseo11.jpg,10,12,13,11,10,11,11,12,13,10,0,11,10,11,12
colosseo5.jpg,11,7,10,8,9,10,8,9,8,11,11,0,11,8,7
colosseo0.jpg,10,10,9,9,10,5,11,12,11,12,10,11,0,9,10
colosseo2.jpg,13,9,10,10,11,8,10,9,8,13,11,8,9,0,11
colosseo13.jpg,12,8,9,9,6,11,9,8,7,8,12,7,10,11,0
Type,Final-R,Final-R,Final-R,Final-R,Final-R,Final-R,Final-R,Final-R,Final-R,Final-R,Final-R,Final-R,Final-R,Final-R,Final-R
colosseo9.jpg,0,2,4,6,2,4,4,6,5,4,2,7,2,4,3
colosseo10.jpg,2,0,2,4,0,2,2,4,5,2,0,5,2,2,1
colosseo3.jpg,4,2,0,6,2,4,0,2,5,4,2,3,4,4,1
colosseo1.jpg,6,4,6,0,4,2,6,4,3,2,4,3,4,4,5
colosseo14.jpg,2,0,2,4,0,2,2,4,5,2,0,5,2,2,1
colosseo7.jpg,4,2,4,2,2,0,4,2,3,0,2,3,4,2,3
colosseo12.jpg,4,2,0,6,2,4,0,2,5,4,2,3,4,4,1
colosseo4.jpg,6,4,2,4,4,2,2,0,3,2,4,1,6,4,3
colosseo6.jpg,5,5,5,3,5,3,5,3,0,3,5,4,3,5,4
colosseo8.jpg,4,2,4,2,2,0,4,2,3,0,2,3,4,2,3
colosseo11.jpg,2,0,2,4,0,2,2,4,5,2,0,5,2,2,1
colosseo5.jpg,7,5,3,3,5,3,3,1,4,3,5,0,7,5,4
colosseo0.jpg,2,2,4,4,2,4,4,6,3,4,2,7,0,4,3
colosseo2.jpg,4,2,4,4,2,2,4,4,5,2,2,5,4,0,3
colosseo13.jpg,3,1,1,5,1,3,1,3,4,3,1,4,3,3,0
