epoch,loss,lr,mean_squared_error,val_loss,val_mean_squared_error
0,0.08482498729631838,0.001,0.0848144843112372,0.00277146618088648,0.002760123459125898
1,0.0045532982936373504,0.001,0.0045419708877064875,0.0025153273015081448,0.0025039202288662174
2,0.0029672737223344816,0.001,0.0029558576897809477,0.0012288008141114195,0.0012173635952369974
3,0.0021511916462839077,0.001,0.002139732087947377,0.002251694515037739,0.002240202911438908
4,0.0018520302665982953,0.001,0.0018405883891700367,0.0008872776753507284,0.0008758601586649092
5,0.0017327186221525602,0.001,0.0017212750286606812,0.0012175309459316963,0.0012060480028240057
6,0.00155068197872141,0.001,0.001539211441626966,0.001518442440364928,0.001506966369795883
7,0.0014555171612585917,0.001,0.001444011976733877,0.0011500461856349608,0.001138527802589786
8,0.0013713222728451537,0.001,0.0013597894423948611,0.0006868022662294197,0.0006752771850579561
9,0.0012184651370183148,0.001,0.0012069009326900085,0.0008532540325271448,0.0008416680996131749
10,0.0012523708358608459,0.001,0.001240821436824989,0.00242328821657026,0.002411761676102407
11,0.0011841718488950941,0.001,0.0011726260270859667,0.0006441282686084238,0.0006325811040186317
12,0.001125859273638573,0.001,0.0011143048574263868,0.001404385770337513,0.0013928297289015697
13,0.0009499423075905516,0.001,0.0009383507420651493,0.00198086018120045,0.0019692569169320402
14,0.0009528771165781899,0.00090000004,0.0009412706678016431,0.0005706762819630764,0.000559079518309949
15,0.0008084656851814045,0.00090000004,0.00079682717714692,0.0006963825789416535,0.0006846772440668434
16,0.0007877705449783255,0.00090000004,0.0007760623927976806,0.0006973458331456632,0.0006856386761688656
17,0.0008399066476092792,0.00090000004,0.0008282252781842088,0.0006482757023195971,0.0006365910582275101
18,0.0008055652296414791,0.00090000004,0.0007939040915349384,0.000537738041614427,0.0005260967804278056
19,0.0008001285907868592,0.00090000004,0.0007884946055619775,0.0010678047220412572,0.001056157419371235
20,0.0006618002968211269,0.00081000006,0.0006501197191036819,0.00033968430267911716,0.0003279956089327158
21,0.00067979444108196,0.00081000006,0.0006681197433506641,0.00034201228610900746,0.00033031606679447814
22,0.0006686106170204958,0.00081000006,0.0006569281355328385,0.0005322129417907063,0.0005205332917928264
23,0.0006289729695252532,0.00081000006,0.0006172923282236213,0.00044868234103145936,0.0004369795420186114
24,0.0006273108643437415,0.00081000006,0.000615604728463129,0.0003611403801442499,0.00034943600098718403
25,0.0005912690631269849,0.00081000006,0.0005795758450083692,0.000339959286495448,0.0003282494022140506
26,0.0005750647609280644,0.0007290001,0.0005633520458062532,0.0005944448289250696,0.0005827224571088206
27,0.0005491211470694665,0.0007290001,0.0005373654464696706,0.000579657518003006,0.0005678832707807557
28,0.0005037968507977638,0.0007290001,0.000492033061034473,0.0002903056176201536,0.0002785153593922312
29,0.0005725241645036467,0.0007290001,0.0005607704038681832,0.0003291364687893494,0.00031739027884852616
30,0.000536749280026984,0.0007290001,0.0005250003570028748,0.00041110533333496433,0.00039936228193661414
31,0.0005107395795673145,0.00065610005,0.0004989878656951798,0.00044980949194954026,0.0004380390991687615
32,0.0004788861883809291,0.00065610005,0.0004671135871141926,0.00029115247338049857,0.00027937392669683604
33,0.0004065461381066879,0.00065610005,0.00039473233161097486,0.0002268635366880657,0.00021504059249250848
34,0.00048336188986205126,0.00065610005,0.00047155481216212976,0.00043116331654606793,0.00041936617214029736
35,0.00046959171758921965,0.00065610005,0.00045779297724607497,0.0003329285151400355,0.00032113913739893627
36,0.00041982676747985705,0.00065610005,0.0004080194798025729,0.0004506145729150877,0.00043880645379091736
37,0.0004479718328953446,0.00065610005,0.00043616196410741306,0.0007474871332834386,0.0007356762940557368
38,0.00047687081848565946,0.00065610005,0.00046508442711246274,0.0003856733397093304,0.00037388027319111723
39,0.00035673799180343624,0.00059049006,0.00034492006533348604,0.0003750596365682606,0.00036321891598428094
40,0.00037785774299152486,0.00059049006,0.00036601426003902326,0.0002079282506852015,0.00019607710152371293
41,0.00036040371113140287,0.00059049006,0.0003485295109348933,0.0008958409381571296,0.0008839438244855153
42,0.0003867709482254535,0.00059049006,0.0003748865326027829,0.00031148361888165647,0.00029959401405914743
43,0.0003394760942121968,0.00059049006,0.0003275665193252103,0.00028768856768659145,0.0002757709507970334
44,0.0003417783382185411,0.00053144107,0.0003298576882050491,0.0002376671721241022,0.00022573699480671995
45,0.00034503272979176863,0.00053144107,0.0003331066640541922,0.000533747042339965,0.0005218074763178449
46,0.0003397169402271328,0.00053144107,0.0003277746741101985,0.0005308938824285068,0.0005189466434796396
47,0.00039007788041922517,0.00053144107,0.00037813456718025894,0.00021674903981193204,0.0002048225324838259
48,0.00040294669998594643,0.00053144107,0.0003910240523177089,0.000248590805005102,0.0002366758469046812
49,0.00032922378676107324,0.00047829695,0.0003173047405850801,0.0002499479624304511,0.00023801381082541224
50,0.0003056554284255783,0.00047829695,0.000293715719052062,0.00022444805894345082,0.00021248894998001372
51,0.0002875325598020338,0.00047829695,0.0002755727781608101,0.00017552147299274755,0.00016355247080279125
52,0.00031322316736189887,0.00047829695,0.00030125163282916607,0.00020149872187377052,0.00018952495647781107
53,0.0003017457826070307,0.00047829695,0.0002897728671917192,0.00020569151962905686,0.00019372023050662823
54,0.000252539947429106,0.00043046725,0.00024054194742211736,0.00017977787173534667,0.0001677663795583616
55,0.00026030919807600906,0.00043046725,0.0002482824320811746,0.00014687949202893137,0.00013483888783632976
56,0.00028546021723091904,0.00043046725,0.0002734253607171767,0.0005175499488586792,0.0005055115394929772
57,0.0003041371741867631,0.00043046725,0.00029209956908180244,0.00023808816996548772,0.0002260494862594411
58,0.0002497098035399121,0.00043046725,0.00023765468662934142,0.0002684171048359063,0.0002563545904648483
59,0.00023766692215145539,0.00038742053,0.00022558871194895247,0.00031101408814226543,0.0002989164014726511
60,0.0002499961242081519,0.00038742053,0.0002378993381895449,0.0003075996812396833,0.00029549099395871485
61,0.0002335382573754444,0.00038742053,0.0002214149868728256,0.0005944329641199823,0.0005823102480719248
62,0.00023549322782928398,0.00038742053,0.00022336367163927395,0.00015837499124193296,0.00014622963187492865
63,0.00023478738135355055,0.00038742053,0.00022262971759208277,0.000292919765656557,0.00028076189840179515
64,0.00023522016849549432,0.00034867847,0.000223057561168011,0.000292698461856897,0.00028053543991497613
65,0.0002365696434834989,0.00034867847,0.00022440576337035443,0.00024569831421086477,0.0002335265979974913
66,0.00021013550605172073,0.00034867847,0.00019795028669890034,0.00014380545636832063,0.0001316028810406711
67,0.00024566218908783654,0.00034867847,0.0002334554461286565,0.00033804057837268753,0.0003258403996387589
68,0.0002048748219279175,0.00034867847,0.00019267268815049374,0.00048572907515373275,0.0004735162541953789
69,0.00019772542495039412,0.00031381063,0.00018550272563003342,0.00025680028537187056,0.0002445699108474933
70,0.00020315314821541132,0.00031381063,0.00019090994071105057,0.0001744031522835444,0.00016215685065986617
