2.363975513280031748e+00,-3.141948443651161327e+00,1.200961768084031064e+03
2.058269214332697050e+00,-2.972177535295446038e+00,1.200758582245159232e+03
1.773212764561766797e+00,-2.728951460123015593e+00,1.200510484122369917e+03
1.508662873209110966e+00,-2.562046366929956243e+00,1.200309127884828058e+03
1.263971939385534204e+00,-2.331772309541654487e+00,1.200069044777416593e+03
1.041215659082549871e+00,-2.123353296518290190e+00,1.199842374863767418e+03
8.400758281356167645e-01,-1.899443322420067304e+00,1.199606276249622852e+03
6.609678253537606407e-01,-1.682716733217194838e+00,1.199374615295722151e+03
5.047615256911706094e-01,-1.441409260034509199e+00,1.199127975722698011e+03
3.723133108026024374e-01,-1.207555037736839587e+00,1.198885941192717837e+03
2.653883054858839352e-01,-9.309450685977718187e-01,1.198617835044585718e+03
1.792476817971846992e-01,-7.918674051761346311e-01,1.198433793743010483e+03
1.842509322462139165e+00,-2.827145701646817777e+00,1.226688782788623030e+03
1.309905886945799125e+00,-2.490373998880413442e+00,1.226275472286325794e+03
8.583708503819176272e-01,-2.069254475832008389e+00,1.225809601464050047e+03
6.660674080229325167e-01,-1.776814371347430033e+00,1.225525586364396304e+03
4.979332080459973886e-01,-1.585869628190980318e+00,1.225305021151883238e+03
3.501402685022791950e-01,-1.369989162683480144e+00,1.225068925712804685e+03
2.271527960873093721e-01,-1.089760285615913871e+00,1.224792705143039711e+03
1.298933026171192606e-01,-8.554295837879140052e-01,1.224545193005086048e+03
2.234519484038257175e+00,-3.056018996238873964e+00,1.207066690435728333e+03
1.937556319231873436e+00,-2.883244299888775952e+00,1.206860624041036090e+03
1.662683426136861042e+00,-2.614213562011904912e+00,1.206595395614153176e+03
1.415000190729957641e+00,-2.339451146125969494e+00,1.206326701377294739e+03
1.190155647988147658e+00,-2.157439708709878889e+00,1.206115083124376270e+03
9.871882104824064585e-01,-1.901909041404882927e+00,1.205858315747506595e+03
8.049404144237367609e-01,-1.743046879768531232e+00,1.205661004948817435e+03
6.384046208808670242e-01,-1.587668991089035142e+00,1.205465867192747282e+03
4.889484453151343724e-01,-1.401454520225697831e+00,1.205251818033788595e+03
3.591463673064660411e-01,-1.194587039947683671e+00,1.205025122120637207e+03
2.515844607302854530e-01,-9.566510915757803213e-01,1.204779390886156079e+03
1.655277585932806161e-01,-7.644829511644143372e-01,1.204561808389278895e+03
9.788471459836137201e-02,-5.883779287339980790e-01,1.204354125341672216e+03
1.949471715686350137e+00,-3.104576897621199372e+00,1.200073421472687869e+03
1.651397726533422317e+00,-2.856902885437043516e+00,1.199822744864936567e+03
1.377385776040569443e+00,-2.623336124420205806e+00,1.199580745864717301e+03
1.129331392047439930e+00,-2.337751555442878271e+00,1.199306998443797511e+03
7.171725845313218217e-01,-1.839254093170232363e+00,1.198804093404957030e+03
5.478286898112241232e-01,-1.547623801231424956e+00,1.198526830064526393e+03
4.063858437514217270e-01,-1.281233119964642064e+00,1.198265045505991338e+03
2.867465913271863842e-01,-1.111551928520258858e+00,1.198062370695719665e+03
1.902772879576572485e-01,-8.178341388702905501e-01,1.197784004511167950e+03
3.865375083984693205e+00,-3.995030122995483879e+00,1.257841573764944087e+03
2.407676095070160116e+00,-3.167964750528446061e+00,1.256895749767840698e+03
2.099812529982821196e+00,-2.989306551218137376e+00,1.256677408280795134e+03
1.814387880863443714e+00,-2.719186431169624996e+00,1.256400534136121905e+03
1.549125640095971868e+00,-2.586058384180193848e+00,1.256211429968916491e+03
1.304710374178187360e+00,-2.302246934175623760e+00,1.255925894311723141e+03
1.083219616116764872e+00,-2.127568227052821115e+00,1.255710268234394562e+03
8.841973188536024209e-01,-1.852877718210347524e+00,1.255430682704929723e+03
7.108511909858867828e-01,-1.614044839143874199e+00,1.255174098858321486e+03
5.588039246217839651e-01,-1.426900488138329148e+00,1.254950628468317746e+03
4.256538125888853497e-01,-1.236101752519745300e+00,1.254724860837554161e+03
3.145914462224874697e-01,-9.851455748082645902e-01,1.254460669848218004e+03
2.223329219238008303e-01,-8.600249111653750500e-01,1.254276976655872886e+03
1.434130635873397952e-01,-7.183722555638762941e-01,1.254082743292098712e+03
8.055919617571562219e-02,-5.387050926686848262e-01,1.253864245674438962e+03
2.113199819928180734e+00,-3.021214580535717786e+00,1.230694403588854129e+03
1.821018996840507498e+00,-2.822401881217786901e+00,1.230467973716032247e+03
1.055841048365704582e+00,-2.288241314887855538e+00,1.229827970445154051e+03
8.365955740271913132e-01,-2.096668171882487552e+00,1.229606237084896520e+03
6.394801276980972560e-01,-1.845640754699577002e+00,1.229347290346213640e+03
4.681230312644922842e-01,-1.581501173972989838e+00,1.229080184118214902e+03
3.226284354984254032e-01,-1.328390741348156379e+00,1.228820043554110725e+03
2.043888217269942686e-01,-1.036401534080384934e+00,1.228535613285946738e+03
1.120451873600160908e-01,-8.104711532591539758e-01,1.228292603708409615e+03
4.581199467776726764e-02,-5.141927003859532164e-01,1.228005610907045593e+03
9.365023976560714336e-03,-2.147467136382349151e-01,1.227716703096695028e+03
2.128300452527214226e+00,-3.251091951131990232e+00,1.218076414668937787e+03
1.812620095905453033e+00,-3.062515181303193224e+00,1.217858659980987113e+03
1.517904492911467784e+00,-2.831796878576445575e+00,1.217614790957347623e+03
1.244551543888205547e+00,-2.635262101888824482e+00,1.217392180968801767e+03
9.981873074141653923e-01,-2.292022627592275263e+00,1.217078603609749962e+03
7.792774054375651849e-01,-2.086175411939813706e+00,1.216850315963970615e+03
5.841888251868139204e-01,-1.815596193075384557e+00,1.216581931954648326e+03
4.177997478810070997e-01,-1.512185353040914393e+00,1.216293253827158196e+03
2.791781070795472108e-01,-1.260247462988102418e+00,1.216036546424709741e+03
1.673899933662636730e-01,-9.755148112775955394e-01,1.215759571648171459e+03
8.511615901852068178e-02,-6.699618756773263462e-01,1.215469761610765090e+03
2.662655866743450339e+00,-3.309183132648416237e+00,1.210403994557584156e+03
2.342351356150023545e+00,-3.096907079219754166e+00,1.210172993515083590e+03
2.044527224899679752e+00,-2.859575545787773176e+00,1.209926585245025763e+03
1.768115112186812388e+00,-2.668666708469344950e+00,1.209708849604707893e+03
1.507954738737482314e+00,-2.534540760517069558e+00,1.209526157941539168e+03
1.268302002550499408e+00,-2.258513963222444687e+00,1.209256031774879375e+03
1.050429885984804468e+00,-2.098928368091527386e+00,1.209057719206653019e+03
8.547573262466595656e-01,-1.814522826671557842e+00,1.208782535515938889e+03
6.855680018677112741e-01,-1.569263660907725733e+00,1.208531527177189446e+03
5.352381354584002660e-01,-1.437333667278259952e+00,1.208350365748385457e+03
3.990063351406376579e-01,-1.287302339076964453e+00,1.208158085005586599e+03
2.841153234257013938e-01,-1.010517895221667350e+00,1.207887797923042399e+03
1.925697368397160936e-01,-8.203938364982384934e-01,1.207670912245169575e+03
1.177644544853641562e-01,-6.757118105888161308e-01,1.207482031770630101e+03
2.431074304877589576e+00,-3.501857584714929139e+00,1.259927041376321768e+03
2.094349200426392610e+00,-3.232644504308728628e+00,1.259650033614711447e+03
1.504030019937822704e+00,-2.733908671140722113e+00,1.259121671969769068e+03
1.243873333035784068e+00,-2.469225066900318399e+00,1.258847747454194860e+03
6.240679952491025029e-01,-1.745883005857547188e+00,1.258071670396527225e+03
4.613043764222225507e-01,-1.509389370679925735e+00,1.257816046453354375e+03
3.261750003684095178e-01,-1.193198150396428403e+00,1.257509392642497005e+03
2.174347153294474977e-01,-9.816075503826831028e-01,1.257269840959779913e+03
6.592553406837690921e-02,-5.013535678387692762e-01,1.256754316123572153e+03
2.201200889855345721e+01,-9.792510086298035432e+00,1.263678585908771993e+03
1.989641529020857780e+00,-3.163465267419951044e+00,1.256192686734621020e+03
1.684465166625565002e+00,-2.940061980486057713e+00,1.255945824137844056e+03
1.403934142288734810e+00,-2.670558506250521713e+00,1.255669505850114547e+03
1.145541495379963193e+00,-2.497294431924962144e+00,1.255454828991421437e+03
9.082623741002174844e-01,-2.248287993669635387e+00,1.255191731642107015e+03
6.991618230910354725e-01,-1.933723026514193144e+00,1.254886757780948074e+03
5.203817257256492246e-01,-1.641878920793685692e+00,1.254596386736388922e+03
3.649384370417457779e-01,-1.466986852884448522e+00,1.254380852515911783e+03
2.341056629986459359e-01,-1.149668627977524338e+00,1.254074315834652452e+03
1.315475371450895437e-01,-9.014938890935449978e-01,1.253812039297382853e+03
5.786480277484767898e-02,-5.721607983114045393e-01,1.253497965436866934e+03
1.513863235418286442e-02,-2.823626101018603118e-01,1.253209222559064983e+03
1.406652238070833949e+00,-2.633857542276346386e+00,1.246542596499492220e+03
1.154347595274334282e+00,-2.412235313653921409e+00,1.246298761675210017e+03
9.286407729982204540e-01,-2.101901131868336936e+00,1.245998635369078556e+03
5.580138620733344768e-01,-1.631958085298542027e+00,1.245494277596858183e+03
4.087426558136115773e-01,-1.353466039896025430e+00,1.245214553978134290e+03
1.788173595069885435e-01,-9.628773987293175463e-01,1.244760857733654348e+03
5.698364240826272464e+00,-4.778123193979363137e+00,1.239775115823936403e+03
5.230785007775897277e+00,-4.573461467027756910e+00,1.239543319958725078e+03
4.784223264158810274e+00,-4.357773405313574600e+00,1.239304602577868309e+03
4.357661905587753459e+00,-4.173453766107642515e+00,1.239085741493225669e+03
3.953009403647034237e+00,-3.919596272707079443e+00,1.238823011509913840e+03
3.570924276412539733e+00,-3.722106271982273729e+00,1.238595921100879423e+03
3.208694245518275423e+00,-3.522494345903490309e+00,1.238367532995076544e+03
2.865616059602305921e+00,-3.339069372415629289e+00,1.238149401998210124e+03
2.540139639080572831e+00,-3.170459038019273201e+00,1.237940656811841563e+03
2.230125849546030548e+00,-3.029816752672304769e+00,1.237749590640718679e+03
1.936711945236752719e+00,-2.838461333513373486e+00,1.237526566379831365e+03
1.665421457589671528e+00,-2.587348419427972335e+00,1.237265897756932191e+03
1.419753225744754044e+00,-2.326016217470263658e+00,1.236998840986669848e+03
1.195982945264355779e+00,-2.149389392137618593e+00,1.236785236407817365e+03
9.933435806641750521e-01,-1.903397899866208443e+00,1.236527951648811040e+03
8.112542286524763169e-01,-1.738389140367604835e+00,1.236321749284625184e+03
6.472892150292213209e-01,-1.540911132097331437e+00,1.236095124944984491e+03
5.004632666716264389e-01,-1.395607835054480717e+00,1.235901407546314658e+03
3.745594415077794781e-01,-1.122468668222516675e+00,1.235627209495588659e+03
2.752177014956040946e-01,-8.643661320210472843e-01,1.235362539972219793e+03
2.210717815459788849e+00,-3.088068336248266821e+00,1.197574653790912635e+03
1.911093551815599811e+00,-2.904416936635850544e+00,1.197363570020237148e+03
1.630928796828838623e+00,-2.698878163099160510e+00,1.197139168526111462e+03
1.375055597723589207e+00,-2.418585819005838466e+00,1.196869206675042960e+03
1.143272836507441159e+00,-2.217069405317181108e+00,1.196647351107063741e+03
9.314777120958738221e-01,-2.018833082914230026e+00,1.196427536866798391e+03
7.399361279617920895e-01,-1.811998599767571605e+00,1.196202520829095647e+03
5.692744275938743659e-01,-1.601235407590750670e+00,1.195975152286599041e+03
2.934062835585499185e-01,-1.132197421789036706e+00,1.195491594593734362e+03
1.940818849217435249e-01,-8.542905509470511971e-01,1.195223457485741619e+03
1.203849014651484778e-01,-6.196491181849157481e-01,1.194981731590164600e+03
6.659067899106121957e-02,-4.562353312967867836e-01,1.194783428723817451e+03
3.053853674590854439e+01,-1.137906633615507346e+01,1.222289212072590772e+03
2.940936141908438017e+01,-1.120444020032896759e+01,1.222079393728031391e+03
2.407827159703025544e+01,-1.021822198629390677e+01,1.220960465310759446e+03
2.306688653290525437e+01,-1.000947929620755694e+01,1.220729648025468123e+03
2.207529057204976652e+01,-9.822439920902381161e+00,1.220512375397357346e+03
2.110258952558284307e+01,-9.631581008434409341e+00,1.220292765825508013e+03
2.014819649517777833e+01,-9.456279599666707725e+00,1.220082870268718125e+03
1.740537599265821456e+01,-8.868175542354713059e+00,1.219414741365624877e+03
2.209725111129047459e+00,-3.361371457576871613e+00,1.213486383411406678e+03
1.887354195716134608e+00,-3.086046850681426701e+00,1.213215807003190093e+03
1.589170481564737392e+00,-2.877627432346463898e+00,1.212986653675299294e+03
1.311292802693583059e+00,-2.679926145076880761e+00,1.212764168763401585e+03
1.055349308850508594e+00,-2.438943731784966040e+00,1.212514976655353394e+03
8.289135283252789810e-01,-2.089771878719462350e+00,1.212198990310548879e+03
6.311220663806721420e-01,-1.866057360172388657e+00,1.211960580952311375e+03
4.585809606334398936e-01,-1.584764754772307827e+00,1.211686659031121053e+03
3.098163467666148474e-01,-1.390527522564046548e+00,1.211466551510855879e+03
2.090000178818913756e+00,-3.005478227138366876e+00,1.226891407217749929e+03
1.803058319096773721e+00,-2.733358967304059917e+00,1.226619845775400336e+03
1.541917150025601924e+00,-2.489464414119558988e+00,1.226365986421406660e+03
1.304140566592461248e+00,-2.266067254543137288e+00,1.226124989093234944e+03
1.084604407553936722e+00,-2.124655926227404290e+00,1.225935266047519235e+03
8.813308239033613711e-01,-1.940815746784041673e+00,1.225719065520510185e+03
7.008648920109863401e-01,-1.668502891063526672e+00,1.225447642640991035e+03
5.449469435265985595e-01,-1.449856078624587097e+00,1.225209792234388033e+03
4.084096550992654118e-01,-1.280889689922202646e+00,1.225003006288327697e+03
2.875385713628626494e-01,-1.136531984805935425e+00,1.224811617523466566e+03
1.838599300435964090e-01,-9.370408415793034518e-01,1.224585846534958819e+03
1.049520850233162522e-01,-6.411160588263155047e-01,1.224299940513574029e+03
5.247443199675143333e-02,-4.084370017050552581e-01,1.224053558381801622e+03
7.771246755145957419e-01,-1.812107956409229725e+00,1.215628313367583814e+03
6.082654011272614625e-01,-1.565077531337518035e+00,1.215374786250756870e+03
4.631010305904744162e-01,-1.338209879398117419e+00,1.215133799451652294e+03
3.427290451550170647e-01,-1.069229829311156399e+00,1.214866784237380671e+03
1.317951187791069900e+00,-2.411021035909598709e+00,1.227459812782607287e+03
8.700218042747646097e-01,-2.030671113729419996e+00,1.227018988709842233e+03
6.749368670599243947e-01,-1.871027630567498212e+00,1.226817726902472714e+03
5.038180872814490563e-01,-1.551347965002007667e+00,1.226516449694754556e+03
3.636006036417339105e-01,-1.253001707792221753e+00,1.226228579543143042e+03
2.459082028286318777e-01,-1.100846308469704660e+00,1.226032126599103094e+03
1.471012249605509192e-01,-8.752932488917432030e-01,1.225789847942607139e+03
7.339927524494943567e-02,-5.987457454203877205e-01,1.225515764311111752e+03
2.139474534396375915e+00,-3.053909397125211367e+00,1.200829982616008010e+03
1.844179236296890512e+00,-2.851996564865100225e+00,1.200607150292080860e+03
1.572342224721185788e+00,-2.584743666648845473e+00,1.200344383849488622e+03
1.321087216738934922e+00,-2.440356492996197613e+00,1.200156829602420430e+03
1.088673599366416056e+00,-2.207915854454013616e+00,1.199915451920574696e+03
8.756484943668860765e-01,-2.052586245536784482e+00,1.199721273608296997e+03
6.796923571865658431e-01,-1.866536498069749417e+00,1.199508345202990768e+03
5.089524000923610902e-01,-1.548262643814044548e+00,1.199214633789671780e+03
2.498471421043873264e-01,-1.028317260742128258e+00,1.198698663631213321e+03
8.054329693724479600e-02,-6.634425401687183976e-01,1.198277620046286529e+03
2.844172180106351727e-02,-3.785889625548807258e-01,1.198004616355240614e+03
3.794723157194174190e-03,-1.143510103225359731e-01,1.197744260045835517e+03
2.745661804676984730e+00,-3.364838540553849899e+00,1.227773276908451180e+03
2.420340077877971563e+00,-3.141595995425966237e+00,1.227532099765340945e+03
2.118550055027963896e+00,-2.894204461574349629e+00,1.227275864166352903e+03
1.840694296360968707e+00,-2.662910711765063887e+00,1.227029749521612757e+03
1.581248121262583961e+00,-2.526012790202875724e+00,1.226842708711926662e+03
1.335139945746467660e+00,-2.396150720119252675e+00,1.226660095288335242e+03
1.104860607386652482e+00,-2.209436047076950960e+00,1.226441970101205925e+03
8.949800515185405425e-01,-1.988175070285584489e+00,1.226202292917983868e+03
7.073891866218001701e-01,-1.763642227649492300e+00,1.225960618125278870e+03
3.914890563499290321e-01,-1.402730715274615569e+00,1.225532474300996228e+03
2.643088805686952814e-01,-1.140872800349986615e+00,1.225267621813165306e+03
1.652004325401627560e-01,-8.412961602209387824e-01,1.224979276571424634e+03
9.018909692883235463e-02,-6.589305520055982468e-01,1.224764165132649396e+03
2.211098110674397432e+00,-3.077899158000999780e+00,1.237258053638999172e+03
1.911261670588029649e+00,-2.918829643726403855e+00,1.237055474266551983e+03
1.633100428579826069e+00,-2.644395196437902218e+00,1.236780203669356069e+03
1.382708647249692779e+00,-2.363440430164382544e+00,1.236500885053158527e+03
1.158822135923857077e+00,-2.114289796352437634e+00,1.236241668915448599e+03
9.544447660431842895e-01,-1.973257601261195981e+00,1.236050619325622847e+03
7.651553904995818112e-01,-1.812529909610803180e+00,1.235847193170078071e+03
5.950600242600290191e-01,-1.589377415180261988e+00,1.235604486738413470e+03
3.145306706413811271e-01,-1.176889383792905530e+00,1.235140505510015828e+03
2.109245705589840036e-01,-8.952326178551104352e-01,1.234861115381071613e+03
1.300242352470850071e-01,-7.227740883827462604e-01,1.234650502975696782e+03
6.703992247433239460e-02,-5.369121670723241424e-01,1.234431493442291639e+03
2.303429337740936056e+00,-3.078567361831828553e+00,1.259985801352510180e+03
2.002473660708449010e+00,-2.940546178817912359e+00,1.259793015696501925e+03
1.722328450680728151e+00,-2.662358021736298319e+00,1.259510275830476758e+03
1.467682729960431365e+00,-2.430556392669840804e+00,1.259257371001720003e+03
1.232883009911506900e+00,-2.265438008308571227e+00,1.259047307964588072e+03
1.013186416626882247e+00,-2.128493857383887633e+00,1.258855356942893877e+03
8.078337907800087203e-01,-1.978558659553691923e+00,1.258655101178428140e+03
6.201927006253512564e-01,-1.774263143539600573e+00,1.258420010282015028e+03
4.578540778168816439e-01,-1.472509312629879830e+00,1.258122467110990328e+03
3.259718096264810905e-01,-1.165136051178162324e+00,1.257821391700923186e+03
2.207044720658105641e-01,-9.402107000352823984e-01,1.257573233439949718e+03
1.369348394879021658e-01,-7.351819515230321178e-01,1.257337874716580473e+03
7.455354094585794900e-02,-5.124440193178275704e-01,1.257091213378131897e+03
1.527251181303309613e+00,-2.593148082494864504e+00,1.223659503517501889e+03
1.042526726423500527e+00,-2.235106056928744866e+00,1.223233952337171331e+03
8.302181807148347747e-01,-2.011064857244603932e+00,1.222993169046232651e+03
6.373210439073911937e-01,-1.846877878904463088e+00,1.222789735910100717e+03
4.683226779091161918e-01,-1.533089441061151081e+00,1.222493118599853233e+03
3.255405279981741229e-01,-1.322553557157644555e+00,1.222260894463713385e+03
2.060065975772876201e-01,-1.068125051260127023e+00,1.222001376293831527e+03
2.165676825347102152e+00,-3.060348159074684826e+00,1.254552808772471280e+03
1.873457516136310952e+00,-2.784038025140640027e+00,1.254272445562199664e+03
1.601684128346596125e+00,-2.651429730653640071e+00,1.254083993923193020e+03
1.348997852506806483e+00,-2.402295786142230494e+00,1.253821102368938455e+03
1.118771245780176171e+00,-2.202236348390463672e+00,1.253589620916179229e+03
9.085477456476348523e-01,-2.002233654260527906e+00,1.253358218464576794e+03
7.164020958568962927e-01,-1.840679341554547044e+00,1.253151415908167564e+03
5.439494177725405777e-01,-1.608374220132745114e+00,1.252899466405718613e+03
3.927583602097187709e-01,-1.415446931123648167e+00,1.252672708759208945e+03
2.653073439028558744e-01,-1.133573395013737883e+00,1.252389214454517287e+03
1.617672172215335324e-01,-9.372291386126724300e-01,1.252160368424010130e+03
1.707142022846069196e+00,-2.762951445579586718e+00,1.248294186195147631e+03
1.443554162977054744e+00,-2.508805751800589512e+00,1.248029320380148874e+03
1.206862481830434541e+00,-2.225027871131957991e+00,1.247745665862593569e+03
9.977990365007796125e-01,-1.956241035461510291e+00,1.247471607304015606e+03
8.145965254286167134e-01,-1.707809185981841615e+00,1.247210548193358818e+03
6.557607531526822298e-01,-1.468906259536833403e+00,1.246955599853145486e+03
5.187913537004597009e-01,-1.270481729507530133e+00,1.246726424806731757e+03
4.005473220327380179e-01,-1.094398903846818261e+00,1.246511486083721366e+03
2.355391053855290906e+00,-3.173690813779816544e+00,1.237057532373836466e+03
2.046363802254111075e+00,-3.006854218244559451e+00,1.236850089435139580e+03
1.760222937762639273e+00,-2.715963071584699406e+00,1.236564492551405692e+03
1.499344755709062449e+00,-2.501600569486606140e+00,1.236327184139747942e+03
1.257765421569222442e+00,-2.329986113309835627e+00,1.236116853482947363e+03
1.035526076853154454e+00,-2.114800781011558328e+00,1.235879112663330488e+03
8.376878461240651053e-01,-1.841963833570474440e+00,1.235605109886508217e+03
6.672654512523608084e-01,-1.566484063863760268e+00,1.235329503864589242e+03
5.193503376840549191e-01,-1.391818207502371729e+00,1.235117422006980178e+03
3.921997538207877554e-01,-1.151193469762791688e+00,1.234863861993093224e+03
2.895796212552869120e-01,-9.012091815471447998e-01,1.234604464437070419e+03
2.448180903789341833e+00,-3.532591247558596326e+00,1.255370508628849166e+03
2.107921481725491208e+00,-3.272597193717940556e+00,1.255100400100005572e+03
1.792546991702822945e+00,-3.034892606735205334e+00,1.254844605378467350e+03
1.501692677137193233e+00,-2.782193684577941806e+00,1.254579274793876039e+03
1.238221358653841753e+00,-2.487232685089112660e+00,1.254286982303852710e+03
9.997894567220881878e-01,-2.281405353546152259e+00,1.254051728173031051e+03
7.842845350473472976e-01,-2.028693079948420852e+00,1.253786556716257110e+03
5.943646305768984783e-01,-1.769705009460436518e+00,1.253517431729199416e+03
4.319135314195772235e-01,-1.479316973686226833e+00,1.253228307606705584e+03
2.998324316709594095e-01,-1.162305021286004214e+00,1.252922248180617316e+03
1.967803961008098845e-01,-8.987356901168596091e-01,1.252650383771346696e+03
1.164582449167271549e-01,-7.077073335647275920e-01,1.252424883367337998e+03
5.600738465481260725e-02,-5.013098716735513438e-01,1.252189614633170777e+03
1.597371995144889270e-02,-2.993634223937806649e-01,1.251957230295916588e+03
3.272593535486377547e+00,-3.645178204774815800e+00,1.228180683131378373e+03
2.917578459683567438e+00,-3.455123311281157683e+00,1.227960196987680547e+03
2.581380509439607174e+00,-3.268835693597738512e+00,1.227742107842909036e+03
2.261704867783680406e+00,-3.124677139520585012e+00,1.227550415732705915e+03
1.960955058637748438e+00,-2.890319043397834964e+00,1.227302329177119645e+03
1.679236180487779562e+00,-2.744058519601758839e+00,1.227109391080948626e+03
1.174909131232418913e+00,-2.266326695680555225e+00,1.226607809909426805e+03
5.810246971284668271e-01,-1.679433089494634102e+00,1.225936864235349503e+03
4.247368368541628025e-01,-1.446324115991526993e+00,1.225689884109328887e+03
2.915988913213612976e-01,-1.216434794664299934e+00,1.225444964712373803e+03
1.817554864322586394e-01,-9.804333031176589719e-01,1.225196277418975342e+03
2.105947014095494563e+00,-2.996075785160092764e+00,1.254391089998375492e+03
1.540725805761525846e+00,-2.592750442028089797e+00,1.253925910147524064e+03
1.295942690374556339e+00,-2.302911865711253281e+00,1.253637042888829228e+03
1.078166582586467692e+00,-2.052610290050549402e+00,1.253373499114934702e+03
8.857269549390753838e-01,-1.796182262897551452e+00,1.253106097854489690e+03
7.150528419038726380e-01,-1.617299997806614931e+00,1.252888271603432713e+03
5.659903180620136087e-01,-1.363950479030685337e+00,1.252622939311360597e+03
4.382924640199500343e-01,-1.190006601810527531e+00,1.252408349374079080e+03
3.252611494085013155e-01,-1.070619690418308290e+00,1.252228616206193692e+03
2.304730653783384209e-01,-8.251419901848341398e-01,1.251968446680512216e+03
2.754944595991490885e+00,-3.382597368955548411e+00,1.247293549469947948e+03
2.427233646212923812e+00,-3.171621626615449330e+00,1.247056334683521072e+03
2.119717176853518126e+00,-2.978707760572348651e+00,1.246830643097878919e+03
1.835046763717043783e+00,-2.714700502157126216e+00,1.246559822243219514e+03
1.576889309584019072e+00,-2.448448580503379102e+00,1.246287634360940501e+03
1.339417851268179582e+00,-2.300980585813438672e+00,1.246090944802760532e+03
1.121225790678407996e+00,-2.062860625982212870e+00,1.245836722501479926e+03
9.266975894559976723e-01,-1.827703398466042017e+00,1.245584432966557188e+03
7.508263668407535452e-01,-1.689721053838654230e+00,1.245393875448161452e+03
5.889748814691805334e-01,-1.547308653592996075e+00,1.245200535516054288e+03
4.441425773491144424e-01,-1.349337428808131678e+00,1.244971970677193667e+03
3.200904372324313574e-01,-1.131705373525539571e+00,1.244730974508122245e+03
2.188548538078700367e-01,-8.930062949656607518e-01,1.244476662330098407e+03
1.384811189760674077e-01,-7.144684016703701790e-01,1.244260554530208992e+03
7.026084207297329520e+00,-5.252941715717533988e+00,1.224921555854735516e+03
6.511669660807576143e+00,-5.035349214077206703e+00,1.224684465653293501e+03
6.020483092070503695e+00,-4.788382160663803511e+00,1.224429089379854531e+03
5.548086870909630264e+00,-4.659542262554378311e+00,1.224247473028518698e+03
5.088439792395510253e+00,-4.533399307728023686e+00,1.224067566215225725e+03
4.648194466830158689e+00,-4.271507203579163914e+00,1.223803009000106158e+03
4.233646746874686784e+00,-4.019447195530148953e+00,1.223544640450694260e+03
3.840637583733435001e+00,-3.840736067295294820e+00,1.223332059548299867e+03
3.467575297356498165e+00,-3.620509660244231931e+00,1.223093635051299316e+03
3.114329891205644518e+00,-3.444398462772607861e+00,1.222882753010188480e+03
2.778779802323158687e+00,-3.266603314876785902e+00,1.222670857930009333e+03
2.463605893851077422e+00,-3.036874854564898474e+00,1.222426642022593796e+03
2.169194965363291150e+00,-2.851343715191128947e+00,1.222210006895008519e+03
1.892595025301700318e+00,-2.680655086040740098e+00,1.222002654556988546e+03
1.634487534762127270e+00,-2.481494724750763936e+00,1.221777607336178562e+03
1.398018116951645462e+00,-2.247893631458509844e+00,1.221531158757333969e+03
1.183005856276198253e+00,-2.052351582050556900e+00,1.221308450706651001e+03
9.846900177008284238e-01,-1.913965189457185190e+00,1.221121355616086248e+03
8.063110184675665870e-01,-1.653614795208236066e+00,1.220858394494383219e+03
6.503050673013924809e-01,-1.466504228115346420e+00,1.220641054665049523e+03
5.094003057485487762e-01,-1.351591002941390673e+00,1.220468663295022907e+03
3.843678772454893200e-01,-1.149057567119862622e+00,1.220241800744027387e+03
2.778716731076549262e-01,-9.808665156366985771e-01,1.220036335393531772e+03
1.908765828614371607e-01,-7.590352892878455826e-01,1.219797555477192191e+03
4.676452738345526328e+00,-4.355867761373403368e+00,1.206071150541469251e+03
4.253628109396377255e+00,-4.100624817609673123e+00,1.205814569336697787e+03
3.854657618106287487e+00,-3.878785008191943273e+00,1.205578567579654646e+03
3.473214802444862137e+00,-3.750071305036422942e+00,1.205399824817759281e+03
3.110875472129288610e+00,-3.496715301275135079e+00,1.205144545482010471e+03
2.767522039116363075e+00,-3.370353358983884995e+00,1.204967311403261874e+03
2.127017025650492776e+00,-2.964211910962935459e+00,1.204518731043658590e+03
1.841120347083564424e+00,-2.753721660375465952e+00,1.204289949324669578e+03
1.576271527708529518e+00,-2.543254727125030534e+00,1.204061225370816146e+03
1.329020693601152159e+00,-2.401761955022679640e+00,1.203874866358014515e+03
1.102048175037893207e+00,-2.137688416242465195e+00,1.203613335152679838e+03
8.969772580275997553e-01,-1.963729923963412283e+00,1.203407132212111264e+03
5.358980348716418929e-01,-1.639163154363489028e+00,1.203009149501074717e+03
2.616879740367952234e-01,-1.173562616109732115e+00,1.202524854646008180e+03
1.539348086725425280e-01,-9.815006911753469954e-01,1.202307744406863776e+03
1.515470047592323954e+00,-2.695512437820348772e+00,1.229823356185411740e+03
1.261920275091339638e+00,-2.375483012199314903e+00,1.229521121677091287e+03
8.235905176393456539e-01,-2.001839208602818498e+00,1.229083758339886344e+03
6.324316626779592498e-01,-1.821337890624913580e+00,1.228869093795297431e+03
4.603139287226095666e-01,-1.621016788482610327e+00,1.228642055152126431e+03
3.104720300428824853e-01,-1.375821185111944622e+00,1.228386962708413193e+03
1.881711822741065909e-01,-1.070195770263623336e+00,1.228094097208184621e+03
1.150770357553161816e+00,-2.237139350175678221e+00,1.235834613816084584e+03
9.405985704104328216e-01,-1.966296392679044436e+00,1.235561876616113295e+03
7.536960169713022850e-01,-1.771754676103414194e+00,1.235337240338885749e+03
5.844948080222455156e-01,-1.612269502878025618e+00,1.235134713799242490e+03
4.366240677278014903e-01,-1.345145303010769844e+00,1.234864471611857653e+03
3.117836120765391517e-01,-1.151663810014560640e+00,1.234640629292549193e+03
2.058715304773226229e-01,-9.665778219698267781e-01,1.234422109705293451e+03
1.234044137638129479e-01,-6.827645123003251992e-01,1.234141525554603277e+03
3.472625109553227229e+00,-3.784244227409447880e+00,1.244326463029427032e+03
2.751287077069118236e+00,-3.366941308975288205e+00,1.243856154120286419e+03
1.521647970080160173e+00,-2.720903801918078457e+00,1.243035532237514190e+03
1.262972217201969283e+00,-2.452611255645803734e+00,1.242762821322926357e+03
1.025965756773742132e+00,-2.287517952919069675e+00,1.242555525710909251e+03
8.071103590724593158e-01,-2.089590001106313100e+00,1.242327473779667343e+03
6.146340256927051993e-01,-1.759936666488692181e+00,1.242016074037455155e+03
4.499664598701003659e-01,-1.533414649963425136e+00,1.241770023493903409e+03
3.123027890918200211e-01,-1.219858765602155115e+00,1.241468949208583126e+03
2.055964618918861286e-01,-9.142677783966712823e-01,1.241172986551678832e+03
1.247522574660675093e-01,-7.026163101196926108e-01,1.240936508407556403e+03
1.075338807402564933e+00,-2.260124236345443904e+00,1.259046397818935247e+03
8.635960826262965018e-01,-1.974730259180243142e+00,1.258759202459972357e+03
6.808274880036618848e-01,-1.680641633272336177e+00,1.258466495675607121e+03
5.245658513888518115e-01,-1.444591099023993852e+00,1.258211075662113672e+03
3.874778226002679737e-01,-1.297169476747688011e+00,1.258012534077947294e+03
1.659116712197069021e-01,-9.213774979116551300e-01,1.257563658901464350e+03
2.613242540063009045e+00,-3.291481918096501147e+00,1.234077032745559336e+03
2.292378007473094392e+00,-3.125808733701661346e+00,1.233870821263327571e+03
1.990166165532218923e+00,-2.918428105115845828e+00,1.233638419733754972e+03
1.711350997985940481e+00,-2.657875245809499631e+00,1.233372635863745700e+03
1.452746805848232459e+00,-2.514208596944756291e+00,1.233180373808509103e+03
9.859253808871666358e-01,-2.106118553876838995e+00,1.232720066100460144e+03
7.883689466134468082e-01,-1.845010131597475400e+00,1.232454131096888659e+03
6.156001159564513658e-01,-1.610366481542552020e+00,1.232204874167933667e+03
4.641942670957279748e-01,-1.417750495672209787e+00,1.231982057433646105e+03
3.343187496082096755e-01,-1.179759854078288761e+00,1.231730794744549712e+03
2.274460998193593986e-01,-9.576931416988467838e-01,1.231489578244283166e+03
1.462917456046882447e-01,-6.653939425945293307e-01,1.231204335540087413e+03
6.790371904074878451e+00,-5.188687103986772797e+00,1.222705289156101571e+03
6.280991497337526042e+00,-4.998921030759834849e+00,1.222485965926547806e+03
5.793777959048512116e+00,-4.745349735021647142e+00,1.222226933973329778e+03
5.329440231621012991e+00,-4.541404813528112427e+00,1.221998865463850734e+03
4.887222225367737316e+00,-4.302955311536825533e+00,1.221749353105574983e+03
4.465432254373720156e+00,-4.132844108343153522e+00,1.221542438423150315e+03
4.061025899350340751e+00,-3.955282992124590891e+00,1.221330921261448111e+03
3.673934446870992687e+00,-3.786546057462733206e+00,1.221124932775041316e+03
3.303981011807632040e+00,-3.612522643804593425e+00,1.220915689356491157e+03
2.953368580639049501e+00,-3.399725979566603495e+00,1.220682358296252687e+03
2.624170592724960116e+00,-3.184233778715162000e+00,1.220447395080533170e+03
2.312019957601700426e+00,-3.058778923749950529e+00,1.220268474651382348e+03
2.012701767384707185e+00,-2.927584880590478278e+00,1.220086011497673098e+03
1.731016806661775487e+00,-2.706114333868062438e+00,1.219847446123090322e+03
1.467791917025714765e+00,-2.558383458852793613e+00,1.219654765939951403e+03
7.966206601258943865e-01,-1.864194315671974911e+00,1.218920962809445427e+03
6.198597428199397186e-01,-1.671024030447056719e+00,1.218700203868379049e+03
4.676564851399958589e-01,-1.373041123151830689e+00,1.218414393865079774e+03
3.392451700564814154e-01,-1.195185178518338498e+00,1.218203235279349428e+03
2.337255004044846707e-01,-9.152082145214291975e-01,1.217928719115786180e+03
1.540303382274006150e-01,-6.786950290203441760e-01,1.217681239555152160e+03
1.454218470751809100e+00,-2.640436202287804068e+00,1.222708929609302459e+03
9.767198702688557610e-01,-2.167778497934486737e+00,1.222212308003912312e+03
7.731177380676468314e-01,-1.904264146089699183e+00,1.221947141405134289e+03
5.963564833994069447e-01,-1.630960947275324813e+00,1.221675937133136358e+03
4.410888436431859572e-01,-1.474391847849053194e+00,1.221477465737169268e+03
3.063404402131867377e-01,-1.220576220750973606e+00,1.221218495384039215e+03
1.947243955726348785e-01,-1.011744672060189254e+00,1.220987574011765446e+03
1.041954371327932782e-01,-7.988344967367110305e-01,1.220754158582242781e+03
6.966907867792867748e+00,-5.285548853874133535e+00,1.204649555678055094e+03
4.993017944697158761e+00,-4.488853716850187858e+00,1.203762362158715632e+03
2.290935344103632865e+00,-3.162564301490685459e+00,1.202252968296716062e+03
1.432248516682473216e+00,-2.498485517501727315e+00,1.201548074675019507e+03
1.197061852816422522e+00,-2.205247759818903308e+00,1.201269192497271206e+03
9.850157159603659673e-01,-2.035674977302431632e+00,1.201066075938848826e+03
7.907652753628491293e-01,-1.849333834648018371e+00,1.200852730504831698e+03
6.150512367523939261e-01,-1.664946937560912055e+00,1.200640618846786538e+03
4.614364570416348288e-01,-1.407348656654231700e+00,1.200383751914580444e+03
3.281010240353561813e-01,-1.259360003471242662e+00,1.200193988423003020e+03
2.117862898148662465e-01,-1.066934680938591784e+00,1.199977076753485562e+03
1.167466610707596358e-01,-8.338578939436741555e-01,1.199735346227812670e+03
2.096238381565707076e+00,-3.042809730768084364e+00,1.246815549354650102e+03
1.806666524709400257e+00,-2.748627406358628900e+00,1.246525560382361164e+03
1.540250417889296841e+00,-2.579694730043317730e+00,1.246315198250311596e+03
1.294804494680112938e+00,-2.329223734140299484e+00,1.246053086103794158e+03
1.073203518093772901e+00,-2.102795797586335613e+00,1.245806295547852869e+03
8.700415399682052131e-01,-1.960443764924892918e+00,1.245612929914471806e+03
6.864120540034557294e-01,-1.712145954370409839e+00,1.245352344849221709e+03
5.246899977338158605e-01,-1.522295171022322702e+00,1.245128905556376367e+03
3.817291483294867338e-01,-1.336921817064188112e+00,1.244908347296310694e+03
2.588671317708535757e-01,-1.120318514108568975e+00,1.244668016072060482e+03
1.606476423156367184e-01,-8.440712749957062222e-01,1.244389901772012081e+03
8.989969521882974768e-02,-5.708876669406294235e-01,1.244113792270616614e+03
4.052154287994230941e+00,-4.087709146738034427e+00,1.236122354810742081e+03
3.275981478393441559e+00,-3.650364953279503499e+00,1.235642524922463963e+03
2.923210792839875616e+00,-3.405048757791516945e+00,1.235385903092244916e+03
2.589513442218644990e+00,-3.268898254632944589e+00,1.235198059073233253e+03
2.275457635224187314e+00,-3.012217885255791483e+00,1.234934376634172850e+03
1.983300653398361257e+00,-2.830921751260735419e+00,1.234718190062030999e+03
1.711663617194042031e+00,-2.601818972825996390e+00,1.234471961490199647e+03
1.462109790742743831e+00,-2.389257556200022226e+00,1.234236187661482518e+03
1.236425901949743000e+00,-2.124420219659788334e+00,1.233967580340896802e+03
1.031398768127304688e+00,-1.976122456789000781e+00,1.233772313349515116e+03
8.440328064564234234e-01,-1.771196776628469749e+00,1.233541473847408042e+03
6.777968558672591293e-01,-1.553522235155099684e+00,1.233302663639823095e+03
5.325285997990217846e-01,-1.351842886209469796e+00,1.233073952253264224e+03
4.083127531412698019e-01,-1.132474046945552093e+00,1.232834167938016208e+03
3.028620615604964983e-01,-9.765397846698518070e-01,1.232634282631394626e+03
6.019674369396619262e+00,-4.938049250841030968e+00,1.237088480486172330e+03
1.387819836439698307e+00,-2.593210130929854085e+00,1.234385707306267022e+03
1.139564021529788640e+00,-2.371906167268674981e+00,1.234144450661783594e+03
9.142692914625435430e-01,-2.133988434076231400e+00,1.233892792814420091e+03
7.112020918747344878e-01,-1.927355557680057618e+00,1.233660857323001892e+03
5.291378083845516000e-01,-1.713930112123405625e+00,1.233424695214768462e+03
3.681839546581638367e-01,-1.505146962404154909e+00,1.233191496178833177e+03
2.405016218723730503e+00,-3.198789662122623945e+00,1.241330254957872285e+03
1.797752372326367087e+00,-2.829783672094253522e+00,1.240891624116950197e+03
1.527143298091411916e+00,-2.582397812604810827e+00,1.240632603427253571e+03
1.280378465952403566e+00,-2.352898830175304212e+00,1.240384944934121677e+03
1.058743183316718017e+00,-2.079806822538271760e+00,1.240109781962336456e+03
8.597301307339844101e-01,-1.900454229116332883e+00,1.239893917633627780e+03
6.788253113647036985e-01,-1.717642158269801600e+00,1.239675905021988228e+03
5.198249664922319768e-01,-1.462364739179521811e+00,1.239412152935547965e+03
3.833542463203156170e-01,-1.267049664258871999e+00,1.239186328190665563e+03
2.672145822663973824e-01,-1.055743616819277086e+00,1.238950446695575920e+03
1.760095617194956386e-01,-7.683567941187798844e-01,1.238666577210886544e+03
2.122427697180667483e+00,-3.051729273796163433e+00,1.241133532921060578e+03
1.826762021778959300e+00,-2.861584234237744884e+00,1.240910664445944121e+03
1.289697555302511400e+00,-2.481494808197099555e+00,1.240465174396565089e+03
8.414247739304147045e-01,-2.053873586654729966e+00,1.239989803668693412e+03
6.458007144917050635e-01,-1.858607602119515256e+00,1.239763904712558769e+03
4.751370251167784109e-01,-1.554666185379105725e+00,1.239469390637441848e+03
3.356743645656983799e-01,-1.234587025642469360e+00,1.239164754147403983e+03
2.263012969482752768e-01,-9.528743267060089117e-01,1.238884418406652458e+03
1.402978074539434072e-01,-7.671954631806172653e-01,1.238664773415174068e+03
7.631366014368040629e-02,-5.124874830246799462e-01,1.238401595870448546e+03
3.377096891290112812e-02,-3.383663415909790584e-01,1.238189330361891962e+03
2.350758818804793648e+01,-1.008416445255289062e+01,1.264286482344481556e+03
2.250780220686967326e+01,-9.911555171012977894e+00,1.264070754153696043e+03
2.152418162524274692e+01,-9.760856461525060368e+00,1.263869176899942886e+03
2.055936494886461219e+01,-9.535477066040167315e+00,1.263619533037287965e+03
1.961408677994792171e+01,-9.370086312294139574e+00,1.263408566944576705e+03
1.868536916911185841e+01,-9.204265904426703671e+00,1.263197359436123406e+03
1.777599118887957275e+01,-8.983293700218320410e+00,1.262950685220649575e+03
1.688877654611639301e+01,-8.760999155044666864e+00,1.262703208128845972e+03
6.842876011724888130e+00,-5.782041764259481020e+00,1.259329087565974987e+03
5.739537987108615624e+00,-5.296024250984332937e+00,1.258809020518427587e+03
5.221469188328139666e+00,-5.065351724624766128e+00,1.258556980776541423e+03
1.472001929874629633e+00,-2.709786367416511688e+00,1.256008091119176243e+03
9.890776294423919701e-01,-2.193329167366152799e+00,1.255469917245156466e+03
7.806774300290765245e-01,-1.974674820900085059e+00,1.255226234895680136e+03
5.953065735055663721e-01,-1.732742309570456385e+00,1.254967710199033718e+03
4.330979126645683741e-01,-1.511430907249601052e+00,1.254722426121325498e+03
2.967172342492573889e-01,-1.216182661056675052e+00,1.254429916617428262e+03
1.894172972394290166e-01,-9.298160791398618619e-01,1.254143152607419097e+03
1.083556061936489234e-01,-6.914177417756520727e-01,1.253887109614837300e+03
4.739424049387072624e-02,-5.278095722199998008e-01,1.253678907403189214e+03
2.029054934381679498e+00,-2.913188290595936092e+00,1.214538494772740478e+03
1.747485492824760067e+00,-2.718200540542533350e+00,1.214317404678202138e+03
1.489031364320942963e+00,-2.450882029533290041e+00,1.214051596988502752e+03
1.254679960607711475e+00,-2.236146044731029736e+00,1.213818377946286091e+03
1.039791820644592191e+00,-2.061616754531766738e+00,1.213610073601627846e+03
8.439103955023027348e-01,-1.856011748313798559e+00,1.213382586338889951e+03
6.660759669534942473e-01,-1.700676822662242627e+00,1.213186225396272903e+03
5.042370909445303973e-01,-1.536100697517297720e+00,1.212984182952691299e+03
3.607076746218288998e-01,-1.334487628936665615e+00,1.212759280522516519e+03
2.427111357443501594e-01,-1.025443148612868782e+00,1.212468028013762705e+03
1.535681921236788372e-01,-7.574157238005508885e-01,1.212202187158315155e+03
8.576985180310514600e-02,-5.985510826109827764e-01,1.212003836806071831e+03
1.995488136405732860e+00,-3.166539931297314148e+00,1.258530982779484020e+03
1.692428933973094241e+00,-2.894644117355353430e+00,1.258252561487113098e+03
1.413751642102966555e+00,-2.678901720046996004e+00,1.258010206154837761e+03
1.156551943416366246e+00,-2.465092253684995960e+00,1.257769136641003342e+03
9.266897433946353901e-01,-2.132151746749896049e+00,1.257451759547226857e+03
7.244595950791958838e-01,-1.912451219558725324e+00,1.257207022162389194e+03
5.427210229585240908e-01,-1.722320222854619054e+00,1.256981276389946288e+03
3.797508174130914127e-01,-1.537083888053890623e+00,1.256758706420026101e+03
2.431693142602472102e-01,-1.194546175003056376e+00,1.256435438370510383e+03
1.400106817433850459e-01,-8.686264753341693678e-01,1.256122892706204311e+03
6.577855181990384992e+00,-5.141341012716373449e+00,1.253310811529883267e+03
1.737188446818075382e+00,-2.776183789968590165e+00,1.250559645415824207e+03
1.473164684472763497e+00,-2.504291456937902893e+00,1.250282989797595746e+03
1.235533088741972874e+00,-2.248340457677956206e+00,1.250016551803015773e+03
1.018155082164469372e+00,-2.099219673872108949e+00,1.249818220889553004e+03
8.201219788176290493e-01,-1.861442393064608902e+00,1.249563456403931468e+03
6.458058842999107041e-01,-1.624879497289768215e+00,1.249309517114834762e+03
4.928355160338031005e-01,-1.434527868032578146e+00,1.249085048961688017e+03
3.632928785664082394e-01,-1.156324881315358377e+00,1.248804702870496840e+03
2.583369436842261613e-01,-9.427938163281636141e-01,1.248565574534635061e+03
1.739313814026057226e-01,-7.453174293042367227e-01,1.248336706865202586e+03
2.031574799717044577e+00,-2.943454688787393803e+00,1.242724353794884109e+03
1.746367634833454474e+00,-2.760688608884755979e+00,1.242505872640516145e+03
1.481089251936075213e+00,-2.544879049062667153e+00,1.242266507786401235e+03
8.089004281169234201e-01,-1.848259109258574062e+00,1.241517562179339166e+03
6.334907802945735078e-01,-1.659933847188897138e+00,1.241295776060487015e+03
3.377799496060950313e-01,-1.282127875089575042e+00,1.240851591905238138e+03
2.225754454738270438e-01,-1.021962207555689783e+00,1.240584498785329970e+03
1.303365108377120829e-01,-8.228164851664515611e-01,1.240356038740975691e+03
6.294397026364983994e-02,-5.250343263148378181e-01,1.240065276889557708e+03
2.209653824633323743e-02,-2.919143140315197948e-01,1.239815443449067516e+03
5.079997809822936361e+00,-4.548911935091109804e+00,1.231384050035603650e+03
4.636642126138583286e+00,-4.318201738596056494e+00,1.231137477712272130e+03
4.212862016852248814e+00,-4.157400447130290999e+00,1.230934813973965902e+03
3.418917745049323109e+00,-3.755526667833410492e+00,1.230479243023596155e+03
3.054712064559771623e+00,-3.528586941957553957e+00,1.230235216079362772e+03
2.713006431753949510e+00,-3.305525714159098793e+00,1.229993668998758039e+03
2.389704021509007070e+00,-3.160522490739912982e+00,1.229801095900708560e+03
2.082016778881849106e+00,-2.993222361803143272e+00,1.229594579300059877e+03
1.793506068284786759e+00,-2.776991850137787488e+00,1.229357437988850506e+03
1.268957305248055389e+00,-2.458451467752542641e+00,1.228954647970903579e+03
1.032754536564598036e+00,-2.265603905916287353e+00,1.228732273946875921e+03
6.334258660628653281e-01,-1.800839143991525670e+00,1.228238146945025392e+03
4.687715664460431753e-01,-1.492246848344852106e+00,1.227943460065836916e+03
3.295915934397978808e-01,-1.291352611780228532e+00,1.227716233806929495e+03
2.111193659856049620e-01,-1.078091937303602643e+00,1.227481312785724413e+03
