epoch,acc,loss,lr,val_acc,val_loss
0,0.909628170401379,0.2380956760737233,0.0005,0.949442119944212,0.11974342353641987
1,0.9536444225560207,0.11421521742638073,0.0005,0.9595536959553695,0.10072960987598785
2,0.9605392760403841,0.09864564765908872,0.0005,0.9630404463040446,0.08690813909748484
3,0.9674341295247476,0.08787372535254234,0.0005,0.9616457461645747,0.09128613327597392
4,0.9716202905688254,0.07959042461893992,0.0005,0.9693165969316597,0.0735064991457567
5,0.9743289830091111,0.07256475027317602,0.0005,0.9748953974895398,0.06633036931771448
6,0.9774070426003447,0.0667110654891016,0.0005,0.9728033472803347,0.06562144933281416
7,0.9791307559714356,0.06258789175521418,0.0005,0.9776847977684798,0.0568748739894838
8,0.9823319379463187,0.05825907470347904,0.0005,0.9759414225941423,0.05612179692548854
9,0.9812853976852992,0.056169510917401876,0.0005,0.9797768479776848,0.0502988884960674
10,0.9839325289337602,0.05164768395505569,0.0005,0.9755927475592747,0.05383981220720328
11,0.9842403348928835,0.050991945334143036,0.0005,0.99302649930265,0.05502981276120185
12,0.9839940901255848,0.04835621342136337,0.0005,0.9895397489539749,0.044632736279147274
13,0.9855946811130264,0.04692629057610381,0.0005,0.9888423988842399,0.04239771165722667
14,0.9869490273331691,0.04538793196248996,0.0005,0.9860529986052998,0.039680591146650006
15,0.9853484363457277,0.045872888731687884,0.0005,0.9902370990237099,0.03741075275946445
16,0.9859640482639744,0.04385452813908505,0.0005,0.9888423988842399,0.03625256379980547
17,0.9880571287860133,0.04203383392927037,0.0005,0.9909344490934449,0.035204722110904245
18,0.9875030780595913,0.04126328261506305,0.0005,0.9867503486750349,0.03917660392727313
19,0.9887958630879093,0.04070697005022188,0.0005,0.9916317991631799,0.034440648647199285
20,0.9880571287860133,0.03955377718881855,0.0005,0.9909344490934449,0.03329037437202458
21,0.9887958630879093,0.03921844629269039,0.0005,0.9825662482566249,0.0458005353408337
22,0.9890421078552081,0.038234346996872656,0.0005,0.99302649930265,0.03690465363041294
23,0.9895961585816302,0.037417762466985895,0.0005,0.99581589958159,0.031168064875385336
24,0.9902733316917015,0.03708464477318565,0.0005,0.9902370990237099,0.02920542420842782
25,0.9907042600344743,0.035835947447296575,0.0005,0.9937238493723849,0.030584814790714236
26,0.9896577197734548,0.03697364889791639,0.0005,0.9944211994421199,0.02780594848449676
27,0.990765821226299,0.035421974390765346,0.0005,0.9895397489539749,0.029923398743904452
28,0.991504555528195,0.03319375210172641,0.0005,0.99302649930265,0.026139274247333595
29,0.990765821226299,0.03318036964431045,0.0005,0.9965132496513249,0.029151269017797965
30,0.9913814331445456,0.03322127191691571,0.0005,0.99721059972106,0.027914720035393203
31,0.9916276779118444,0.032550594825719564,0.0005,0.99302649930265,0.02464665568107674
32,0.9912583107608963,0.03257691041742789,0.0005,0.9916317991631799,0.028423539888908674
33,0.991135188377247,0.032398569141921664,0.0005,0.9909344490934449,0.026843363947833848
34,0.9918739226791431,0.03147574473042623,0.0005,0.99581589958159,0.023947622416595534
35,0.991504555528195,0.03087006992967999,0.0005,0.99721059972106,0.024592108673817444
36,0.9924895345973898,0.03223219450379267,0.0005,0.9923291492329149,0.02463019823180083
37,0.9918739226791431,0.03106418257311805,0.0005,0.995118549511855,0.022464109041742366
38,0.9931051465156365,0.029948791722925066,0.0005,0.9923291492329149,0.02360355574767543
39,0.9916276779118444,0.030277739365889473,0.0005,0.99581589958159,0.021842239528499553
40,0.9919970450627924,0.029905193707084925,0.0005,0.9944211994421199,0.021263625348088133
41,0.9928589017483378,0.028422881427824835,0.0005,0.99302649930265,0.0239588623694982
42,0.9924895345973898,0.02969772420017238,0.0005,0.9937238493723849,0.021911536187525824
43,0.9940901255848313,0.027825543868619875,0.0005,0.99721059972106,0.023023267225927388
44,0.9935976360502339,0.02629433114325173,0.00045000002,0.9923291492329149,0.02448640761421565
45,0.9938438808175326,0.028068903461190405,0.00045000002,0.9839609483960948,0.040818781336714904
