\relax 
\babel@aux{english}{}
\@writefile{toc}{\contentsline {chapter}{\numberline {1}1D problem}{2}\protected@file@percent }
\@writefile{lof}{\addvspace {10\p@ }}
\@writefile{lot}{\addvspace {10\p@ }}
\@writefile{toc}{\contentsline {subsection}{\numberline {1.0.1}Definitions}{2}\protected@file@percent }
\@writefile{toc}{\contentsline {section}{\numberline {1.1}ZEM ZEV}{2}\protected@file@percent }
\@writefile{toc}{\contentsline {subsection}{\numberline {1.1.1}Integration with optimal control}{2}\protected@file@percent }
\@writefile{lof}{\contentsline {figure}{\numberline {1.1}{\ignorespaces \relax }}{3}\protected@file@percent }
\providecommand*\caption@xref[2]{\@setref\relax\@undefined{#1}}
\newlabel{fig:ZEM_ZEV_debug}{{1.1}{3}}
\@writefile{toc}{\contentsline {subsection}{\numberline {1.1.2}Dataset generation}{3}\protected@file@percent }
\@writefile{toc}{\contentsline {subsection}{\numberline {1.1.3}Dagger criteria}{3}\protected@file@percent }
\@writefile{lof}{\contentsline {figure}{\numberline {1.2}{\ignorespaces Example of states collected: bc\_vec=[0:5:400]\relax }}{4}\protected@file@percent }
\@writefile{toc}{\contentsline {subsection}{\numberline {1.1.4}DNN - Without mass as input feature}{4}\protected@file@percent }
\@writefile{lof}{\contentsline {figure}{\numberline {1.3}{\ignorespaces Performances over dagger iterations\relax }}{5}\protected@file@percent }
\@writefile{lof}{\contentsline {figure}{\numberline {1.4}{\ignorespaces Performances over dagger iterations\relax }}{5}\protected@file@percent }
\@writefile{lof}{\contentsline {figure}{\numberline {1.5}{\ignorespaces Iter 0 - States distribution, Optimal vs Predicted\relax }}{6}\protected@file@percent }
\@writefile{lof}{\contentsline {figure}{\numberline {1.6}{\ignorespaces Iter 0 - States distribution, Optimal vs Predicted\relax }}{6}\protected@file@percent }
\@writefile{lof}{\contentsline {figure}{\numberline {1.7}{\ignorespaces Iter 4 - States distribution, Optimal vs Predicted\relax }}{6}\protected@file@percent }
\@writefile{lof}{\contentsline {figure}{\numberline {1.8}{\ignorespaces Iter 4 - States distribution, Optimal vs Predicted\relax }}{7}\protected@file@percent }
\@writefile{toc}{\contentsline {subsection}{\numberline {1.1.5}DNN - With mass as input feature}{7}\protected@file@percent }
\@writefile{lof}{\contentsline {figure}{\numberline {1.9}{\ignorespaces Performances over dagger iterations\relax }}{7}\protected@file@percent }
\@writefile{lof}{\contentsline {figure}{\numberline {1.10}{\ignorespaces Performances over dagger iterations\relax }}{8}\protected@file@percent }
\@writefile{lof}{\contentsline {figure}{\numberline {1.11}{\ignorespaces Iter 0 - States distribution, Optimal vs Predicted\relax }}{8}\protected@file@percent }
\@writefile{lof}{\contentsline {figure}{\numberline {1.12}{\ignorespaces Iter 0 - States distribution, Optimal vs Predicted\relax }}{9}\protected@file@percent }
\@writefile{lof}{\contentsline {figure}{\numberline {1.13}{\ignorespaces Iter 6 - States distribution, Optimal vs Predicted\relax }}{9}\protected@file@percent }
\@writefile{lof}{\contentsline {figure}{\numberline {1.14}{\ignorespaces Iter 6 - States distribution, Optimal vs Predicted\relax }}{9}\protected@file@percent }
\@writefile{toc}{\contentsline {section}{\numberline {1.2}GPOPS}{10}\protected@file@percent }
\@writefile{toc}{\contentsline {subsection}{\numberline {1.2.1}Sensitivity analysis on the switching time}{10}\protected@file@percent }
\@writefile{lof}{\contentsline {figure}{\numberline {1.15}{\ignorespaces Example of thrust profile\relax }}{10}\protected@file@percent }
\newlabel{fig:switching_time}{{1.15}{10}}
\@writefile{lof}{\contentsline {figure}{\numberline {1.16}{\ignorespaces Integration results over the switching time\relax }}{11}\protected@file@percent }
\newlabel{fig:GPOPS_debug}{{1.16}{11}}
\@writefile{toc}{\contentsline {subsection}{\numberline {1.2.2}Dataset generation}{11}\protected@file@percent }
\@writefile{toc}{\contentsline {subsection}{\numberline {1.2.3}Dagger criteria}{11}\protected@file@percent }
\@writefile{lof}{\contentsline {figure}{\numberline {1.17}{\ignorespaces Example of states collected: bc\_vec=[-50:1:0], where 0 is the switching point\relax }}{12}\protected@file@percent }
\@writefile{toc}{\contentsline {subsection}{\numberline {1.2.4}DNN - Without mass as input feature}{12}\protected@file@percent }
\@writefile{lof}{\contentsline {figure}{\numberline {1.18}{\ignorespaces Performances over dagger iterations\relax }}{12}\protected@file@percent }
\@writefile{lof}{\contentsline {figure}{\numberline {1.19}{\ignorespaces Performances over dagger iterations\relax }}{13}\protected@file@percent }
\@writefile{lof}{\contentsline {figure}{\numberline {1.20}{\ignorespaces Iter 0 - States distribution, Optimal vs Predicted\relax }}{13}\protected@file@percent }
\@writefile{lof}{\contentsline {figure}{\numberline {1.21}{\ignorespaces Iter 0 - States distribution, Optimal vs Predicted\relax }}{14}\protected@file@percent }
\@writefile{lof}{\contentsline {figure}{\numberline {1.22}{\ignorespaces Iter 4 - States distribution, Optimal vs Predicted\relax }}{14}\protected@file@percent }
\@writefile{lof}{\contentsline {figure}{\numberline {1.23}{\ignorespaces Iter 4 - States distribution, Optimal vs Predicted\relax }}{14}\protected@file@percent }
\@writefile{toc}{\contentsline {subsection}{\numberline {1.2.5}DNN - With mass as input feature}{15}\protected@file@percent }
\@writefile{lof}{\contentsline {figure}{\numberline {1.24}{\ignorespaces Performances over dagger iterations\relax }}{15}\protected@file@percent }
\@writefile{lof}{\contentsline {figure}{\numberline {1.25}{\ignorespaces Performances over dagger iterations\relax }}{15}\protected@file@percent }
\@writefile{lof}{\contentsline {figure}{\numberline {1.26}{\ignorespaces Iter 0 - States distribution, Optimal vs Predicted\relax }}{16}\protected@file@percent }
\@writefile{lof}{\contentsline {figure}{\numberline {1.27}{\ignorespaces Iter 0 - States distribution, Optimal vs Predicted\relax }}{16}\protected@file@percent }
\@writefile{lof}{\contentsline {figure}{\numberline {1.28}{\ignorespaces Iter 5 - States distribution, Optimal vs Predicted\relax }}{16}\protected@file@percent }
\@writefile{lof}{\contentsline {figure}{\numberline {1.29}{\ignorespaces Iter 5 - States distribution, Optimal vs Predicted\relax }}{17}\protected@file@percent }
\@writefile{toc}{\contentsline {section}{\numberline {1.3}LT2.0}{18}\protected@file@percent }
\@writefile{lof}{\contentsline {figure}{\numberline {1.30}{\ignorespaces GPOPS solution\relax }}{18}\protected@file@percent }
\@writefile{lof}{\contentsline {figure}{\numberline {1.31}{\ignorespaces LT2.0 solution\relax }}{19}\protected@file@percent }
