1320.3992,-24.919338,1194.3407,0,0
1295.0876,-25.703877,1193.831,0,0
1268.9916,-26.488059,1193.3213,0,0
1242.1116,-27.271883,1192.8116,0,0
1214.4479,-28.055348,1192.302,0,0
1186.001,-28.838455,1191.7923,0,0
1156.7711,-29.621203,1191.2826,0,0
1126.7587,-30.403592,1190.7729,0,0
1095.9641,-31.185622,1190.2632,0,0
1064.3876,-31.967292,1189.7535,0,0
1032.0296,-32.748601,1189.2439,0,0
1360.5208,-20.805599,1028.422,0,0
1339.3905,-21.454994,1027.9123,0,0
1317.611,-22.103908,1027.4026,0,0
1295.1828,-22.752338,1026.8929,0,0
1272.1065,-23.400285,1026.3833,0,0
1248.3824,-24.047748,1025.8736,0,0
1224.0111,-24.694727,1025.3639,0,0
1198.9931,-25.341221,1024.8542,0,0
1173.3288,-25.987229,1024.3445,0,0
1147.0188,-26.632752,1023.8348,0,0
1120.0635,-27.277789,1023.3252,0,0
1228.9697,-27.620142,1010.3818,0,0
1201.0335,-28.252167,1009.8721,0,0
1172.4655,-28.883693,1009.3624,0,0
1143.2663,-29.514718,1008.8527,0,0
1113.4363,-30.145243,1008.3431,0,0
1082.976,-30.775266,1007.8334,0,0
1051.8859,-31.404788,1007.3237,0,0
1020.1666,-32.033807,1006.814,0,0
987.81845,-32.662323,1006.3043,0,0
1333.0739,-29.933606,1430.9434,0,0
1302.6788,-30.856642,1430.4337,0,0
1271.3607,-31.779429,1429.924,0,0
1239.12,-32.701966,1429.4143,0,0
1205.9569,-33.624254,1428.9047,0,0
1171.8716,-34.546293,1428.395,0,0
1106.758,-36.000854,1427.2772,0,0.84375093
1070.6257,-36.97042,1426.822,0,0.82730687
1064.0852,-37.310908,1426.8659,0,0
1026.3137,-38.231946,1426.3562,0,0
987.62138,-39.152734,1425.8466,0,0
918.53464,-38.658571,1423.4124,1,0.76216685
1174.3305,-20.791235,1447.138,0,0
1153.0738,-21.722094,1446.6283,0,0
1130.8864,-22.65271,1446.1186,0,0
1107.7685,-23.583082,1445.6089,0,0
1083.7203,-24.51321,1445.0993,0,0
1058.7421,-25.443094,1444.5896,0,0
1032.8342,-26.372733,1444.0799,0,0
1005.9968,-27.302129,1443.5702,0,0
978.23003,-28.231279,1443.0605,0,0
949.53428,-29.160185,1442.5508,0,0
919.90974,-30.088846,1442.0412,0,0
865.67529,-31.379825,1440.8913,0,0.76082687
1402.8799,-27.526703,1306.4766,0,0
1374.925,-28.383136,1305.9669,0,0
1346.1137,-29.239271,1305.4572,0,0
1316.4465,-30.095106,1304.9475,0,0
1285.9236,-30.950642,1304.4379,0,0
1254.5453,-31.805878,1303.9282,0,0
1222.312,-32.660815,1303.4185,0,0
1189.2238,-33.515452,1302.9088,0,0
1155.2812,-34.369788,1302.3991,0,0
1120.4843,-35.223824,1301.8894,0,0
1084.8336,-36.077559,1301.3798,0,0
1451.1629,-22.387494,1497.8591,0,0
1428.2983,-23.341761,1497.3494,0,0
1404.4795,-24.2958,1496.8397,0,0
1379.7067,-25.249612,1496.33,0,0
1353.9803,-26.203197,1495.8204,0,0
1327.3004,-27.156553,1495.3107,0,0
1299.6673,-28.109682,1494.801,0,0
1271.0811,-29.062583,1494.2913,0,0
1241.5422,-30.015255,1493.7816,0,0
1211.0507,-30.967699,1493.2719,0,0
1179.6069,-31.919914,1492.7623,0,0
1117.3162,-33.374784,1491.5193,0,0.90459705
1083.537,-34.537781,1491.1908,0,0.88809988
1079.5637,-34.775187,1491.2332,0,0
1023.1303,-23.678189,1235.0574,0,0
999.04601,-24.490343,1234.5477,0,0
974.14973,-25.302162,1234.038,0,0
948.44179,-26.113647,1233.5283,0,0
921.92254,-26.924797,1233.0187,0,0
894.59231,-27.735612,1232.509,0,0
866.45143,-28.546091,1231.9993,0,0
837.50024,-29.356234,1231.4896,0,0
807.73908,-30.166041,1230.9799,0,0
1404.453,-20.904759,1026.4582,0,0
1383.2244,-21.552293,1025.9485,0,0
1361.3486,-22.199343,1025.4388,0,0
1338.8259,-22.845909,1024.9291,0,0
1315.6569,-23.491989,1024.4195,0,0
1291.8421,-24.137583,1023.9098,0,0
1267.3819,-24.782691,1023.4001,0,0
1242.2769,-25.427313,1022.8904,0,0
1216.5275,-26.071448,1022.3807,0,0
1190.1341,-26.715095,1021.871,0,0
1163.0974,-27.358253,1021.3614,0,0
1272.8237,-28.789987,1446.0242,0,0
1243.5685,-29.720314,1445.5145,0,0
1213.3832,-30.650397,1445.0048,0,0
1182.2678,-31.580235,1444.4951,0,0
1150.2228,-32.50983,1443.9855,0,0
1117.2482,-33.43918,1443.4758,0,0
1054.5088,-34.754131,1442.2524,0,0.83633784
1048.5118,-35.297146,1442.4564,0,0
1012.7503,-36.225761,1441.9467,0,0
976.06031,-37.154132,1441.437,0,0
909.08847,-37.90896,1439.8821,1,0.77099975
809.0137,-35.689262,1435.0145,1,2.4983782
1460.6499,-22.512968,1353.3817,0,0
1437.6954,-23.395939,1352.872,0,0
1413.8581,-24.278631,1352.3623,0,0
1389.1383,-25.161045,1351.8526,0,0
1363.5361,-26.04318,1351.343,0,0
1337.052,-26.925036,1350.8333,0,0
1309.6861,-27.806613,1350.3236,0,0
1281.4389,-28.68791,1349.8139,0,0
1252.3104,-29.568927,1349.3042,0,0
1222.3011,-30.449664,1348.7945,0,0
1191.4112,-31.330121,1348.2849,0,0
1159.6409,-32.210298,1347.7752,0,0
1053.6477,-22.955255,1032.6717,0,0
1030.3657,-23.608654,1032.162,0,0
1006.4306,-24.261575,1031.6523,0,0
981.84272,-24.914016,1031.1426,0,0
956.60268,-25.565979,1030.633,0,0
930.71092,-26.217461,1030.1233,0,0
904.16792,-26.868463,1029.6136,0,0
876.97415,-27.518985,1029.1039,0,0
849.13011,-28.169025,1028.5942,0,0
1259.1305,-24.020503,1405.2837,0,0
1234.6548,-24.930774,1404.774,0,0
1209.269,-25.840786,1404.2643,0,0
1182.9734,-26.75054,1403.7546,0,0
1155.768,-27.660036,1403.245,0,0
1127.6534,-28.569273,1402.7353,0,0
1098.6296,-29.47825,1402.2256,0,0
1068.697,-30.386968,1401.7159,0,0
1037.8557,-31.295427,1401.2062,0,0
1006.1062,-32.203627,1400.6965,0,0
973.44857,-33.111566,1400.1869,0,0
914.4083,-34.274805,1398.9941,0,0.74798931
1077.9043,-25.675545,1159.2099,0,0
1051.8491,-26.434699,1158.7002,0,0
1025.035,-27.193473,1158.1905,0,0
997.46233,-27.951867,1157.6808,0,0
969.13142,-28.709881,1157.1712,0,0
940.04269,-29.467514,1156.6615,0,0
910.19652,-30.224766,1156.1518,0,0
879.59329,-30.981637,1155.6421,0,0
848.23337,-31.738127,1155.1324,0,0
1223.5356,-24.858603,1339.1478,0,0
1198.2394,-25.733717,1338.6381,0,0
379.99641,-27.620715,1312.1169,1,24.369677
1145.0224,-27.483092,1337.6187,0,0
1117.1022,-28.357353,1337.1091,0,0
1088.3078,-29.231328,1336.5994,0,0
1058.6396,-30.105018,1336.0897,0,0
1028.0979,-30.978422,1335.58,0,0
996.68286,-31.851541,1335.0703,0,0
964.39488,-32.724374,1334.5606,0,0
931.23421,-33.596921,1334.051,0,0
1269.0191,-25.560489,1180.491,0,0
1243.0712,-26.335201,1179.9813,0,0
1216.3488,-27.109547,1179.4716,0,0
1188.8523,-27.883526,1178.9619,0,0
1160.5819,-28.657139,1178.4523,0,0
1131.5381,-29.430385,1177.9426,0,0
1101.7212,-30.203263,1177.4329,0,0
1071.1317,-30.975774,1176.9232,0,0
1039.7698,-31.747917,1176.4135,0,0
1007.636,-32.519692,1175.9038,0,0
1259.0235,-26.222392,1462.2518,0,0
1232.3321,-27.160396,1461.7421,0,0
1204.7028,-28.098162,1461.2324,0,0
1176.1358,-29.035688,1460.7227,0,0
1146.6315,-29.972976,1460.2131,0,0
1116.19,-30.910025,1459.7034,0,0
1084.8115,-31.846835,1459.1937,0,0
1024.8226,-33.284149,1458.0443,0,0.83928964
991.26193,-34.362474,1457.6602,0,0.82281797
985.05699,-34.655827,1457.6646,0,0
949.93322,-35.591678,1457.155,0,0
913.87371,-36.527289,1456.6453,0,0
1148.6299,-21.277556,1380.7392,0,0
1126.9035,-22.175173,1380.2295,0,0
1104.2796,-23.072522,1379.7198,0,0
1080.7586,-23.969603,1379.2101,0,0
1056.3405,-24.866416,1378.7005,0,0
1031.0258,-25.762961,1378.1908,0,0
1004.8147,-26.659238,1377.6811,0,0
977.70743,-27.555247,1377.1714,0,0
949.70429,-28.450986,1376.6617,0,0
920.80555,-29.346457,1376.152,0,0
891.01147,-30.241658,1375.6424,0,0
1406.0361,-27.802694,1486.7589,0,0
0,0,0,0,0
1348.5322,-29.701025,1485.7395,0,0
1318.3568,-30.649844,1485.2298,0,0
1287.2326,-31.598432,1484.7202,0,0
1255.16,-32.546788,1484.2105,0,0
1190.7816,-34.281715,1483.1602,0,0.9259007
1156.7838,-34.788035,1482.337,0,0.90956546
1153.2536,-35.39047,1482.6814,0,0
1117.3894,-36.3379,1482.1717,0,0
1276.6275,-24.892776,1007.7768,0,0
1251.4199,-25.522242,1007.2671,0,0
1225.5832,-26.151205,1006.7574,0,0
1199.1177,-26.779666,1006.2477,0,0
1172.024,-27.407623,1005.7381,0,0
1144.3026,-28.035076,1005.2284,0,0
1115.954,-28.662025,1004.7187,0,0
1086.9787,-29.288469,1004.209,0,0
1057.3773,-29.914408,1003.6993,0,0
1027.1501,-30.53984,1003.1896,0,0
1291.9332,-21.813697,1118.5339,0,0
1269.7556,-22.541466,1118.0242,0,0
1246.8504,-23.268827,1117.5145,0,0
1223.2181,-23.99578,1117.0048,0,0
1198.859,-24.722324,1116.4952,0,0
1173.7736,-25.44846,1115.9855,0,0
1147.9622,-26.174186,1115.4758,0,0
1121.4253,-26.899503,1114.9661,0,0
1094.1633,-27.624409,1114.4564,0,0
1066.1766,-28.348906,1113.9467,0,0
1037.4657,-29.072991,1113.4371,0,0
1320.0439,-28.249311,1369.5415,0,0
1291.3487,-29.141004,1369.0318,0,0
1261.762,-30.032425,1368.5221,0,0
1231.284,-30.923573,1368.0124,0,0
1199.9149,-31.814449,1367.5028,0,0
1167.6552,-32.705053,1366.9931,0,0
1134.5049,-33.595384,1366.4834,0,0
1100.4645,-34.485442,1365.9737,0,0
1065.5341,-35.375227,1365.464,0,0
1002.085,-36.810043,1364.4798,0,0.75679299
965.35839,-37.616637,1363.9314,0,0.74040059
1463.2846,-21.437927,1025.6108,0,0
1441.5233,-22.084656,1025.1011,0,0
1419.1154,-22.7309,1024.5914,0,0
1396.0616,-23.376658,1024.0817,0,0
1372.3623,-24.021931,1023.5721,0,0
1348.0179,-24.666716,1023.0624,0,0
1323.029,-25.311015,1022.5527,0,0
1297.3961,-25.954827,1022.043,0,0
1271.1195,-26.59815,1021.5333,0,0
1244.1999,-27.240986,1021.0236,0,0
1216.6377,-27.883332,1020.514,0,0
1069.6943,-21.106612,1362.4212,0,0
1048.1437,-21.994487,1361.9115,0,0
1025.7054,-22.882088,1361.4018,0,0
1002.3796,-23.769413,1360.8921,0,0
978.16668,-24.656464,1360.3825,0,0
953.06681,-25.543238,1359.8728,0,0
927.0803,-26.429738,1359.3631,0,0
900.20743,-27.315961,1358.8534,0,0
872.44847,-28.201908,1358.3437,0,0
843.8037,-29.08758,1357.834,0,0
814.2734,-29.972974,1357.3244,0,0
1283.4422,-26.878312,1475.3701,0,0
1256.0918,-27.822399,1474.8604,0,0
1227.7975,-28.766251,1474.3507,0,0
1198.5594,-29.709869,1473.841,0,0
1168.3778,-30.653253,1473.3314,0,0
1137.253,-31.596402,1472.8217,0,0
1076.5458,-33.20382,1471.7492,0,0.87217568
1043.4802,-33.790005,1470.9923,0,0.85575417
1038.2212,-34.424437,1471.2926,0,0
1003.3256,-35.366645,1470.7829,0,0
967.48797,-36.308617,1470.2733,0,0
836.32273,-35.167332,1465.0313,1,2.616569
1351.1026,-28.529848,1150.5616,0,0
1322.1964,-29.282515,1150.0519,0,0
1292.5377,-30.034796,1149.5422,0,0
1262.1269,-30.786692,1149.0325,0,0
1230.9644,-31.538201,1148.5229,0,0
1199.0506,-32.289324,1148.0132,0,0
1166.3859,-33.040061,1147.5035,0,0
1132.9707,-33.79041,1146.9938,0,0
1098.8052,-34.540372,1146.4841,0,0
1063.89,-35.289946,1145.9744,0,0
1487.1653,-22.333437,1494.0263,0,0
1464.3556,-23.285991,1493.5166,0,0
1440.5934,-24.238316,1493.0069,0,0
1415.879,-25.190412,1492.4972,0,0
1390.2126,-26.14228,1491.9876,0,0
1363.5945,-27.093918,1491.4779,0,0
1336.0249,-28.045328,1490.9682,0,0
1307.504,-28.996508,1490.4585,0,0
1278.0319,-29.947459,1489.9488,0,0
1247.6091,-30.89818,1489.4391,0,0
1216.2357,-31.848671,1488.9295,0,0
1078.236,-25.284372,1394.0778,0,0
1052.4993,-26.188921,1393.5681,0,0
1025.8582,-27.093207,1393.0584,0,0
998.31301,-27.997231,1392.5487,0,0
969.86387,-28.900992,1392.0391,0,0
940.51111,-29.804489,1391.5294,0,0
910.25498,-30.707724,1391.0197,0,0
879.09575,-31.610695,1390.51,0,0
575.82146,-31.703942,1380.2392,1,8.0247838
814.06903,-33.415847,1389.4906,0,0
780.20207,-34.318026,1388.981,0,0
1168.1931,-21.143135,1021.9108,0,0
1146.7283,-21.786332,1021.4011,0,0
1124.6206,-22.42904,1020.8914,0,0
1101.8704,-23.07126,1020.3817,0,0
1078.4782,-23.712989,1019.8721,0,0
1054.4446,-24.354229,1019.3624,0,0
1029.7699,-24.994978,1018.8527,0,0
1004.4548,-25.635237,1018.343,0,0
978.49964,-26.275003,1017.8333,0,0
951.90496,-26.914278,1017.3236,0,0
1286.9689,-26.348992,1397.9654,0,0
1260.1666,-27.255536,1397.4557,0,0
1232.4579,-28.16182,1396.946,0,0
1203.8431,-29.067842,1396.4363,0,0
1174.3223,-29.973602,1395.9267,0,0
1143.8959,-30.879102,1395.417,0,0
1112.5642,-31.784339,1394.9073,0,0
1080.3274,-32.689314,1394.3976,0,0
1047.1857,-33.594028,1393.8879,0,0
986.25792,-35.112651,1392.9243,0,0.77278169
951.34966,-35.719933,1392.223,0,0.75640693
942.33414,-36.306593,1392.3589,0,0
1440.2282,-29.988153,1214.8639,0,0
1409.8407,-30.786843,1214.3542,0,0
1378.6546,-31.585187,1213.8445,0,0
1346.6704,-32.383185,1213.3348,0,0
1313.8884,-33.180837,1212.8252,0,0
1280.3089,-33.978143,1212.3155,0,0
1245.9322,-34.775102,1211.8058,0,0
1210.7588,-35.571713,1211.2961,0,0
1174.7889,-36.367978,1210.7864,0,0
1138.0229,-37.163894,1210.2767,0,0
1100.4612,-37.959463,1209.7671,0,0
1141.1866,-20.301139,1150.3943,0,0
1120.5092,-21.053679,1149.8846,0,0
1099.0794,-21.805834,1149.3749,0,0
1076.8976,-22.557603,1148.8652,0,0
1053.9643,-23.308986,1148.3556,0,0
1030.2798,-24.059982,1147.8459,0,0
1005.8445,-24.810591,1147.3362,0,0
980.65872,-25.560814,1146.8265,0,0
954.72296,-26.310648,1146.3168,0,0
928.03756,-27.060095,1145.8071,0,0
1018.0745,-23.8399,1338.3773,0,0
993.79723,-24.714584,1337.8676,0,0
968.64543,-25.588984,1337.3579,0,0
942.61936,-26.463098,1336.8482,0,0
915.71933,-27.336928,1336.3386,0,0
887.9456,-28.210471,1335.8289,0,0
859.29848,-29.08373,1335.3192,0,0
829.77824,-29.956702,1334.8095,0,0
799.38517,-30.829388,1334.2998,0,0
768.11956,-31.701789,1333.7901,0,0
1152.2894,-26.333385,1339.3702,0,0
1125.5184,-27.208623,1338.8605,0,0
1097.8722,-28.083577,1338.3508,0,0
1069.3513,-28.958247,1337.8411,0,0
1039.9558,-29.832631,1337.3315,0,0
1009.6861,-30.706731,1336.8218,0,0
978.54248,-31.580546,1336.3121,0,0
946.52515,-32.454075,1335.8024,0,0
913.63443,-33.327318,1335.2927,0,0
879.87061,-34.200276,1334.783,0,0
821.86408,-35.242922,1333.6541,0,0.66636281
1105.077,-24.350247,1494.9414,0,0
1080.2503,-25.30321,1494.4317,0,0
1054.4707,-26.255946,1493.922,0,0
1027.7384,-27.208452,1493.4123,0,0
1000.0538,-28.160731,1492.9027,0,0
946.66541,-29.880019,1491.941,0,0.83939256
917.02468,-30.393745,1491.1186,0,0.82311116
911.28793,-31.016193,1491.3736,0,0
879.79603,-31.967555,1490.8639,0,0
847.35289,-32.918689,1490.3542,0,0
814.16011,-33.063974,1489.2329,0,0
781.42711,-32.40159,1487.5,0,0
1363.3071,-23.486964,1479.2273,0,0
1339.3472,-24.432819,1478.7176,0,0
1314.4415,-25.378441,1478.2079,0,0
1288.5904,-26.323829,1477.6982,0,0
1261.794,-27.268984,1477.1886,0,0
1234.0525,-28.213906,1476.6789,0,0
1205.3662,-29.158594,1476.1692,0,0
1175.7354,-30.103048,1475.6595,0,0
1145.1602,-31.047267,1475.1498,0,0
1113.6409,-31.991253,1474.6401,0,0
1052.6687,-33.334646,1473.3796,0,0.86267012
1047.771,-33.878521,1473.6208,0,0
1013.4208,-34.821803,1473.1111,0,0
1010.8229,-22.517876,1498.1413,0,0
987.82781,-23.472269,1497.6316,0,0
963.87844,-24.426434,1497.1219,0,0
938.97502,-25.380372,1496.6122,0,0
913.11777,-26.334083,1496.1026,0,0
886.30693,-27.287565,1495.5929,0,0
836.09609,-28.639481,1494.409,0,0.79134066
829.82536,-29.193847,1494.5735,0,0
800.1551,-30.146646,1494.0638,0,0
769.53215,-31.099216,1493.5541,0,0
738.15769,-31.247666,1492.4328,0,0
1289.2883,-29.959483,1439.4902,0,0
1258.8652,-30.88667,1438.9805,0,0
1227.515,-31.81361,1438.4708,0,0
1195.2381,-32.740304,1437.9611,0,0
1162.0345,-33.666752,1437.4515,0,0
1098.2953,-35.222568,1436.3944,0,0.84906429
1063.1944,-35.883768,1435.7106,0,0.83265234
1056.8669,-36.444614,1435.9224,0,0
1019.9595,-37.370074,1435.4127,0,0
982.12685,-38.295287,1434.903,0,0
913.9815,-38.26638,1432.7869,1,0.76748885
876.98339,-37.532237,1431.0863,1,0.75134801
1318.6402,-28.549958,1102.9993,0,0
1289.7326,-29.26513,1102.4896,0,0
1260.1101,-29.979882,1101.9799,0,0
1229.773,-30.694214,1101.4702,0,0
1198.7218,-31.408127,1100.9606,0,0
1166.9569,-32.121619,1100.4509,0,0
1134.4787,-32.83469,1099.9412,0,0
1101.2876,-33.54734,1099.4315,0,0
1067.3842,-34.259568,1098.9218,0,0
1032.7687,-34.971374,1098.4121,0,0
1009.4852,-24.851707,1383.8288,0,0
984.18385,-25.750941,1383.3191,0,0
957.98341,-26.649909,1382.8094,0,0
930.88412,-27.54861,1382.2997,0,0
902.88628,-28.447045,1381.7901,0,0
873.99012,-29.345212,1381.2804,0,0
844.19594,-30.243113,1380.7707,0,0
813.50399,-31.140746,1380.261,0,0
760.37275,-32.306048,1379.1744,0,0.67107816
749.42785,-32.935209,1379.2416,0,0
1217.9464,-20.245835,1306.1239,0,0
1197.2724,-21.102061,1305.6142,0,0
1175.7424,-21.957989,1305.1045,0,0
1153.3565,-22.813617,1304.5948,0,0
1130.1152,-23.668946,1304.0852,0,0
1106.0188,-24.523975,1303.5755,0,0
1081.0674,-25.378704,1303.0658,0,0
1055.2614,-26.233133,1302.5561,0,0
1028.6012,-27.087261,1302.0464,0,0
1001.087,-27.941089,1301.5367,0,0
972.71915,-28.794616,1301.0271,0,0
1412.2138,-24.352027,1419.4854,0,0
1387.4031,-25.26942,1418.9757,0,0
1361.675,-26.18656,1418.466,0,0
1335.03,-27.103446,1417.9563,0,0
1307.4682,-28.020079,1417.4467,0,0
1278.9899,-28.936458,1416.937,0,0
1249.5954,-29.852583,1416.4273,0,0
1219.2849,-30.768455,1415.9176,0,0
1188.0586,-31.684072,1415.4079,0,0
1155.9168,-32.599434,1414.8982,0,0
1122.8598,-33.514542,1414.3886,0,0
1088.8878,-34.429396,1413.8789,0,0
1025.6318,-35.666899,1412.6661,0,0.80096529
1399.8069,-28.95757,1098.9576,0,0
1370.4934,-29.669406,1098.4479,0,0
1340.4682,-30.380819,1097.9382,0,0
1309.7319,-31.091809,1097.4285,0,0
1278.2848,-31.802377,1096.9189,0,0
1246.1273,-32.51252,1096.4092,0,0
1213.2599,-33.22224,1095.8995,0,0
1179.6829,-33.931535,1095.3898,0,0
1145.3969,-34.640406,1094.8801,0,0
1110.4023,-35.348851,1094.3704,0,0
1495.6449,-21.102849,1363.8528,0,0
1474.0977,-21.991495,1363.3431,0,0
1451.662,-22.879867,1362.8334,0,0
1428.3381,-23.767964,1362.3237,0,0
1404.1262,-24.655787,1361.8141,0,0
1379.0266,-25.543335,1361.3044,0,0
1353.0396,-26.430608,1360.7947,0,0
1326.1655,-27.317605,1360.285,0,0
1298.4045,-28.204328,1359.7753,0,0
1269.7569,-29.090774,1359.2656,0,0
1240.223,-29.976945,1358.756,0,0
1209.8031,-30.862839,1358.2463,0,0
1178.4974,-31.748458,1357.7366,0,0
1043.7386,-27.67414,1496.1536,0,0
1015.5877,-28.627646,1495.6439,0,0
961.17078,-30.249174,1494.5966,0,0.84702101
931.04615,-30.798365,1493.7998,0,0.83060124
925.41551,-31.486795,1494.1149,0,0
893.4524,-32.439388,1493.6052,0,0
860.53682,-33.391753,1493.0955,0,0
827.06297,-33.218002,1491.7295,0,0
794.17402,-32.559444,1489.9966,0,0
761.79186,-32.059487,1488.386,0,0
730.06399,-31.395802,1486.6531,0,0
1161.3796,-22.867249,1258.0123,0,0
1138.0989,-23.694183,1257.5026,0,0
1113.9913,-24.520795,1256.9929,0,0
1089.0574,-25.347084,1256.4832,0,0
1063.2973,-26.173051,1255.9736,0,0
1036.7114,-26.998694,1255.4639,0,0
1009.3,-27.824014,1254.9542,0,0
981.06346,-28.64901,1254.4445,0,0
952.00209,-29.473683,1253.9348,0,0
922.1162,-30.298031,1253.4251,0,0
1241.436,-29.821318,1462.5348,0,0
1211.1456,-30.759454,1462.0251,0,0
1179.9172,-31.697352,1461.5154,0,0
1147.751,-32.635012,1461.0057,0,0
1085.441,-34.127922,1459.8663,0,0.86420525
1051.1655,-35.058031,1459.3714,0,0.8477502
1045.6281,-35.446556,1459.4767,0,0
1009.7132,-36.38326,1458.967,0,0
972.86164,-37.319724,1458.4573,0,0
906.04531,-37.165763,1456.1953,1,0.78259849
870.11055,-36.469046,1454.4948,1,0.76645964
834.86867,-35.769902,1452.7945,1,0.7503245
1165.1548,-29.842335,1337.8253,0,0
1134.8753,-30.716711,1337.3156,0,0
1103.7215,-31.590802,1336.8059,0,0
1071.6937,-32.464607,1336.2962,0,0
1038.7924,-33.338127,1335.7866,0,0
1005.0176,-34.211362,1335.2769,0,0
970.36973,-35.084311,1334.7672,0,0
909.49968,-36.420274,1333.7993,0,0.70112655
898.45587,-36.82935,1333.7478,0,0
861.19046,-37.701439,1333.2381,0,0
1088.2424,-27.049381,1046.4029,0,0
1060.8599,-27.715493,1045.8932,0,0
1032.8116,-28.38114,1045.3835,0,0
1004.0978,-29.04632,1044.8738,0,0
974.71908,-29.711033,1044.3642,0,0
944.67589,-30.375279,1043.8545,0,0
913.96868,-31.039057,1043.3448,0,0
882.59793,-31.702367,1042.8351,0,0
850.56411,-32.365208,1042.3254,0,0
1244.5524,-20.445078,1076.795,0,0
1223.7607,-21.138176,1076.2853,0,0
1202.2762,-21.830835,1075.7756,0,0
1180.0992,-22.523052,1075.2659,0,0
1157.2302,-23.214829,1074.7563,0,0
1133.6697,-23.906165,1074.2466,0,0
1109.4181,-24.597059,1073.7369,0,0
1084.4757,-25.287511,1073.2272,0,0
1058.8432,-25.977521,1072.7175,0,0
1032.5208,-26.667088,1072.2078,0,0
