26.112512,-0.62376028,14.205881,-8.4400172,0.1341711,-4.5514731,1233.2379,0.51137598,-8.4501267e-05,0.85935709,1,0
25.966012,1.3309193,16.075631,-8.2394566,-0.48010442,-4.7050075,1187.4166,0.49451668,0.045178778,0.86799316,0,0
33.312443,1.8369089,15.839288,-9.468604,-0.47166576,-4.1814733,1204.5856,0.50012529,0.0099124117,0.86589632,0,0.10801613
30.506436,-0.68390152,16.576677,-9.1357094,0.10687904,-4.9315163,1234.1043,0.50995918,-3.6149454e-05,0.8601986,1,0
28.457358,-0.13727756,16.75105,-8.2280211,0.43919629,-4.5217888,1224.6243,0.44471052,-0.14801995,0.88335873,0,0.10656432
36.498468,3.5474265,17.516826,-9.9451078,-0.67228332,-4.1193977,1198.2252,0.52288417,-0.04918417,0.85098359,0,0
23.44391,0.97162669,17.692389,-7.4155192,-0.27044092,-5.2040887,1186.3842,0.44314788,0.0056261871,0.89643087,0,0
28.499411,-0.71029289,17.460356,-8.2624839,0.68518955,-4.779018,1188.5038,0.41798481,-0.18375341,0.889676,0,0.10475475
16.692796,-0.095497686,18.264028,-5.7936707,-0.38407567,-5.1639207,1235.4753,0.51508259,0.1521945,0.84352046,0,0
23.704553,3.9326059,17.852992,-7.1695249,-0.8191471,-4.9709382,1207.664,0.42912356,-0.070111492,0.9005206,0,0.1030726
38.116029,2.0785177,17.916689,-10.235362,-0.53125503,-4.506753,1205.4181,0.50993911,0.019189908,0.85999642,0,0.11513808
20.552195,2.6650441,18.456819,-6.0837735,-0.5602907,-4.8709565,1190.4114,0.33050011,-0.058017321,0.94202105,0,0
30.26949,1.5864081,18.533219,-8.9747376,-0.54084497,-5.12506,1188.2831,0.49746082,0.047916858,0.86616205,0,0
15.195167,-3.1809223,18.853411,-5.7103886,0.30193572,-5.746555,1199.6415,0.52322334,0.18418432,0.83205377,0,0
17.248178,0.54566218,18.976193,-5.8394532,-0.30895926,-5.7601206,1204.2075,0.42605294,0.056208683,0.90295043,0,0
35.247928,-0.73123301,19.137443,-9.8299679,0.082946204,-5.3115838,1234.9708,0.50898287,-2.4756772e-05,0.86077665,1,0
27.45759,-0.86424687,19.151306,-8.2549394,0.09445672,-5.5970386,1202.8103,0.46992775,-2.3208891e-05,0.88270488,1,0
22.147271,-2.3284417,19.155197,-6.3867879,0.76106816,-4.7131728,1215.9611,0.38930376,-0.080387457,0.91759492,0,0
25.641435,1.5709182,18.681381,-7.0679805,-0.016795289,-4.7848809,1205.5044,0.30556093,-0.14617382,0.94088561,0,0.10635733
32.385455,2.568081,18.718502,-8.8224595,-0.27164503,-4.8296041,1213.7112,0.43248279,-0.11180207,0.89468371,0,0.11224838
32.385455,2.568081,18.718502,-8.8224595,-0.27164503,-4.8296041,1213.7112,0.43248279,-0.11180207,0.89468371,0,0.11224838
35.992679,-3.5058128,19.391777,-10.497876,0.51965365,-5.4510167,1211.7004,0.54240174,0.0018511531,0.84011721,1,0
28.241075,2.3566394,19.46545,-7.4979553,-0.31762897,-4.5245915,1234.0241,0.37634514,-0.09304918,0.92179509,0,0
32.637375,-0.36108383,19.007196,-8.9420132,0.43239622,-4.940934,1225.5053,0.4561687,-0.11308384,0.88267897,0,0.11370173
40.407248,3.8117151,19.132708,-10.688756,-0.73578536,-4.5466682,1199.0051,0.55956124,-0.033010573,0.82813134,0,0.11830539
25.927068,1.9176487,19.865984,-6.9020069,-0.15182496,-4.8071255,1212.5102,0.29413952,-0.12549839,0.94748725,0,0
16.011,0.31200146,19.889807,-5.8025157,-0.76827109,-5.80911,1227.6365,0.52155344,0.21646714,0.82530236,0,0
27.006815,-1.6992516,19.745717,-7.4913151,0.88279781,-5.0553334,1227.3658,0.39639329,-0.17689143,0.90087834,0,0.11069814
27.90766,0.35200297,20.371825,-8.169845,-0.20640755,-5.7468784,1185.9695,0.4243177,0.036798426,0.90476536,0,0
27.31988,1.1179484,20.407193,-8.0890564,-0.31540923,-5.6545042,1187.2507,0.45061351,0.013562099,0.89261612,0,0
32.696257,-1.05823,19.836076,-8.9790657,0.6879481,-5.1583153,1189.3378,0.43968024,-0.1461269,0.88618746,0,0.11175755
24.384206,0.14704261,20.414437,-7.2571111,-0.0083088537,-5.5388826,1218.5513,0.44017589,-0.0090469416,0.89786599,0,0
27.193317,-1.5764671,19.864498,-7.7452617,0.54914927,-5.4568487,1207.3067,0.39638008,-0.056683761,0.91633497,0,0.10882847
24.893898,6.5082022,20.478511,-6.3051052,-1.0859119,-4.8247406,1214.3455,0.19338525,-0.18343421,0.96382262,0,0
15.985333,-0.79784583,20.490932,-5.2320627,-0.17422297,-5.5402708,1239.0079,0.44385513,0.13979839,0.88512656,0,0
31.753579,3.9753404,20.104587,-8.3018291,-0.82808536,-4.9178729,1247.5467,0.4102665,-0.0225334,0.91168725,0,0.11717267
44.655616,2.4216491,20.758059,-11.111547,-0.59247297,-4.8325123,1206.3907,0.47070633,0.022811703,0.881995,0,0
19.389681,-0.5492564,20.269113,-6.1079882,0.11893216,-5.8190254,1192.4128,0.40571549,0.0083844453,0.91396096,0,0.10225112
27.355943,4.3444039,20.334116,-7.8193552,-0.90076745,-5.3794186,1208.5107,0.44166956,-0.046696893,0.89596172,0,0.11013658
19.728898,0.11126679,20.957357,-6.3505689,-0.44331782,-5.6093531,1236.3418,0.50556188,0.14028171,0.85130971,0,0
23.749353,2.9636466,21.009999,-6.7049561,-0.63470444,-5.3413683,1191.2779,0.35620172,-0.034966608,0.93375461,0,0
22.104446,-0.02119753,21.078308,-5.85758,0.48153696,-5.2255618,1186.0377,0.18875056,-0.20275821,0.96086541,0,0
29.330222,3.3699228,21.084692,-7.2410022,-0.26489921,-4.8415994,1210.6566,0.2260376,-0.19699506,0.95399159,0,0
38.136702,5.8323301,21.113477,-9.313465,-0.8846986,-4.5548705,1208.3912,0.40279143,-0.12961626,0.90606771,0,0
17.573507,-2.6615342,21.150138,-5.2870718,0.5222917,-5.2582357,1238.675,0.41172277,0.055720165,0.9096041,0,0
34.941046,1.8707975,21.200361,-9.7117928,-0.59594715,-5.5431229,1189.1496,0.50025461,0.048269055,0.86453191,0,0
41.876465,5.2717151,21.365006,-9.9218283,-1.0222696,-4.3601753,1197.2471,0.41856535,-0.028940987,0.90772544,0,0
29.530072,0.4076102,21.392095,-7.7038661,0.46398632,-5.24516,1185.3096,0.29878498,-0.20392586,0.93227774,0,0
25.499813,-2.7175078,21.619997,-7.0234343,0.79356333,-5.1456698,1216.8275,0.41104928,-0.061520998,0.90953486,0,0
30.109829,1.5853468,21.639464,-7.7670327,-0.050070461,-5.1203948,1206.4245,0.33485906,-0.11532424,0.93518433,0,0
31.722625,3.5092347,21.660558,-7.7193552,-0.28833352,-4.8066313,1254.4222,0.30950945,-0.17442416,0.93476206,0,0
23.781616,1.3444992,21.100473,-7.0239163,-0.13728235,-5.8182127,1203.2988,0.41141307,-0.064923008,0.90913381,0,0.10788047
36.857601,2.7002944,21.12338,-9.5373314,-0.31196068,-5.2177997,1214.5682,0.44648072,-0.08643589,0.89060867,0,0.11935457
26.849424,2.7483041,21.805016,-6.8573101,-0.38579583,-5.0461215,1227.173,0.29122794,-0.095891446,0.95183566,0,0
32.15864,2.5318435,21.824805,-8.1729048,-0.38248807,-4.9123198,1234.8906,0.40059137,-0.063751815,0.91403625,0,0
18.182573,-3.3370554,21.852256,-6.2397101,0.32259079,-6.2484181,1200.508,0.50537501,0.15540644,0.84879028,0,0
40.336232,-0.76739912,21.888197,-10.523266,0.062538579,-5.6912387,1235.8373,0.49333233,0.023721106,0.86951741,0,0
13.060294,-2.0714578,21.908104,-4.1679979,0.34090998,-5.9110843,1267.2756,0.35004628,0.059497643,0.93484097,0,0
20.304313,0.7086484,21.978927,-6.3862556,-0.34381888,-6.2501239,1205.0739,0.42612362,0.052744932,0.90312603,0,0
45.81472,4.1790157,21.381932,-11.499738,-0.7885447,-4.9012798,1199.8633,0.56037576,-0.022797481,0.82792468,0,0.1254861
31.750432,-0.90515257,22.058447,-8.9164906,0.06860061,-6.0312808,1203.6768,0.46973414,-2.1055811e-05,0.88280793,1,0
22.065541,1.832069,21.480693,-6.1696973,-0.38179784,-5.3791057,1252.3899,0.38052402,-0.019343406,0.92456871,0,0.11247592
38.330391,-0.63078858,22.090762,-9.7013732,0.43467505,-5.2455994,1226.4454,0.45070826,-0.088090635,0.88831419,0,0
15.256487,5.8755015,22.172048,-4.1071703,-1.0563261,-6.0145,1255.3676,0.15293582,-0.12525586,0.98026609,0,0
26.846688,-0.74937142,22.174591,-6.7531952,0.76500418,-5.0269458,1189.7417,0.22080752,-0.25759514,0.94068527,0,0
23.291285,1.4534887,22.199723,-6.3014113,-0.12838991,-5.4818095,1200.8895,0.29650513,-0.086420109,0.95111318,0,0
41.430588,-3.7680607,22.211262,-11.252774,0.52836608,-5.8274835,1212.5668,0.54210741,0.0010378256,0.84030856,1,0
35.191761,3.5807024,22.255592,-8.4817776,-0.088370632,-4.9470642,1202.6275,0.29880157,-0.24364777,0.92268813,0,0
18.778066,-0.97740793,22.281775,-5.4575098,0.084025386,-5.5360312,1235.3861,0.34709939,0.055394963,0.93619091,0,0
29.539934,2.0074241,22.376639,-7.5497766,-0.20748129,-5.2351654,1213.3767,0.32831596,-0.091000683,0.94017419,0,0
26.226343,4.6131813,22.600502,-6.1865271,-0.78824275,-4.8355587,1271.1311,0.20286136,-0.089167119,0.97513922,0,0
26.005273,1.7477212,22.730686,-6.4415902,-0.073763685,-5.0192783,1268.9926,0.28849307,-0.12412582,0.94940219,0,0
22.605989,-0.10551905,22.835265,-5.6723818,0.42364629,-5.192696,1222.4184,0.199004,-0.17232338,0.96472901,0,0
30.808118,-2.1491043,22.252423,-8.1278551,0.91713567,-5.4281076,1228.1997,0.41774915,-0.14820671,0.89639301,0,0.11765413
19.047623,0.71387687,22.910044,-6.3443933,-0.8399066,-6.2715043,1228.5029,0.51237138,0.19399906,0.83656436,0,0
28.198092,7.0779519,23.00195,-6.9118074,-1.1920912,-5.2688165,1215.212,0.2392024,-0.14471363,0.96012509,0,0
37.24846,-1.4076026,22.407812,-9.7227396,0.69732464,-5.6062831,1190.2174,0.45314459,-0.11493123,0.88399705,0,0.11892459
26.876264,0.51819927,23.150198,-6.5536268,0.5976378,-5.3356287,1189.5039,0.16209383,-0.2810692,0.94589941,0,0
35.956961,4.3929904,22.546519,-8.9465675,-0.91077316,-5.2612575,1248.3832,0.4242718,-0.0062603825,0.90551325,0,0.12422052
32.093308,-1.9137991,23.255078,-8.4328884,0.55231869,-5.8209105,1208.242,0.39428936,-0.038509147,0.91817915,0,0
50.409788,2.7317592,23.264348,-11.904809,-0.64745634,-5.1926989,1207.2572,0.50586133,0.028015878,0.86215975,0,0
22.896688,-1.7496363,23.289419,-6.0025099,0.66732299,-5.5028791,1210.4941,0.27504195,-0.10574159,0.95559963,0,0
28.163798,0.16086042,23.293993,-7.8610074,-0.047518878,-5.979234,1219.4178,0.44169653,0.0033129872,0.8971584,0,0
29.485363,-2.0054712,23.338955,-6.9006159,1.1178483,-4.5230704,1252.7107,0.27601661,-0.31327088,0.90866726,0,0
31.533465,1.2875323,23.346404,-8.7656833,-0.3628411,-6.1019443,1188.1171,0.45697981,0.020068767,0.88925064,0,0
32.159133,0.46585966,23.358785,-8.8363045,-0.24948299,-6.2005593,1186.8359,0.43172714,0.040152441,0.90111013,0,0
18.725601,-0.70348785,23.378442,-5.730225,-0.20348831,-6.0091238,1239.8744,0.44027685,0.12466824,0.88916485,0,0
42.983379,6.2928831,23.485003,-10.073415,-0.95675482,-4.9310067,1209.2577,0.42499936,-0.10467495,0.89912107,0,0
22.139972,3.2091459,23.563678,-5.6857285,-0.72423957,-5.5805364,1225.5408,0.23595863,-0.0058164818,0.97174569,0,0
33.114881,3.5165193,23.612149,-7.8978642,-0.32081013,-5.2679764,1211.523,0.26920159,-0.15676663,0.9502393,0,0
47.037285,5.8056415,23.636764,-10.721703,-1.1130534,-4.7265405,1198.1136,0.44084286,-0.013910918,0.89747649,0,0
31.326278,4.7954295,23.014957,-8.503899,-0.9721831,-5.8628995,1209.4084,0.43796884,-0.029381775,0.89850988,0,0.11736622
26.435459,3.2201286,23.139731,-7.2884065,-0.71415805,-5.8961853,1192.0816,0.39237972,-0.013382701,0.91970597,0,0.11247674
25.183396,-0.26344104,23.813282,-6.458553,0.48711538,-5.7139075,1186.9042,0.2393885,-0.16343949,0.9570688,0,0
23.236579,-0.6171044,23.863392,-6.7289248,0.10441513,-6.2509476,1193.3499,0.40114019,0.013552254,0.91591642,0,0
23.042672,0.34813794,23.873529,-6.903846,-0.50449812,-6.0554749,1237.2083,0.49630306,0.13103365,0.85820362,0,0
19.692684,-2.8659514,23.24458,-5.7524615,0.54599781,-5.7965749,1239.4687,0.42439038,0.04867491,0.90417009,0,0.11296772
26.890817,3.8095929,23.929718,-6.3679825,-0.47717126,-5.1022419,1256.3372,0.23235104,-0.13812167,0.96277484,0,0
16.351885,2.9079771,23.277554,-4.2313599,-0.32636739,-5.9534472,1256.3649,0.15092284,-0.1397471,0.97861793,0,0.11300381
39.981636,2.1816645,24.075909,-10.450903,-0.64702323,-5.958636,1190.016,0.50304983,0.04742979,0.86295497,0,0
34.412582,6.5050018,24.08683,-8.0935093,-0.88348046,-5.0262643,1200.3432,0.29977959,-0.1863349,0.93563428,0,0
33.551023,0.17754622,24.127478,-8.3810948,0.45579226,-5.6955181,1186.1761,0.32210029,-0.16059777,0.93298433,0,0
35.741467,3.6666795,24.159091,-8.3562569,-0.34113068,-5.1872064,1255.2887,0.31585541,-0.13000917,0.93985795,0,0
29.170855,-3.1198825,24.30051,-7.6609436,0.81366465,-5.5759911,1217.694,0.39378998,-0.040264168,0.91831816,0,0
34.162108,1.62156,24.305609,-8.4424542,-0.094100262,-5.5438309,1207.291,0.35490585,-0.0841988,0.93110279,0,0
35.318248,2.6830854,23.713833,-8.8011616,-0.44770167,-5.3929104,1235.6831,0.4393973,-0.039814713,0.89741005,0,0.12422137
42.981324,2.8960268,24.421643,-10.324785,-0.33707635,-5.5551513,1215.5313,0.44192794,-0.069767948,0.89433334,0,0
29.540375,2.9037226,23.774343,-7.4405266,-0.46010974,-5.5698848,1227.9764,0.32639326,-0.062054739,0.94319492,0,0.11957677
19.622063,0.34867014,23.773537,-5.1988734,-0.017704968,-5.8053269,1268.711,0.28467194,-0.023892094,0.95832722,0,0.11688524
13.493474,-3.1576769,23.803568,-4.5786193,0.27694609,-6.1546583,1219.8281,0.46651236,0.18694603,0.86453305,0,0.10895348
53.258024,4.6828345,24.493864,-12.400438,-0.83460065,-5.181964,1200.8245,0.54555206,-0.017687124,0.83789028,0,0
22.22217,1.1428348,24.555142,-5.378885,0.18506823,-5.674871,1216.5161,0.13435481,-0.17853987,0.97471652,0,0
28.222472,1.4341841,24.702211,-7.6636941,-0.16947541,-6.189137,1204.2217,0.40637782,-0.047025774,0.91249419,0,0
30.385214,-1.1332328,24.803503,-7.4013618,0.76967308,-5.4882298,1190.6081,0.27571147,-0.1963826,0.94096602,0,0
42.024385,-0.79184463,24.078721,-10.365176,0.42296286,-5.7494635,1227.2506,0.46118039,-0.067518229,0.88473382,0,0.12840812
41.021551,-0.76903374,22.236998,-10.670264,0.072415748,-5.8139023,1236.0084,0.49437015,0.019912338,0.86902339,1,0.43307528
25.197397,2.0278366,24.146544,-6.6925381,-0.44481978,-5.7744185,1253.2232,0.39323387,-0.0020687107,0.91943616,0,0.11936607
38.467844,3.6167806,24.159162,-9.1519995,-0.14156043,-5.4657278,1203.4287,0.33766153,-0.19326665,0.92121262,0,0.12445328
18.475284,0.92878528,24.881069,-4.9576034,-0.23583984,-6.2102576,1182.5028,0.21503519,0.0054939194,0.97659085,0,0
15.236713,-2.2484078,24.982472,-4.5372391,0.36744369,-6.3863169,1268.1421,0.34495776,0.048416633,0.93736864,0,0
26.58971,1.5285923,25.058863,-6.8920754,-0.17220099,-5.9545795,1201.7559,0.32417004,-0.061648275,0.94398796,0,0
19.990158,0.91825692,25.097926,-4.7400363,-0.14542541,-5.4765311,1248.2676,0.13543302,-0.025172302,0.99046668,0,0
33.477139,2.124673,25.100858,-8.1992868,-0.26095437,-5.6614432,1214.2431,0.33732313,-0.061600607,0.93937132,0,0
21.435338,-3.5034443,25.101429,-6.7716993,0.34284595,-6.7479308,1201.3745,0.49123756,0.13241423,0.86090193,0,0
29.456457,5.0334567,25.119787,-6.7337601,-0.89235016,-5.2415516,1271.9975,0.24085989,-0.056754303,0.9688991,0,0
20.950271,-1.006654,24.471455,-5.9229074,0.071825436,-6.0511507,1236.1607,0.40134657,0.058638433,0.9140473,0,0.11542009
36.374045,-0.93307949,25.182426,-9.5778376,0.043682232,-6.4645355,1204.5432,0.45510653,0.038458427,0.88960609,0,0
47.244377,-4.0334937,25.219764,-12.002272,0.53448493,-6.2063154,1213.4333,0.55930709,0.0058590175,0.86887104,1,0
23.635684,0.89043614,25.225604,-6.9398153,-0.38406038,-6.7362464,1205.9404,0.42607839,0.050662062,0.90326661,0,0
17.402771,6.4203403,25.301022,-4.4777763,-1.1229547,-6.5013286,1256.2341,0.17684661,-0.10507961,0.97861308,0,0
29.364872,1.7969824,25.341602,-6.9969989,-0.12252721,-5.4240694,1269.8591,0.31440609,-0.092275475,0.94479312,0,0
15.435653,1.8899225,25.449587,-3.775898,-0.056315471,-6.4591259,1195.4751,0.038091494,-0.15121427,0.98776682,0,0
25.581513,-0.31496874,25.546736,-6.230214,0.41368044,-5.6527374,1223.2848,0.24475072,-0.13439421,0.96022668,0,0
25.748073,4.0912303,25.630932,-6.0123305,-0.63767893,-5.9520278,1190.1388,0.10195714,-0.10289439,0.98945313,0,0
28.774087,3.9813379,25.659239,-6.014098,-0.0064152013,-4.9187586,1244.3702,0.033827354,-0.34540305,0.93784457,0,0
34.925363,-2.6146247,24.951149,-8.7887454,0.94809717,-5.867603,1229.0797,0.43061323,-0.12050286,0.89445587,0,0.12476952
33.098006,-2.5718602,25.695822,-7.5505304,1.146088,-4.9038959,1253.5772,0.33045601,-0.24597199,0.91120613,0,0
31.805848,7.6992497,25.747128,-7.519336,-1.2921307,-5.7117016,1216.0784,0.27404289,-0.1154772,0.9547594,0,0
22.663809,2.6966764,25.08943,-6.1555604,-0.73076438,-6.5693137,1204.0725,0.3016317,0.035339859,0.95276934,0,0.11412784
41.747304,4.9809153,25.903035,-9.6827333,-0.98917408,-5.6014046,1249.3656,0.38453349,0.0020211017,0.92310883,0,0
30.30793,0.2191337,25.936707,-7.1732327,0.59776127,-5.8100706,1190.3704,0.21339234,-0.23129513,0.94919243,0,0
43.481383,-1.8481951,25.937262,-10.515979,0.71645828,-5.9435056,1191.1622,0.44969228,-0.091832857,0.8884501,0,0
56.559802,3.0685568,25.950976,-12.694502,-0.6992725,-5.5540938,1208.1237,0.51057815,0.030234057,0.85929963,0,0
29.520581,2.0112118,26.02932,-6.45225,0.26193376,-5.1815612,1238.4051,0.12444418,-0.28464061,0.95052268,0,0
46.776515,6.6517886,25.33323,-10.781606,-1.0331097,-5.4181887,1210.0526,0.45953232,-0.080419715,0.8845127,0,0.1326601
51.048773,6.2223592,25.397258,-11.469243,-1.2011188,-5.207019,1198.9093,0.46160036,-1.4303059e-05,0.88708799,0,0.13479427
26.040715,-2.0880216,26.158425,-6.5739436,0.68580987,-5.9727353,1211.3606,0.30755157,-0.08288042,0.94791501,0,0
22.35511,1.1525682,26.16123,-6.885155,-0.91564416,-6.7331824,1229.3694,0.50384014,0.17686039,0.8454972,0,0
23.112029,1.4913744,25.485317,-6.2509011,-0.24448032,-6.5911761,1205.8907,0.31354204,-0.032141747,0.94903019,0,0.11520268
22.836919,4.156829,26.261999,-5.3088995,-0.72564084,-5.713534,1257.3313,0.16470715,-0.064458968,0.98423401,0,0
36.4713,-2.1878258,26.274325,-9.0788995,0.54365076,-6.2559297,1209.1085,0.40488742,-0.024017879,0.91405105,0,0
25.937037,1.2576893,26.305783,-5.7775084,-0.03231284,-5.3220016,1266.343,0.16208133,-0.093959763,0.98229385,0,0
37.228289,3.690046,26.352419,-8.555967,-0.37264162,-5.6928388,1212.3895,0.30252955,-0.12584661,0.94479548,0,0
32.244965,0.19509138,26.393579,-8.4635141,-0.089388695,-6.4189741,1220.2843,0.44232644,0.01328517,0.89675572,0,0
25.11662,3.5910279,26.470899,-6.220419,-0.8041979,-6.0482985,1226.4073,0.26993676,0.0076501954,0.96284766,0,0
21.71703,-0.59389681,26.499304,-6.2369766,-0.23561114,-6.4735623,1240.7409,0.43900552,0.11330152,0.89131191,0,0
36.086026,1.4801695,26.508718,-9.4450006,-0.40702189,-6.5468899,1188.9836,0.4624786,0.02413632,0.88630186,0,0
36.744166,0.60104829,26.572069,-9.5039392,-0.29059927,-6.6523321,1187.7024,0.4378611,0.042009408,0.89806062,0,0
29.340701,3.9963763,25.881305,-6.8967584,-0.56050456,-5.6293634,1257.1382,0.2719887,-0.096595922,0.95744001,0,0.12635284
34.988759,3.047265,26.59857,-7.3018721,0.20030391,-4.9958342,1216.8559,0.10864555,-0.32448444,0.93963077,0,0
37.870022,4.9563018,26.608716,-7.6479843,-0.040094274,-4.360955,1251.4413,0.1853308,-0.37851253,0.90685212,0,0
20.447945,-0.90416626,26.637393,-4.636315,0.33802488,-5.514917,1254.5902,0.11404085,-0.063174632,0.99146541,0,0
36.766861,5.411329,26.682788,-9.2140014,-1.0376457,-6.1832365,1210.335,0.44695456,-0.023329139,0.89425241,0,0
38.633698,6.9660916,26.705224,-8.7915063,-0.95990932,-5.4468632,1201.2097,0.33574722,-0.15294345,0.92945258,0,0
28.563399,-0.50776742,26.791739,-7.0618705,0.4894764,-6.1994306,1187.7706,0.27772354,-0.1317663,0.95158146,0,0
30.35543,1.3551954,26.814923,-6.8878141,0.36021967,-5.6705432,1206.066,0.181474,-0.2403614,0.95356887,0,0
30.131001,3.5820738,26.067655,-7.8921686,-0.79137177,-6.3238575,1192.9155,0.40703485,0.00079122778,0.91341229,0,0.1194779
38.8901,3.7968231,26.105408,-8.9417421,-0.40606276,-5.6405974,1256.0585,0.38095624,-0.10901954,0.91814328,0,0.13264156
22.620889,-3.1344851,26.126798,-6.2483972,0.5630856,-6.2167475,1240.3019,0.42800503,0.046325548,0.9025883,0,0.11990765
22.308516,1.1689828,26.868453,-5.6096303,-0.1629785,-6.4745706,1181.7538,0.19494832,-0.037922703,0.98008011,0,0
18.500255,3.0647139,26.244652,-4.6246901,-0.35674066,-6.3964865,1257.1993,0.18635657,-0.11748464,0.97543251,0,0.11982299
26.632256,0.61627124,27.012873,-7.454261,-0.56863567,-6.5018002,1238.0747,0.48766494,0.12406083,0.86417118,0,0
36.793906,0.0060010413,26.323908,-9.0110047,0.42886129,-6.2051284,1186.9526,0.37365397,-0.13120699,0.91824149,0,0.12377692
26.745525,-0.66509575,27.11103,-7.3074366,0.086735202,-6.7391085,1194.2164,0.40825261,0.018061949,0.91269029,0,0
39.76406,2.9084258,26.374581,-9.4561462,-0.50372354,-5.7424908,1236.517,0.45359955,-0.024531117,0.89086793,0,0.13121232
45.39235,2.5174792,27.158491,-11.192339,-0.6959337,-6.3711746,1190.8825,0.50591846,0.046204735,0.86134293,0,0
59.662257,5.1116808,27.173216,-13.215769,-0.8801061,-5.5357343,1201.691,0.54935214,-0.012922699,0.83549101,0,0
47.166497,8.5138634,27.173456,-9.4694515,-1.4632744,-4.6270453,1189.4528,0.23526856,-0.052448461,0.97051423,0,0
46.663933,-1.5199321,27.18079,-9.4705708,1.1755106,-4.2528878,1234.319,0.34171207,-0.35337957,0.87083623,0,0
37.402465,1.6611712,26.424831,-9.0636593,-0.14297208,-6.0336522,1208.0661,0.40358994,-0.062278798,0.9128179,0,0.12655296
32.135693,-3.4276069,26.447619,-8.2382077,0.81916023,-6.0673105,1218.4668,0.4570222,-0.029425225,0.88896843,0,0.12409621
20.510559,-2.1937462,27.211437,-5.4135589,0.35670721,-6.1840751,1240.6942,0.3032637,0.040691315,0.95203747,0,0
17.383412,-1.8674399,27.274295,-4.3321691,0.42660486,-5.9921636,1213.2886,0.1961617,-0.004334011,0.98056198,0,0
33.303422,3.1355481,26.525147,-8.0506706,-0.52160625,-5.9944628,1228.8359,0.36515301,-0.043193426,0.92994495,0,0.12632383
48.323453,3.0732947,27.297004,-11.043154,-0.37142783,-5.9464838,1216.3977,0.45139033,-0.056190928,0.89055564,0,0
22.260541,0.35779929,26.659508,-5.6446397,-0.032106291,-6.2169634,1269.5445,0.30544452,-0.016070608,0.95207425,0,0.12377877
25.04149,1.0528241,27.514255,-5.8991503,0.17454604,-6.1611162,1217.3826,0.18302841,-0.14701623,0.97205289,0,0
30.087537,-0.26966809,27.548327,-6.0882653,0.97655957,-5.2886412,1219.0856,-0.020846336,-0.37184248,0.92806174,0,0
44.379456,3.7004522,27.617142,-9.8941321,-0.14818262,-5.7749635,1204.3604,0.33957816,-0.16349148,0.9262598,0,0
22.810064,5.8962401,27.622612,-4.2757501,-0.45453663,-5.7523172,1266.7078,-0.14923281,-0.2753287,0.94969662,0,0
15.842266,-3.2832543,26.876076,-5.0365319,0.27672597,-6.6846728,1220.7034,0.45677117,0.16084164,0.87492289,0,0.11584949
34.248554,-1.5180609,27.662283,-8.0524093,0.76873494,-5.9463593,1191.4746,0.31116066,-0.15492548,0.93764446,0,0
48.740785,-1.061713,27.71839,-11.119915,0.43191414,-6.0086985,1228.1783,0.4666089,-0.057641553,0.88258347,0,0
22.346247,4.1024287,27.738626,-4.4412905,-0.34965707,-5.7067415,1259.3898,-0.073233012,-0.19615739,0.97783394,0,0
28.589637,2.2551599,27.017158,-7.2335922,-0.50843552,-6.2246662,1254.0939,0.3976937,0.01139116,0.91744753,0,0.12641376
32.959905,5.5050212,27.84204,-7.2798164,-0.99345714,-5.6474529,1272.864,0.26941047,-0.032295832,0.96248376,0,0
31.193686,1.502903,27.08983,-8.2254165,-0.21130341,-6.7629619,1205.0302,0.41156867,-0.03006187,0.91088282,0,0.12259996
26.755198,-1.1905113,27.939321,-5.9311717,0.52370043,-5.5904687,1265.9837,0.19512963,-0.11071549,0.97450834,0,0
22.479793,1.0008957,27.95297,-5.2201037,-0.18569022,-5.9428859,1249.1341,0.18702197,-0.010039338,0.98230443,0,0
51.553183,-0.81646966,27.957489,-11.910528,0.039452304,-6.4465706,1237.5702,0.50841218,-3.0040608e-05,0.86111384,1,0
21.63938,1.1287202,27.97022,-5.0506333,0.051179913,-6.2904085,1201.8006,0.11603717,-0.11542578,0.98651521,0,0
36.611325,2.2275568,27.256159,-8.7946471,-0.31727989,-6.1527344,1215.0157,0.39414865,-0.043569213,0.91801338,0,0.12792712
21.078316,1.0552149,28.120862,-5.4552937,-0.26973554,-6.748483,1183.3693,0.24914341,0.011266024,0.96840107,0,0
29.274389,1.5990668,27.367827,-7.4327469,-0.22288345,-6.4927063,1202.5364,0.36173636,-0.040134928,0.93141612,0,0.12188937
32.013056,1.8469656,27.383806,-7.5095145,-0.17506897,-5.9144387,1270.6392,0.35466876,-0.066146273,0.93264931,0,0.13140816
23.9263,-1.3556309,28.167055,-5.0796931,0.54559892,-5.4833494,1247.3918,0.059145718,-0.12089816,0.99090132,0,0
31.921802,3.9978543,28.226413,-6.5767112,-0.059268576,-5.3497663,1245.2366,0.093382982,-0.29309636,0.95151151,0,0
37.036444,-3.150983,28.24243,-8.2038832,1.1703677,-5.2820707,1254.4437,0.36821096,-0.20107039,0.90773971,0,0
23.963462,-1.0351789,27.484421,-6.455967,0.045764212,-6.5440821,1237.0418,0.40969958,0.058134746,0.9103662,0,0.12247284
17.597124,-2.4393964,28.294344,-4.9040686,0.39688377,-6.8610811,1269.0086,0.33974261,0.038703305,0.93972177,0,0
31.400227,3.3500018,28.338187,-6.6867712,-0.31108683,-5.5003093,1261.2751,0.18534863,-0.13202921,0.97376289,0,0
53.432592,-4.3036535,28.417448,-12.750133,0.54700275,-6.5844101,1214.2998,0.54051216,-0.00064860493,0.84133595,1,0
19.509971,-3.8041252,28.474807,-4.4781309,1.1233445,-6.1207637,1225.3479,0.11378737,-0.12362157,0.98578402,0,0
28.836761,-0.51853035,28.487572,-6.7912933,0.39976351,-6.1102993,1224.1513,0.27975942,-0.10360895,0.95446312,0,0
41.328075,-0.94938412,28.522915,-10.238024,0.021992961,-6.897382,1205.4097,0.46971938,-1.9319937e-06,0.88281578,1,0
28.41137,-1.788891,28.576415,-5.6192402,1.1178586,-5.1057672,1261.982,0.01196172,-0.33417712,0.94243438,0,0
24.954693,-3.6796953,28.599811,-7.3061608,0.36188726,-7.2452133,1202.2409,0.39302156,-0.0001009045,0.91952925,1,0
40.610363,-3.2225337,28.671173,-9.4991684,0.99302528,-6.1907949,1230.0289,0.42662578,-0.099927138,0.89889099,0,0
19.733971,6.9984598,28.673317,-4.8467324,-1.1896132,-6.9877816,1257.1005,0.19496772,-0.088368599,0.97682065,0,0
35.717553,8.3690713,28.713458,-8.1275867,-1.386222,-6.1534296,1216.9449,0.28242728,-0.086362469,0.9553933,0,0
27.244417,1.0934061,28.715015,-7.4949981,-0.4282651,-7.2213595,1206.8069,0.427083,0.050357711,0.90280907,0,0
58.559801,7.0061881,28.727855,-12.323084,-1.2863125,-5.4550668,1199.8465,0.44130785,0.0051850157,0.89734079,0,0
32.89001,1.8909228,28.72812,-7.025475,0.21976207,-5.6134191,1239.2715,0.18711349,-0.21836736,0.95776001,0,0
28.894654,4.425836,28.732641,-6.5732944,-0.7008809,-6.4549572,1191.0052,0.15495466,-0.081119854,0.98458551,0,0
52.203788,7.1634255,27.994229,-11.516123,-1.0972595,-5.7577702,1210.8861,0.47498614,-0.06630081,0.87749209,0,0.13964428
46.754205,5.4944833,28.797517,-10.344283,-1.0644154,-5.9767251,1250.232,0.42958999,0.010653198,0.90296121,0,0
16.940178,1.9127717,28.002584,-4.1580242,-0.085255335,-7.0816765,1196.2685,0.10129965,-0.12346893,0.98716453,0,0.11572603
63.103416,3.4307013,28.818795,-13.479088,-0.74924165,-5.9175189,1208.9901,0.51353734,0.031590737,0.85748553,0,0
27.797721,-1.9048339,28.841428,-5.9200302,0.82553183,-5.6435013,1246.3663,0.1269942,-0.17498622,0.9763464,0,0
26.921851,2.2889682,28.847317,-6.1326933,-0.40918258,-6.0629321,1230.3695,0.20837404,-0.024090051,0.97775249,0,0
41.863474,4.988275,28.880627,-8.3260273,-0.087144137,-4.7265134,1252.3078,0.24256106,-0.32600853,0.91371909,0,0
22.074279,7.3173204,28.914469,-4.2590961,-0.95435803,-5.9395298,1263.9084,-0.083840767,-0.1979624,0.97661743,0,0
34.049826,-0.078461571,28.959816,-7.7946641,0.59148828,-6.2819093,1191.2368,0.25347312,-0.18920616,0.94865821,0,0
48.923415,-2.2084382,29.012664,-11.251746,0.72515051,-6.3581663,1192.0286,0.45885838,-0.07485165,0.8853509,0,0
28.953337,1.2867515,29.074857,-6.2874101,-0.084793424,-5.7542293,1267.2094,0.20399333,-0.06383837,0.97688862,0,0
