195.27825,-11.086849,113.93061,-19.61139,1.7860909,-14.526382,1256.3635
204.0499,-12.22114,113.97776,-20.707776,1.8297924,-14.293036,1256.7097
161.01624,1.0089756,114.0128,-19.497679,-0.24770285,-13.868156,1253.786
178.3287,-3.6471633,114.11921,-20.988188,0.18227319,-13.578432,1257.717
126.84475,0.21907956,114.17413,-16.156879,-0.1638003,-14.826447,1229.8471
115.7215,4.6924602,114.19104,-15.837493,-0.48389268,-15.162528,1217.8542
214.66906,-10.220286,114.22501,-23.60087,1.3310559,-13.77134,1234.7934
122.54189,2.2920975,114.31268,-16.450442,-0.36780607,-15.099455,1212.5777
167.85693,-12.688314,114.35033,-17.959209,1.7724537,-14.678423,1254.097
146.5731,-16.624507,114.35524,-18.598025,1.7968686,-14.986861,1194.9554
170.71317,-3.2636028,114.43441,-20.173847,0.2775542,-14.243568,1233.019
102.94241,5.8913892,114.50657,-13.300636,-0.69692787,-14.522525,1273.8335
134.44609,13.453959,114.55004,-16.740062,-1.4374477,-14.169856,1264.1789
141.57712,20.455662,114.8104,-17.912047,-2.4387601,-14.362926,1230.635
107.57467,7.008502,114.98798,-15.655148,1.3001954,-16.763339,1204.5309
113.69199,-12.795611,115.14394,-14.099849,1.0125288,-15.621925,1212.648
130.69664,21.743586,115.2214,-17.189333,-2.5863802,-15.386838,1197.3849
155.39093,-4.0021531,115.25837,-18.978198,0.50253977,-14.73174,1212.4761
167.822,2.7107586,115.32898,-19.844951,-0.21818766,-13.982422,1252.8226
111.06937,0.16234447,115.33829,-15.430916,0.14489543,-15.872775,1194.0468
150.80657,4.2946926,115.48144,-18.581974,-0.57860072,-14.157198,1250.4977
136.35626,11.754688,115.48844,-16.719711,-1.3680046,-14.064704,1276.5845
172.5536,2.7078293,115.50716,-20.078028,-0.33436879,-13.52895,1277.8971
169.14547,-12.974862,115.54982,-14.880566,1.6274561,-15.203449,1278.6314
158.71038,8.7178848,115.59163,-18.727198,-0.8239325,-13.696852,1281.8131
119.62828,36.978655,115.61567,-11.501792,20.079572,-28.349899,1206.9089
110.71131,-8.6893264,115.64491,-14.066338,0.74518634,-15.392604,1213.6135
161.56099,5.4819327,115.70849,-19.327551,-0.50071184,-13.880113,1262.6886
133.07383,-7.9436623,115.72404,-14.890799,0.73274641,-15.020034,1252.9621
175.82817,-1.2936076,115.77629,-20.616217,0.32083457,-14.258469,1234.0401
161.59565,-5.091522,115.98226,-18.672205,0.54478128,-14.023622,1271.7904
181.54837,-10.271264,116.01288,-20.848111,0.86900806,-13.767803,1262.0181
101.23854,1.1799844,116.01518,-13.134056,-0.16305239,-14.557254,1279.9907
154.74746,-4.665657,116.04046,-19.319495,0.52015953,-14.873047,1200.4603
163.19833,28.275497,116.12847,-18.94029,-2.7816895,-13.508797,1292.9887
97.336136,-2.4584763,116.1546,-12.474511,0.0085704976,-15.229551,1240.6887
88.929587,-22.218822,116.15596,-12.277519,2.4518005,-14.817336,1264.6901
206.40186,-6.6540024,116.2673,-23.246632,0.90845853,-14.059059,1226.0838
189.58488,27.111995,116.33276,-22.739813,-2.834556,-14.153663,1212.3237
219.60857,9.6707278,116.33414,-24.813771,-1.0621706,-13.563811,1229.6165
189.43115,-12.550781,116.36503,-17.236709,1.7691215,-14.682909,1288.5339
131.2023,-1.0441611,116.50721,-15.648213,-0.23376388,-14.952307,1248.6612
137.7087,-7.7917233,116.55201,-17.092464,0.83475607,-14.976,1226.8167
166.46548,-6.2798665,116.59495,-19.482495,0.54626364,-14.426786,1240.8077
168.14073,-19.02922,116.69376,-19.780276,2.0227606,-14.663238,1225.0048
146.03898,14.021766,116.90153,-18.660756,-1.3615941,-15.079077,1212.0165
101.41898,15.543244,117.16409,-14.058572,-1.4395892,-16.00526,1209.3346
91.234688,-10.077526,117.22176,-14.04384,1.7206847,-15.721278,1215.6955
88.222926,8.2011173,117.2898,-11.824491,-1.1790452,-15.218387,1255.3215
166.37869,7.1736499,117.33089,-20.262781,-0.87655194,-14.285757,1233.5295
131.85752,13.984669,117.4252,-16.21157,-1.452928,-14.305391,1274.4856
184.93589,16.320724,117.47374,-22.27862,-1.8215458,-14.243985,1204.6489
164.90857,0.81642847,117.49359,-19.899785,-0.17267439,-14.710842,1209.2008
140.78508,-2.0931094,117.71656,-17.172938,0.1021854,-14.12763,1277.2272
145.48629,-16.718165,117.72217,-17.725564,1.6990002,-15.324899,1210.8376
134.59694,-12.554331,117.97394,-12.825183,1.1039906,-15.380069,1272.0998
184.75333,1.3710601,118.10423,-20.873281,-0.13820998,-13.557512,1281.7662
193.20813,-11.597774,118.15788,-20.420747,1.2948995,-14.020174,1279.5825
95.253929,-18.558217,118.17587,-13.096927,2.0507272,-14.933729,1261.0105
133.37071,3.7076567,118.31825,-16.278925,-0.45435541,-14.183662,1285.8077
140.98903,7.9758106,118.41512,-17.476463,-0.98456734,-14.544759,1250.2848
203.69955,-21.683157,118.44986,-21.877646,2.6628702,-14.836094,1210.6172
103.49313,-10.681813,118.47174,-13.85017,1.1842469,-15.669804,1222.8405
103.73953,36.865966,118.63493,-7.0793857,17.387598,-29.447896,1203.6506
132.42052,-16.323787,118.764,-16.860994,1.7835257,-15.075558,1230.3856
150.30969,-10.654373,118.81414,-18.625243,1.2311126,-15.169522,1209.0784
186.54324,18.76781,118.95238,-21.006943,-1.6554796,-13.599216,1280.7254
122.72348,-8.1236603,119.05698,-16.019364,0.66583722,-15.577873,1196.8733
104.12575,-15.480936,119.11451,-14.936465,1.8886303,-15.744358,1207.6241
212.49481,-9.4206903,119.22688,-23.742187,1.2099076,-14.321115,1218.6183
88.367707,-11.211174,119.24827,-14.392268,2.4305725,-16.473546,1200.3471
154.32999,-1.4791722,119.28004,-18.71659,-0.13403871,-14.731329,1231.0334
225.68438,-11.740821,119.37619,-17.135654,2.4675443,-15.640317,1293.1581
137.19227,-7.420383,119.48787,-15.499859,0.68208523,-14.874391,1271.3185
130.95225,-6.2939139,119.50525,-14.86236,0.45021255,-15.209889,1253.3652
154.29448,4.4501769,119.50969,-19.372836,-0.64595625,-14.909335,1210.6429
124.1195,2.9497861,119.63983,-15.382475,-0.28225394,-14.526483,1278.1562
147.81777,-7.9516307,119.70135,-17.516353,0.82383354,-15.101892,1234.4037
131.10995,-1.0971719,119.96343,-16.004244,0.0049874739,-14.453365,1279.633
118.05381,-9.9126409,120.10857,-12.782831,0.76308654,-15.555883,1260.4333
144.3108,12.499377,120.11318,-17.916916,-1.5489508,-14.734132,1238.9026
143.12729,-2.5196112,120.21488,-16.719624,-0.046941778,-15.110877,1244.3724
145.79398,-10.080132,120.42541,-16.896905,0.93693677,-14.760765,1265.4462
205.73011,8.6319459,120.45901,-23.768689,-0.76737219,-14.557713,1200.8681
158.47207,2.2176673,120.58163,-18.452493,-0.16525058,-14.179241,1278.3294
188.97142,-3.7342801,121.00919,-21.582307,0.16587312,-13.981507,1258.5835
170.90769,1.1373927,121.05175,-20.06783,-0.26615416,-14.2876,1254.6524
156.37949,-14.741009,121.17047,-18.690365,1.4225159,-15.360538,1207.2888
86.31098,11.537383,121.25377,-12.68314,0.42973941,-16.385901,1234.4806
205.15515,-12.002101,121.32395,-19.89424,1.8746291,-15.04707,1257.2299
180.93549,-3.4024369,121.67153,-20.714482,0.27769599,-14.705062,1233.8855
135.04357,0.30450296,121.71154,-16.636977,-0.17815949,-15.323511,1230.7135
142.94478,14.177642,121.74301,-17.254683,-1.456945,-14.601847,1265.0454
176.90579,-13.593636,121.82238,-18.232892,1.8487164,-15.21043,1254.9635
109.70429,6.242423,121.88021,-13.74685,-0.70704948,-14.971847,1274.7
123.76794,4.9450939,121.88735,-16.348385,-0.52706364,-15.623131,1218.7207
156.01096,-17.529949,121.97245,-19.152968,1.8244049,-15.481915,1195.8219
130.89881,2.484331,121.98149,-16.976975,-0.40168872,-15.575997,1213.4442
150.67517,21.684778,122.10833,-18.479876,-2.477023,-14.828212,1231.5015
182.73313,2.8777111,122.37027,-20.639796,-0.34519088,-13.923486,1278.7636
260.44751,-11.162361,122.47266,-19.369299,4.9356828,-19.76732,1293.8612
168.20768,9.1306635,122.54077,-19.261829,-0.82693566,-14.099667,1282.6796
144.84202,12.448155,122.62599,-17.22341,-1.4058253,-14.485287,1277.451
160.23743,4.5896408,122.66706,-19.141293,-0.60131382,-14.58514,1251.3642
165.0156,-4.2585916,122.74511,-19.519858,0.52340707,-15.21512,1213.3426
171.36603,5.7317502,122.75129,-19.892522,-0.498318,-14.290989,1263.555
172.80168,29.67443,122.98007,-19.472883,-2.8133442,-13.897555,1293.8551
192.11126,-10.705032,123.00129,-21.402612,0.86568438,-14.186046,1262.8846
139.42724,23.063465,123.03117,-17.734217,-2.6933134,-15.852839,1198.2513
120.8377,-13.298523,123.09104,-14.481948,0.99858662,-16.166255,1213.5145
171.05185,-5.3672097,123.10374,-19.151562,0.55790455,-14.462498,1272.6569
232.17978,10.209467,123.21691,-25.470125,-1.0928543,-13.9675,1230.483
176.58944,-13.798787,123.29966,-14.884508,1.6666456,-15.800722,1279.4978
140.60314,-8.3114501,123.36269,-15.224978,0.73832038,-15.534619,1253.8286
118.90856,0.098824541,123.39189,-15.926087,0.10907259,-16.34281,1194.9133
107.91704,1.2628014,123.40397,-13.580013,-0.16826033,-14.997752,1280.8571
115.51302,6.4665351,123.42556,-16.096177,0.89127359,-17.001538,1205.3974
117.86174,-9.0657659,123.4743,-14.534624,0.76085877,-15.924494,1214.48
201.12295,28.543577,123.5101,-23.412363,-2.8911133,-14.555767,1213.1902
164.55187,-4.9294596,123.59788,-19.897694,0.53503825,-15.356489,1201.3267
95.186149,-23.452404,123.6769,-12.749092,2.4818547,-15.266301,1265.5565
198.11766,-13.452396,123.82654,-17.511122,1.836523,-15.162324,1289.4004
103.68446,-2.4618962,123.89699,-12.917532,0.0050383425,-15.739926,1241.5552
139.11225,-0.9210998,124.04397,-16.033809,-0.25489355,-15.260339,1249.4053
178.1541,-20.049573,124.14716,-20.271709,2.0580824,-15.15073,1225.8712
146.37442,-8.2126792,124.16346,-17.569142,0.84879484,-15.470056,1227.6832
155.50918,14.714273,124.55267,-19.220056,-1.4083945,-15.526017,1212.8829
176.6597,7.6193143,124.58091,-20.861067,-0.90624465,-14.714204,1234.3959
140.087,14.715341,124.68507,-16.706379,-1.4694099,-14.733913,1275.3521
196.23684,17.238554,124.70761,-22.924462,-1.848958,-14.691302,1205.5154
149.50255,-2.1413728,124.88351,-17.696859,0.090641586,-14.540071,1278.0937
175.00172,0.90309125,124.96927,-20.472221,-0.1735622,-15.191645,1210.0673
195.33016,1.4401245,124.98077,-21.433572,-0.13799139,-13.948697,1282.6327
94.235926,8.8049449,125.02154,-12.226461,-1.2371706,-15.708894,1256.1879
98.363883,-10.935491,125.20557,-14.470794,1.7103466,-16.215417,1216.562
127.52608,32.132515,125.23365,-14.038649,6.9099447,-22.306622,1203.242
108.56242,16.287504,125.27403,-14.516428,-1.5355204,-16.437081,1210.2011
203.52718,-12.254287,125.27956,-20.854539,1.3308405,-14.466655,1280.4489
141.63483,3.9385142,125.51347,-16.777525,-0.46913017,-14.597046,1286.6741
154.46097,-17.573193,125.51461,-18.171574,1.7205311,-15.845061,1211.704
101.9159,-19.590009,125.75919,-13.54916,2.0758164,-15.400328,1261.877
141.05995,-13.103511,125.79331,-13.027192,1.0920313,-15.896759,1272.9663
149.86092,8.4754119,125.79737,-18.011043,-1.0138231,-14.984036,1251.1512
140.96811,-17.223077,126.4258,-17.326833,1.8131714,-15.572504,1231.2521
110.52078,-11.27596,126.43546,-14.258968,1.1917003,-16.18543,1223.7069
224.51054,-10.0362,126.50214,-24.318945,1.2520362,-14.780519,1219.4848
159.75229,-11.277715,126.52237,-19.143949,1.2619863,-15.663662,1209.9448
163.82821,-1.4059874,126.7597,-19.276067,-0.15889774,-15.187062,1231.8999
130.86866,-8.4576223,126.9756,-16.561032,0.66988237,-16.096205,1197.7398
131.9315,3.0904983,127.01035,-15.865473,-0.2804809,-14.955426,1279.0227
145.03424,-7.7613676,127.04461,-15.867135,0.68152334,-15.352528,1272.1849
164.13122,4.7793225,127.07911,-19.974045,-0.67075808,-15.368089,1211.5093
111.71597,-16.429786,127.11304,-15.4226,1.9057623,-16.25055,1208.4906
138.47763,-6.5171745,127.23608,-15.237901,0.44265702,-15.713562,1254.2316
139.2337,-1.0964552,127.29651,-16.490608,-0.0080745436,-14.878872,1280.4995
234.18771,-12.998624,127.33642,-16.846824,2.5676931,-16.305937,1293.9022
156.68683,-8.3667629,127.37704,-17.95826,0.8364262,-15.601175,1235.2702
153.40785,13.284507,127.59142,-18.471317,-1.5913925,-15.178505,1239.7691
95.666908,-12.405732,127.59896,-14.802939,2.3488385,-16.932504,1201.2135
167.82659,2.2984574,127.77545,-18.965131,-0.15775442,-14.596086,1279.1959
217.7746,9.0151827,127.85068,-24.40849,-0.76510285,-15.009026,1201.7346
151.58961,-2.4880827,127.89848,-17.126845,-0.079889121,-15.624526,1245.2389
154.34795,-10.548285,127.92283,-17.317801,0.93510077,-15.229122,1266.3126
124.50579,-10.288251,128.02156,-13.021501,0.73813763,-16.097225,1261.2997
165.85598,-15.454838,128.9735,-19.21568,1.4322673,-15.851165,1208.1553
215.17059,-12.961052,128.97774,-20.165936,1.9606597,-15.568069,1258.0964
191.42665,-3.5411944,129.13966,-21.249162,0.27722537,-15.167646,1234.7519
151.70079,14.910518,129.15168,-17.769423,-1.4741743,-15.032636,1265.9119
125.56821,27.792163,129.33948,-12.510564,15.763514,-26.211074,1207.7754
193.19308,3.0530544,129.43065,-21.199673,-0.3562141,-14.317999,1279.63
116.68922,6.5982702,129.47826,-14.192794,-0.71617955,-15.42018,1275.5665
143.48018,0.39756753,129.498,-17.107969,-0.19445074,-15.822674,1231.58
92.753265,11.389883,129.54173,-13.083587,0.16976022,-16.77079,1235.347
186.08634,-14.536822,129.56143,-18.486105,1.9237505,-15.746363,1255.8299
160.05678,22.931924,129.63805,-19.046391,-2.5108116,-15.290137,1232.368
177.97202,9.5445539,129.69123,-19.79531,-0.82837153,-14.502101,1283.546
132.07004,5.2199527,129.81461,-16.860148,-0.57275811,-16.086258,1219.5872
165.72562,-18.448349,129.83712,-19.705291,1.8486332,-15.976737,1196.6883
139.51861,2.6943879,129.8889,-17.501995,-0.43911084,-16.053816,1214.3107
153.57979,13.160451,129.97349,-17.727792,-1.4432765,-14.904464,1278.3174
181.45342,5.9799885,129.99935,-20.456951,-0.49438286,-14.701087,1264.4215
169.9477,4.8961338,130.06645,-19.699611,-0.62477583,-15.012299,1252.2307
202.95005,-11.136538,130.19918,-21.951668,0.85994815,-14.605792,1263.751
180.74615,-5.649346,130.445,-19.624657,0.57055433,-14.902751,1273.5233
174.91015,-4.5257495,130.47334,-20.057804,0.54538972,-15.697601,1214.2091
212.99707,30.002346,130.8887,-24.083886,-2.9431889,-14.958866,1214.0566
114.8186,1.3482998,131.01277,-14.026288,-0.17379127,-15.437264,1281.7236
148.4322,24.43705,131.07469,-18.287003,-2.8011296,-16.321519,1199.1178
128.16335,-13.795739,131.24117,-14.859396,0.99157564,-16.506622,1214.2586
148.29732,-8.6818574,131.25871,-15.550409,0.74315769,-16.049495,1254.6951
184.0154,-14.639212,131.35723,-14.801969,1.6921698,-16.437675,1280.3643
174.64469,-5.2006555,131.39683,-20.473114,0.54968522,-15.839216,1202.1932
101.67895,-24.699944,131.42221,-13.222241,2.507602,-15.714939,1266.423
125.24513,-9.4504137,131.56896,-14.998177,0.77787929,-16.453694,1215.3464
126.9957,0.05338941,131.68225,-16.42264,0.072558323,-16.81962,1195.7798
147.24656,-0.78943372,131.79419,-16.502932,-0.27151736,-15.740263,1250.2718
110.25224,-2.463345,131.89452,-13.352136,0.00050818756,-16.250214,1242.4216
123.66991,6.0980728,132.00149,-16.531388,0.59639581,-17.310959,1206.2638
155.27646,-8.6401976,132.02234,-18.037709,0.86095012,-15.965667,1228.5497
187.23956,8.0800326,132.04496,-21.458151,-0.93674834,-15.141858,1235.2624
148.56394,15.453692,132.15892,-17.20141,-1.4836144,-15.161268,1276.2186
207.85962,18.168753,132.1649,-23.565938,-1.8709039,-15.137771,1206.3819
269.85927,-13.499445,132.3946,-18.280012,4.4379034,-19.927355,1294.1161
165.25906,15.43007,132.42804,-19.779492,-1.4546676,-15.975881,1213.7494
150.14824,4.1768458,132.91513,-17.276143,-0.48425086,-15.009437,1287.5406
100.44817,9.4393632,132.99909,-12.621288,-1.30163,-16.201688,1257.0544
107.4489,28.553359,133.01641,-7.7914162,15.792146,-28.037913,1203.9055
159.00003,8.9896032,133.39895,-18.54537,-1.0428985,-15.422068,1252.0177
105.70314,-11.786958,133.43869,-14.884012,1.6946342,-16.718392,1217.4285
163.65626,-18.438035,133.56737,-18.608208,1.7381734,-16.366059,1212.5705
108.8009,-20.633347,133.57712,-13.988529,2.0968729,-15.872341,1262.7434
115.93666,17.076795,133.60366,-14.981629,-1.6198572,-16.883543,1211.0675
147.62481,-13.645566,133.86994,-13.233218,1.0753948,-16.408946,1273.8327
149.74461,-18.136444,134.33747,-17.776531,1.8397878,-16.075065,1232.1186
169.45237,-11.916048,134.47808,-19.655157,1.2910317,-16.159443,1210.8113
139.98492,3.2301475,134.59512,-16.348155,-0.27800492,-15.383522,1279.8892
117.75058,-11.872813,134.65749,-14.658856,1.1950323,-16.702927,1224.5734
153.05857,-8.1015361,134.84036,-16.229504,0.67878565,-15.830395,1273.0514
147.60038,-1.0888555,134.8422,-16.975951,-0.02255804,-15.303786,1281.366
174.26845,5.1210754,134.87752,-20.574798,-0.69638424,-15.825295,1212.3758
139.28418,-8.7933343,135.15282,-17.100722,0.67270554,-16.612347,1198.6063
177.43675,2.3752586,135.17775,-19.475111,-0.14929845,-15.013108,1280.0624
146.18883,-6.7363384,135.21896,-15.605674,0.43373217,-16.218104,1255.0981
165.77433,-8.7877391,135.30285,-18.390188,0.84715152,-16.102323,1236.1366
119.54638,-17.385608,135.36587,-15.897131,1.9164843,-16.7615,1209.3571
135.25809,30.20501,135.5796,-16.444297,1.8874898,-19.716828,1204.1084
160.251,-2.4388352,135.84057,-17.51559,-0.11806377,-16.144984,1246.1054
103.16889,-13.560899,136.18388,-15.203269,2.2723785,-17.409736,1202.08
131.07108,-10.649245,136.20723,-13.23522,0.70413205,-16.647028,1262.1662
203.93246,3.2339582,136.68828,-21.757499,-0.36743117,-14.712536,1280.4965
160.71427,15.651388,136.77543,-18.284584,-1.488887,-15.462117,1266.7783
202.18363,-3.6795377,136.83935,-21.777817,0.2760236,-15.631275,1235.6184
188.00279,9.9587621,137.04281,-20.327576,-0.82820288,-14.904172,1284.4125
123.89704,6.958431,137.30022,-14.63848,-0.72429964,-15.867501,1276.4329
169.7214,24.194762,137.39797,-19.611989,-2.5397312,-15.749094,1233.2344
162.57001,13.89132,137.53019,-18.233291,-1.4800687,-15.322051,1279.1839
152.14993,0.49937364,137.53461,-17.569519,-0.21321228,-16.324131,1232.4465
195.38864,-15.517003,137.5693,-18.72017,1.9965293,-16.285573,1256.6964
179.9369,5.2145383,137.67921,-20.257071,-0.64895267,-15.43861,1253.0971
175.71588,-19.377958,137.94912,-20.255463,1.8691907,-16.471196,1197.5548
140.62823,5.5182487,137.97395,-17.372769,-0.62078707,-16.551373,1220.4536
190.67547,-5.9376623,138.0067,-20.091636,0.58260651,-15.344223,1274.3898
99.392838,11.359289,138.02879,-13.473712,-0.040872515,-17.180671,1236.2135
148.40056,2.9240561,138.03548,-18.025583,-0.48014585,-16.532612,1215.1771
225.17151,31.479998,138.41253,-24.647464,-2.9621701,-15.21175,1214.8008
121.94335,1.4366606,138.84108,-14.472708,-0.17972079,-15.875812,1282.5901
157.71582,25.864673,139.35284,-18.849068,-2.9094069,-16.791067,1199.9842
108.40837,-25.959243,139.39192,-13.69523,2.5288656,-16.164032,1267.2895
156.15223,-9.0544135,139.41219,-15.868076,0.74685291,-16.564422,1255.5615
185.02453,-5.4790608,139.43699,-21.045855,0.56384068,-16.321285,1203.0596
135.70813,-14.289967,139.62498,-15.320359,0.98516815,-17.027749,1215.1251
191.39104,-15.488544,139.68719,-14.746787,1.7089108,-16.85785,1281.1084
155.61469,-0.64983408,139.78393,-16.969193,-0.28665849,-16.218413,1251.1382
219.802,19.108413,139.84533,-24.202834,-1.8867017,-15.583893,1207.2483
157.28849,16.198537,139.84613,-17.696909,-1.4953593,-15.587359,1277.085
132.85916,-9.8437374,139.92758,-15.457259,0.79544713,-16.980408,1216.2129
117.03501,-2.4620454,140.14731,-13.777393,-0.0061343562,-16.761084,1243.2881
135.3314,0.026382959,140.21248,-16.920374,0.035357553,-17.302102,1196.6462
158.91098,4.4228221,140.52273,-17.774823,-0.49970662,-15.420793,1288.407
175.28867,16.168762,140.52898,-20.338901,-1.4998932,-16.428209,1214.6159
132.04497,5.8584274,140.74409,-16.969777,0.37100907,-17.66524,1207.1303
132.64353,22.698093,141.1757,-15.621857,5.404912,-21.402159,1208.6419
168.40631,9.5182493,141.21921,-19.079806,-1.0716139,-15.85873,1252.8841
106.85581,10.107915,141.22372,-13.007844,-1.3739852,-16.697352,1257.9209
115.90166,-21.686154,141.63265,-14.411576,2.1136516,-16.350915,1263.6099
173.06783,-19.310619,141.88065,-19.036936,1.7514231,-16.88695,1213.4369
113.2455,-12.629165,141.92527,-15.283158,1.6732782,-17.229077,1218.2949
123.54512,17.905529,142.15955,-15.453124,-1.6934061,-17.341643,1211.934
154.29459,-14.178017,142.20135,-13.44761,1.0535325,-16.915781,1274.6992
278.73097,-15.622432,142.40401,-17.211161,4.0713803,-20.111593,1294.3709
158.74175,-19.062298,142.50183,-18.209237,1.8630734,-16.583257,1232.985
156.20949,-1.0736435,142.60019,-17.460304,-0.038532512,-15.728058,1282.2324
179.40621,-12.568395,142.68207,-20.159052,1.3180112,-16.656747,1211.6777
187.30123,2.4475966,142.78859,-19.982366,-0.13990564,-15.430305,1280.9288
125.17823,-12.470257,143.13861,-15.050514,1.1940426,-17.221698,1225.4399
154.08196,-6.9505703,143.45439,-15.965568,0.42282569,-16.723803,1255.9645
147.96907,-9.1299899,143.5876,-17.638587,0.67354551,-17.126443,1199.4727
127.61106,-18.345152,143.87527,-16.359658,1.9206326,-17.27674,1210.2235
198.29937,10.372482,144.59535,-20.858525,-0.8264189,-15.305915,1285.2789
137.73572,-10.990209,144.67059,-13.417694,0.65728123,-17.208611,1263.0327
110.86836,-14.678464,145.01113,-15.592922,2.1980367,-17.901282,1202.9465
143.75134,29.738378,145.2734,-17.435534,0.18651619,-19.192747,1204.9749
171.81334,14.640358,145.29524,-18.740314,-1.5159121,-15.737887,1280.0503
131.32767,7.3223929,145.34558,-15.084002,-0.73137858,-16.313754,1277.2994
179.66866,25.470778,145.3867,-20.176931,-2.5634919,-16.205451,1234.1009
112.19367,22.406012,146.09273,-11.911792,7.3215528,-23.655858,1204.6496
237.65746,32.963184,146.12715,-25.295632,-2.969291,-15.646779,1215.6672
185.98081,-20.316872,146.30823,-20.804012,1.8858264,-16.965133,1198.4213
149.44297,5.8411134,146.36623,-17.886356,-0.67101502,-17.017957,1221.3201
157.54398,3.1751621,146.42163,-18.547928,-0.52487645,-17.012077,1216.0436
106.22642,11.42487,146.72531,-13.860458,-0.21670847,-17.607721,1237.08
129.29132,1.5280977,146.88842,-14.919199,-0.18610291,-16.313378,1283.4565
115.37378,-27.228031,147.58648,-14.165842,2.5455492,-16.614517,1268.1559
195.6901,-5.7643818,147.71802,-21.616021,0.57732594,-16.802759,1203.9261
166.26096,16.948608,147.74605,-18.193094,-1.5044988,-16.012105,1277.9515
164.16427,-9.428451,147.82311,-16.179129,0.74902317,-17.079187,1256.428
167.28308,27.346474,147.86565,-19.421802,-3.0177891,-17.259942,1200.8507
198.76287,-16.347831,148.264,-14.727844,1.7253641,-17.455833,1281.9749
143.48449,-14.780681,148.26803,-15.785927,0.97743425,-17.543626,1215.9915
167.92309,4.6766055,148.33574,-18.273642,-0.51547432,-15.83106,1289.2735
140.70172,-10.245845,148.54896,-15.912421,0.81292531,-17.50473,1217.0793
124.02791,-2.4566586,148.6558,-14.192517,-0.016025546,-17.273113,1244.1546
185.59794,16.929714,148.85661,-20.89814,-1.5436519,-16.882626,1215.4823
143.91627,0.018149556,148.98514,-17.419264,-0.0025350532,-17.78921,1197.5127
140.64094,5.7193323,149.67192,-17.415428,0.19139562,-18.050157,1207.9968
113.45444,10.815026,149.69703,-13.385097,-1.4562263,-17.196488,1258.7873
123.20911,-22.746234,149.92933,-14.814767,2.1259295,-16.837072,1264.4764
182.6922,-20.188641,150.45411,-19.459795,1.75987,-17.406584,1214.3034
165.06054,-1.0500627,150.57014,-17.943778,-0.056037265,-16.151609,1283.0989
120.98395,-13.459259,150.66885,-15.668492,1.6461821,-17.746102,1219.1614
161.07465,-14.698132,150.78466,-13.675153,1.0259891,-17.416381,1275.5656
167.95088,-19.9989,150.92164,-18.624502,1.88273,-17.096818,1233.8515
131.39072,18.768476,150.94683,-15.93014,-1.7568027,-17.808704,1212.8005
189.61024,-13.233683,151.13506,-20.655981,1.3427808,-17.155388,1212.5442
140.82475,20.99058,151.43064,-16.926314,2.0432575,-19.976211,1209.5083
132.7999,-13.066107,151.87928,-15.435164,1.1886563,-17.740975,1226.3063
162.15302,-7.1587083,151.94303,-16.317316,0.40923362,-17.231082,1256.831
156.9225,-9.4664363,152.27893,-18.174906,0.67178151,-17.638566,1200.3392
287.07656,-17.586583,152.50572,-16.178524,3.7980382,-20.293389,1294.6258
135.90401,-19.305117,152.64322,-16.810294,1.9181734,-17.795541,1211.09
144.48818,-11.308508,153.36492,-13.636471,0.62561038,-17.550152,1263.7768
189.89825,26.757353,153.60304,-20.741361,-2.5819582,-16.659539,1234.9674
138.98105,7.6896255,153.61378,-15.529536,-0.7373746,-16.758849,1278.1659
250.46638,34.447958,154.05937,-25.939371,-2.9685889,-16.08215,1216.5337
118.76005,-15.758972,154.08699,-15.972283,2.1239361,-18.403574,1203.8129
152.63883,29.888022,154.85276,-18.087806,-0.71063557,-19.167244,1205.8413
158.51479,6.1896235,154.99207,-18.401107,-0.72336046,-17.485516,1222.1865
166.94832,3.4495768,155.04762,-19.069293,-0.57339697,-17.49191,1216.9101
113.25344,11.571598,155.63859,-14.248005,-0.36657084,-18.047072,1237.9464
175.48174,17.702576,155.858,-18.690136,-1.5109372,-16.435445,1278.818
122.57335,-28.504012,156.00685,-14.631359,2.557643,-17.067467,1269.0224
172.33044,-9.803113,156.49134,-16.484768,0.74928826,-17.593674,1257.2945
177.13965,28.882434,156.61246,-20.006463,-3.1260099,-17.726908,1201.7172
151.49507,-15.267094,157.1677,-16.25746,0.96790197,-18.054189,1216.858
118.84156,20.203941,157.24128,-14.239216,2.4237641,-21.456506,1205.5161
196.18676,17.712112,157.41191,-21.45707,-1.5856395,-17.338832,1216.3488
131.22569,-2.4452668,157.4207,-14.596848,-0.030348972,-17.786798,1245.021
148.77105,-10.656568,157.4319,-16.364495,0.82985142,-18.026646,1217.9458
152.75089,0.029036829,158.00231,-17.919437,-0.041125827,-18.279962,1198.3791
120.2318,11.543395,158.33353,-13.775394,-1.4570813,-17.495073,1259.5315
130.71246,-23.81128,158.47115,-15.19467,2.1334785,-17.331594,1265.3428
149.46194,5.6616077,158.79799,-17.870066,0.043846724,-18.457128,1208.8632
192.52707,-21.069621,159.2868,-19.879392,1.7632156,-17.923646,1215.1699
177.36329,-20.944358,159.59946,-19.022387,1.8984438,-17.615169,1234.718
167.97284,-15.202983,159.61653,-13.920907,0.9924348,-17.909865,1276.4321
128.9118,-14.274387,159.67219,-16.040964,1.6134423,-18.26786,1220.0278
139.47611,19.660698,159.96938,-16.412171,-1.810588,-18.282373,1213.6669
170.3978,-7.3592015,160.68585,-16.660329,0.39208966,-17.740586,1257.6975
140.6125,-13.658176,160.87952,-15.814558,1.1789398,-18.25986,1227.1728
166.14378,-9.8012483,161.22583,-18.710066,0.66694517,-18.14872,1201.2056
149.47309,20.336039,161.34128,-17.622779,0.72157872,-19.751747,1210.3748
144.41945,-20.262219,161.67126,-17.249727,1.9092095,-18.316919,1211.9565
200.40994,28.051843,162.04591,-21.305342,-2.5951751,-17.111644,1235.8338
146.85725,8.059575,162.10422,-15.975329,-0.74223801,-17.202673,1279.0323
151.39311,-11.61671,162.26307,-13.984923,0.60699614,-18.041732,1264.6433
294.91934,-19.432561,162.69426,-15.204062,3.5961035,-20.456781,1294.8806
126.83909,-16.802279,163.41598,-16.342546,2.0491443,-18.913314,1204.6794
167.84432,6.5648298,163.85184,-18.917275,-0.77780103,-17.953595,1223.053
176.61316,3.7492226,163.91356,-19.58997,-0.62582075,-17.971829,1217.7765
161.82332,30.39391,164.4705,-18.642836,-1.2762362,-19.322708,1206.7078
120.475,11.787997,164.77392,-14.638941,-0.4961202,-18.495454,1238.8129
187.26061,30.45979,165.53562,-20.509019,-3.1753384,-18.049341,1202.4613
207.05493,18.515021,166.19571,-22.015534,-1.6256774,-17.796595,1217.2153
138.62283,-2.4253408,166.44296,-14.989823,-0.050375247,-18.302579,1245.8875
157.06587,-11.075552,166.57518,-16.814548,0.84593563,-18.546058,1218.8123
127.23263,12.271699,167.20072,-14.227608,-1.4557552,-17.973205,1260.3979
161.83596,0.059394201,167.26557,-18.421133,-0.080414626,-18.77344,1199.2456
126.20495,19.491822,167.82135,-15.120048,0.64316177,-20.979759,1206.3825
158.51263,5.6714855,168.13182,-18.334258,-0.080082331,-18.880479,1209.7297
202.57157,-21.95096,168.37708,-20.298861,1.7612898,-18.436721,1216.0363
186.97043,-21.896616,168.53747,-19.403591,1.9098715,-18.137374,1235.5844
137.02301,-15.071792,168.93721,-16.402268,1.5753576,-18.79255,1220.8943
147.8037,20.577514,169.22998,-16.898928,-1.8552575,-18.760618,1214.5334
178.81167,-7.5500022,169.68417,-16.993449,0.3702512,-18.253305,1258.5639
148.61395,-14.244346,170.13891,-16.190937,1.1651078,-18.777375,1228.0392
175.63245,-10.132805,170.42731,-19.244536,0.65872226,-18.656853,1202.0721
153.15205,-21.21326,170.96038,-17.679244,1.8939782,-18.839665,1212.8229
158.42149,20.172418,171.23607,-18.158547,-0.0097468333,-19.857404,1211.2413
158.47501,-11.915283,171.40588,-14.344606,0.58708407,-18.528753,1265.5097
177.43235,6.9677883,172.94569,-19.435119,-0.83438289,-18.421799,1223.9195
302.2956,-21.192709,172.95728,-14.318043,3.4532963,-20.589406,1295.1355
135.1014,-17.807955,173.00105,-16.705741,1.9734193,-19.427466,1205.5459
186.53823,4.0760856,173.01943,-20.110236,-0.6822924,-18.451599,1218.643
127.89324,12.064922,174.13518,-15.034904,-0.60918729,-18.950506,1239.6793
171.278,31.134566,174.19061,-19.174947,-1.6648864,-19.568689,1207.5743
197.6616,32.058298,174.68849,-21.0957,-3.2189433,-18.560159,1203.3278
218.20218,19.337449,175.20874,-22.573354,-1.6637192,-18.255737,1218.0817
146.2135,-2.3936823,175.72371,-15.370924,-0.077521436,-18.820874,1246.754
171.17233,0.10956838,176.77608,-18.924662,-0.12039029,-19.268804,1200.1121
167.79782,5.738617,177.68056,-18.807981,-0.18588139,-19.316172,1210.5961
133.9099,19.421114,178.29182,-15.677485,-0.28002541,-20.941334,1207.249
145.31259,-15.848919,178.46491,-16.754864,1.5324223,-19.318268,1221.7608
156.37582,21.514488,178.73049,-17.390279,-1.8912941,-19.241723,1215.3998
156.80337,-14.822644,179.6565,-16.566929,1.1475171,-19.292533,1228.9057
162.09732,-22.155193,180.51093,-18.100738,1.8728425,-19.362411,1213.6894
167.62492,20.302564,181.22036,-18.652703,-0.48162138,-20.093829,1212.1077
187.27976,7.399598,182.27361,-19.954862,-0.89323359,-18.889803,1224.7859
196.72337,4.4322357,182.3651,-20.630298,-0.74300475,-18.931051,1219.5094
143.54411,-18.775578,182.84373,-17.06467,1.8969961,-19.943323,1206.4123
309.25939,-22.894786,183.27609,-13.561955,3.3631194,-20.677266,1295.3903
135.51095,12.394851,183.72525,-15.436949,-0.70851055,-19.410416,1240.5458
180.99867,32.040406,184.04872,-19.708927,-1.9444574,-19.871167,1208.4407
208.35716,33.678936,184.09389,-21.68737,-3.2637414,-19.059846,1204.1942
229.62814,20.178414,184.45166,-23.130326,-1.6998463,-18.716123,1218.9482
180.76099,0.17989747,186.53457,-19.430351,-0.1610297,-19.765299,1200.9785
177.32218,5.854928,187.44958,-19.290922,-0.27730033,-19.761179,1211.4626
153.77693,-16.603502,188.25533,-17.101922,1.4853033,-19.84312,1222.6272
165.19475,22.467425,188.47195,-17.886186,-1.919192,-19.724276,1216.2663
141.87097,19.712671,188.79191,-16.162974,-0.84720255,-21.079075,1208.1154
165.1813,-15.391306,189.43089,-16.945417,1.1266481,-19.80441,1229.7722
171.25184,-23.085179,190.32255,-18.516663,1.846274,-19.883721,1214.5558
177.07367,20.630202,191.34125,-19.143074,-0.81155861,-20.397982,1212.9742
197.38756,7.8614453,191.83542,-20.476649,-0.95457755,-19.35737,1225.6524
207.16851,4.8198554,191.95041,-21.150246,-0.80821965,-19.410105,1220.3759
152.16592,-19.704921,192.94428,-17.422761,1.8204006,-20.458592,1207.2788
143.33134,12.771451,193.54618,-15.845771,-0.79616353,-19.873724,1241.4123
315.88927,-24.564256,193.62348,-12.993173,3.3225552,-20.699615,1295.6451
219.34987,35.322125,193.74679,-22.284309,-3.3090426,-19.550425,1205.0607
241.33233,21.037003,193.92506,-23.686228,-1.7342535,-19.17764,1219.8146
190.9886,33.066609,194.0685,-20.25255,-2.150581,-20.21334,1209.3072
190.6031,0.27070556,196.54146,-19.938496,-0.20230069,-20.262268,1201.845
187.09023,6.0139333,197.44292,-19.782615,-0.35702687,-20.21315,1212.3291
162.4142,-17.333646,198.30759,-17.447185,1.4347979,-20.365361,1223.4937
174.26278,23.432384,198.45482,-18.386648,-1.9394722,-20.207154,1217.1328
150.07217,20.237173,199.38788,-16.643075,-1.2286674,-21.317735,1208.9819
180.61354,-24.000638,200.39417,-18.929929,1.8148281,-20.402208,1215.4223
186.76945,21.099208,201.62546,-19.641768,-1.0530625,-20.744347,1213.8406
217.87358,5.2412805,201.77515,-21.670004,-0.87829163,-19.888794,1221.2424
160.96737,-20.59606,203.30192,-17.783826,1.7442888,-20.971478,1208.1452
151.35795,13.189315,203.59935,-16.261831,-0.87381062,-20.339215,1242.2787
253.31415,21.912423,203.62948,-24.24082,-1.7672235,-19.640193,1220.6811
230.64236,36.987954,203.64306,-22.886431,-3.3542015,-20.033569,1205.9272
322.29802,-26.225441,203.95888,-12.692932,3.3295217,-20.622296,1295.9
201.25314,34.182137,204.26701,-20.807412,-2.3044237,-20.584692,1210.1737
200.69995,0.38229967,206.79683,-20.449319,-0.24416837,-20.759167,1202.7115
197.10619,6.2103131,207.6636,-20.28251,-0.42708182,-20.670226,1213.1955
171.22451,-18.037872,208.62,-17.79475,1.3817766,-20.883519,1224.3602
183.58218,24.405696,208.67902,-18.891655,-1.952689,-20.689494,1217.9992
158.51621,20.922792,210.12119,-17.13554,-1.5000282,-21.624605,1209.8484
196.71738,21.673147,212.09056,-20.151797,-1.2347162,-21.120025,1214.7071
265.57289,22.804039,213.56542,-24.793854,-1.7990907,-20.103689,1221.5476
242.23712,38.676197,213.77934,-23.493339,-3.3985986,-20.510668,1206.7936
159.59446,13.643802,213.88559,-16.685433,-0.94286351,-20.805866,1243.1452
169.95092,-21.449403,213.91514,-18.15176,1.6693132,-21.48073,1209.0117
328.64784,-27.900795,214.21905,-12.780755,3.3772192,-20.386318,1296.1548
211.79782,35.364502,214.65685,-21.372926,-2.419724,-20.977609,1211.0401
211.0529,0.51497052,217.30054,-20.962927,-0.28660413,-21.255563,1203.5779
207.37403,6.4396431,218.11377,-20.790005,-0.48905664,-21.13093,1214.062
193.1552,25.383972,219.14412,-19.401157,-1.9594274,-21.170666,1218.8657
180.21005,-18.715144,219.19023,-18.148767,1.3271136,-21.39649,1225.2266
167.21042,21.725324,221.02068,-17.643835,-1.7010497,-21.97984,1210.7148
206.92313,22.326691,222.74912,-20.672898,-1.3736444,-21.517121,1215.5736
254.1364,40.386317,224.1529,-24.104369,-3.4416048,-20.982882,1207.6601
168.0447,14.130932,224.40527,-17.116758,-1.0045778,-21.27282,1244.0117
335.2807,-29.626398,224.48462,-13.882587,3.5397644,-20.836266,1296.899
179.12093,-22.26566,224.78191,-18.530216,1.5960204,-21.985623,1209.8782
222.62767,36.596933,225.24729,-21.947858,-2.5059547,-21.38623,1211.9066
221.64641,0.66405292,228.0078,-21.417124,-0.29492527,-21.580374,1204.3221
217.89738,6.6982196,228.79495,-21.304456,-0.5442591,-21.594094,1214.9285
202.98408,26.364124,229.84941,-19.915044,-1.9602906,-21.650232,1219.7322
189.37504,-19.364844,230.01549,-18.513105,1.2716123,-21.903588,1226.0931
176.16264,22.615924,232.10683,-18.167318,-1.8552457,-22.369277,1211.5813
217.39194,23.041446,233.61038,-21.203748,-1.4810254,-21.930114,1216.44
266.34204,42.117452,234.76156,-24.71863,-3.4825496,-21.4512,1208.5265
342.52037,-31.429003,235.05714,-15.059017,3.6565692,-21.445568,1297.7654
176.71255,14.647329,235.15834,-17.555882,-1.0601126,-21.739364,1244.8781
188.48346,-23.045773,235.89998,-18.922298,1.5247773,-22.485896,1210.7446
233.74706,37.866676,236.04497,-22.530903,-2.5698832,-21.805974,1212.7731
232.49004,0.80737634,238.92822,-21.957373,-0.27907173,-22.100177,1205.1885
228.67955,6.9829411,239.70813,-21.825179,-0.59380271,-22.058807,1215.7949
213.07096,27.343366,240.79403,-20.433143,-1.9558784,-22.127914,1220.5986
185.38006,23.575203,243.39396,-18.70444,-1.9777258,-22.782341,1212.4478
228.12828,23.803686,244.68123,-21.742826,-1.5646282,-22.35486,1217.3065
350.32315,-33.267331,245.9214,-16.138023,3.6820596,-22.003233,1298.6319
185.6019,15.190181,246.14447,-18.002777,-1.1105659,-22.204932,1245.7446
245.15975,39.163865,247.05455,-23.120878,-2.6164059,-22.233281,1213.6395
198.04594,-23.790811,247.26704,-19.33032,1.4557248,-22.981648,1211.6111
239.72351,7.2912264,250.8539,-22.351455,-0.63866061,-22.524374,1216.6614
223.4179,28.319203,251.97698,-20.955217,-1.9467598,-22.603552,1221.4651
194.86914,24.590023,254.89184,-19.253709,-2.0787793,-23.211171,1213.3142
239.13592,24.602997,255.96669,-22.288733,-1.6300857,-22.788151,1218.173
358.64488,-35.096403,257.05198,-17.137423,3.6216921,-22.511584,1299.4984
194.71662,15.757211,257.36304,-18.457319,-1.1569932,-22.669084,1246.611
256.86895,40.480726,258.27907,-23.716763,-2.6490401,-22.665417,1214.506
207.81673,-24.501853,258.88092,-19.755655,1.3887549,-23.47323,1212.4776
251.03183,7.6209525,262.23256,-22.882547,-0.67969629,-22.990275,1217.5278
234.02681,29.289413,263.39723,-21.48098,-1.9334433,-23.077076,1222.3315
204.63563,25.651589,266.60684,-19.813913,-2.1656943,-23.650033,1214.1807
250.41797,25.431403,267.4704,-22.840286,-1.6815794,-23.227478,1219.0394
367.44959,-36.877405,268.42558,-18.072171,3.4930673,-22.976412,1300.3648
204.06049,16.346663,268.81326,-18.919293,-1.2004138,-23.131499,1247.4775
268.87737,41.810968,269.72043,-24.317687,-2.6702515,-23.100311,1215.3724
217.80461,-25.17986,270.73964,-20.198705,1.323507,-23.961131,1213.344
262.60675,7.9704042,273.84417,-23.417711,-0.7176792,-23.456133,1218.3943
214.68475,26.754221,278.54288,-20.384121,-2.2437653,-24.094844,1215.0472
261.97701,26.282739,279.19487,-23.396539,-1.7222348,-23.670876,1219.9059
376.70835,-38.581413,280.02212,-18.95577,3.3169646,-23.404325,1301.2313
213.63713,16.957281,280.49421,-19.388403,-1.2418065,-23.591961,1248.344
281.18736,43.149321,281.37959,-24.922905,-2.6816997,-23.536419,1216.2389
274.45011,8.3382291,285.68864,-23.956222,-0.75329055,-23.92168,1219.2608
225.00868,27.891109,290.67681,-20.876782,-2.281102,-24.382184,1215.7913
273.81519,27.152193,291.14171,-23.956767,-1.7543695,-24.116805,1220.7723
386.39914,-40.189467,291.82453,-19.802833,3.1118906,-23.800556,1302.0977
223.45004,17.588283,292.40487,-19.864298,-1.2820973,-24.050334,1249.2104
293.8009,44.49119,293.25687,-25.531777,-2.6844442,-23.97261,1217.1054
235.58883,29.026772,302.99426,-21.444786,-2.2636542,-24.884795,1216.6578
285.93436,28.035948,303.3119,-24.520441,-1.7796649,-24.564053,1221.6388
396.50776,-41.690849,303.81787,-20.629735,2.8922578,-24.16842,1302.9642
306.71967,45.832395,305.35208,-26.14376,-2.6791229,-24.408069,1217.9718
246.45447,30.156642,315.55902,-22.018673,-2.2572975,-25.372143,1217.5242
298.33616,28.930897,315.70583,-25.087215,-1.799298,-25.011656,1222.5053
407.02828,-43.081069,315.98848,-21.453028,2.6686874,-24.509933,1303.8307
319.94512,47.169006,317.66472,-26.758409,-2.66611,-24.842229,1218.8383
311.02207,29.834419,328.32348,-25.6569,-1.8140536,-25.458836,1223.3717
257.60849,31.28538,328.36447,-22.598348,-2.2586757,-25.848059,1218.3907
269.05377,32.416217,341.40558,-23.183655,-2.2653656,-26.3151,1219.2571
280.79308,33.551346,354.67836,-23.774457,-2.2755985,-26.774962,1220.1236
292.82915,34.692194,368.17952,-24.370667,-2.2880665,-27.228762,1220.9901
