\babel@toc {english}{}
\addvspace {10\p@ }
\addvspace {10\p@ }
\contentsline {table}{\numberline {2.1}{\ignorespaces Common activation functions\relax }}{12}{table.caption.13}% 
\addvspace {10\p@ }
\contentsline {table}{\numberline {3.1}{\ignorespaces EO 1D train set initial condition\relax }}{25}{table.caption.18}% 
\contentsline {table}{\numberline {3.2}{\ignorespaces EO 1D DNN results DAgger\relax }}{34}{table.caption.24}% 
\contentsline {table}{\numberline {3.3}{\ignorespaces EO 1D ELM results DAgger\relax }}{37}{table.caption.27}% 
\contentsline {table}{\numberline {3.4}{\ignorespaces EO 3D train set initial condition\relax }}{39}{table.caption.29}% 
\contentsline {table}{\numberline {3.5}{\ignorespaces EO 3D DNN results DAgger\relax }}{45}{table.caption.35}% 
\contentsline {table}{\numberline {3.6}{\ignorespaces EO 3D ELM results DAgger\relax }}{48}{table.caption.39}% 
\addvspace {10\p@ }
\contentsline {table}{\numberline {4.1}{\ignorespaces FO 1D train set initial condition\relax }}{53}{table.caption.42}% 
\contentsline {table}{\numberline {4.2}{\ignorespaces FO 1D DNN results DAgger\relax }}{61}{table.caption.50}% 
\contentsline {table}{\numberline {4.3}{\ignorespaces EO 3D train set initial condition\relax }}{64}{table.caption.54}% 
\contentsline {table}{\numberline {4.4}{\ignorespaces FO 3D DNN results DAgger\relax }}{68}{table.caption.57}% 
\addvspace {10\p@ }
