epoch,loss,lr,mean_squared_error,val_loss,val_mean_squared_error
0,2.8663193454672955,0.001,2.8663175141387804,0.004740899543391763,0.004737479789717471
1,0.0033063063887389184,0.001,0.003302445282812129,0.0018237025938881493,0.0018195557372715867
2,0.0018847389331904175,0.001,0.0018802871393632618,0.001292253234571145,0.0012875582887900826
3,0.0014891877580980393,0.001,0.001484372415863252,0.0012644985794612318,0.0012595646511982792
4,0.0012947877306124064,0.001,0.0012897643731839316,0.0012287503886084582,0.0012236583026555342
5,0.0010922431738330774,0.001,0.0010870507576517861,0.0006166975684714297,0.0006113725558022073
6,0.0010013993567021626,0.001,0.000996004640277825,0.0005728448537196854,0.0005673905129548552
7,0.000974861366857507,0.001,0.0009693560694491584,0.0008764097675720891,0.0008708356839017627
8,0.0008357788903175807,0.001,0.0008301335650671078,0.0006823371100035086,0.0006766411964644421
9,0.000806599917506946,0.001,0.0008008338995798816,0.0005370494016913464,0.0005312637536641535
10,0.0007143831039933274,0.001,0.0007085369151246205,0.001223723041953242,0.0012177879673659264
11,0.0006645103770131288,0.00090000004,0.0006585131610922244,0.0013823786046628912,0.0013763431081786992
12,0.0007087274407268702,0.00090000004,0.0007026733542434902,0.0005180659976517658,0.0005119919517510934
13,0.0005497223511069183,0.00090000004,0.000543581312670868,0.00036412249558644003,0.0003579299010108412
14,0.0005736009173228315,0.00090000004,0.0005673720708600581,0.0005446282734570474,0.0005383417593155451
15,0.0005076338919550804,0.00090000004,0.0005012932961755066,0.0008198992497341184,0.0008135011769071309
16,0.000469817057093013,0.00090000004,0.00046339635172767225,0.0002238164294145203,0.0002173449621776598
17,0.0004367914091005683,0.00090000004,0.00043026119964056274,0.000699953230816956,0.0006933641464216977
18,0.00041837207105835443,0.00090000004,0.00041175850410306227,0.0007481723841737863,0.0007415155583799889
19,0.00041744145471306614,0.00090000004,0.00041073475838673926,0.0004848604928222053,0.00047813602633169403
20,0.0004428142823613611,0.00090000004,0.00043606349436068394,0.00028758631845653625,0.0002808022353882505
21,0.00039063907565055594,0.00090000004,0.0003838293797291163,0.000408084921031163,0.00040122136544893647
22,0.0003746029968275487,0.00081000006,0.0003677070209665331,0.0005754065006269781,0.0005684774981081946
23,0.0003665820781967056,0.00081000006,0.00035964754149907604,0.00046967966513761727,0.00046273102918338024
24,0.0004027010115493294,0.00081000006,0.0003957566427080369,0.0004935988484491252,0.00048665519582076114
25,0.0003926139208445796,0.00081000006,0.0003856626682187668,0.00023909988600609992,0.0002321400748839172
26,0.00035933581564156467,0.00081000006,0.0003523521613314034,0.0006575352190550525,0.0006505323361390406
27,0.00031715459054606934,0.0007290001,0.000310121072932723,0.0002059713434904611,0.000198915502888789
28,0.000296454562500655,0.0007290001,0.0002893776905909896,0.00019324203688983596,0.00018614745690489554
29,0.0003534931559013264,0.0007290001,0.0003463840715421838,0.00023695320309402451,0.00022982986616606815
30,0.0002852764147211042,0.0007290001,0.00027812540854567635,0.00020898995150857235,0.00020181927972606764
31,0.00028190253613461755,0.0007290001,0.0002747182754366042,0.00022201539930858887,0.00021481309196134563
32,0.00027633448705258916,0.00065610005,0.00026911648888751377,0.00020169396568626367,0.00019445981049473588
33,0.00023257694079239496,0.00065610005,0.00022531208299023033,0.00013099938996205798,0.0001237051585981597
34,0.00023878142883473075,0.00065610005,0.00023146283418605534,0.00013339829491674268,0.0001260578013726888
35,0.0002439499751289868,0.00065610005,0.0002365986111415017,0.00032025620272977686,0.0003129009263311713
36,0.0002502640194663869,0.00065610005,0.00024290916382840785,0.000154310812915532,0.00014694191818528457
37,0.0002130814128303481,0.00059049006,0.00020568427517485196,0.00016762266843459693,0.00016020588955572096
38,0.00021144254604935978,0.00059049006,0.00020401426712884398,0.00016425403076286094,0.00015680415635495256
39,0.0002138603632832806,0.00059049006,0.00020639382561548047,0.00016431111940721103,0.00015682930731408665
40,0.00021237856059899351,0.00059049006,0.00020488745027649578,0.0004961758044127249,0.000488670477217553
41,0.00023370949986747962,0.00059049006,0.00022620413883867068,0.0003235883701236751,0.0003160674993013236
42,0.0001656466852609597,0.00053144107,0.00015810196814964624,0.00017327381943159467,0.00016571565241056024
43,0.0002005009975009676,0.00053144107,0.00019293015759947867,0.00032286310482469136,0.0003152944992840927
44,0.00017366958503243625,0.00053144107,0.00016607965506016255,0.00024524064518035345,0.0002376339696697688
45,0.00017069048398069304,0.00053144107,0.00016306563680170484,0.00020634886679762155,0.00019870661270673714
46,0.00022468901754597268,0.00053144107,0.0002170388612446371,0.00019035705127609298,0.000182713327756812
47,0.00014007264669380884,0.00047829695,0.00013241233749438708,0.00021825810675534134,0.00021057898271687443
48,0.0001640976745947776,0.00047829695,0.00015640775338746538,0.0006007311254592657,0.0005930322858923977
