779.35762,-29.746227,1347.028,0,0
749.17163,-30.625712,1346.5183,0,0
698.41632,-31.738889,1345.4749,0,0.62398849
686.16189,-32.383837,1345.4989,0,0
653.33871,-33.262478,1344.9892,0,0
600.09304,-33.771108,1343.5873,1,0.57506945
567.45825,-32.880009,1341.8854,1,0.55889564
535.70607,-31.98601,1340.1836,1,0.54272488
504.83959,-31.089127,1338.482,1,0.52655744
474.86196,-30.18938,1336.7806,1,0.51039363
445.7763,-29.286792,1335.0795,1,0.49423382
417.58576,-28.38139,1333.3786,1,0.4780784
390.2935,-27.473207,1331.678,1,0.46192785
363.90267,-26.562281,1329.9776,1,0.44578269
349.49566,-25.846061,1328.8832,1,0
313.83798,-24.732388,1326.578,1,0.41351105
290.17049,-23.813538,1324.8789,1,0.39738609
267.41714,-22.892181,1323.1801,1,0.3812696
877.68263,-39.698655,1377.243,1,0.71264184
839.36881,-38.87181,1375.5434,1,0.69651231
801.87781,-38.042332,1373.8441,1,0.68038731
765.21258,-37.210242,1372.145,1,0.66426717
729.37612,-36.375563,1370.4462,1,0.64815225
643.56024,-34.086655,1366.0856,1,2.0918056
611.86992,-33.274364,1364.4519,1,2.0385198
580.95856,-32.459631,1362.8183,1,1.9852558
594.36616,-32.940556,1363.6052,1,0.58374929
562.54789,-32.086479,1361.9035,1,0.5675828
531.57618,-31.229617,1360.2021,1,0.55141974
501.45407,-30.369986,1358.5009,1,0.53526041
472.1846,-29.507611,1356.7999,1,0.51910517
443.7708,-28.642514,1355.0992,1,0.50295439
416.21573,-27.774728,1353.3987,1,0.48680854
402.25369,-27.112295,1352.368,1,0
363.69403,-26.031229,1349.9987,1,0.45453369
338.73354,-25.155606,1348.2992,1,0.43840593
314.64406,-24.277473,1346.6002,1,0.42228561
269.93957,-22.423497,1343.1923,1,1.3442696
1048.9099,-41.99645,1345.6115,0,0
1006.474,-42.875153,1345.1018,0,0
933.23284,-42.410938,1342.8842,1,0.70973566
892.3147,-41.522675,1341.185,1,0.69360928
852.2807,-40.631665,1339.4861,1,0.67748759
813.13397,-39.737931,1337.7875,1,0.66137094
774.77865,-38.766048,1336.0379,1,0.64522067
737.24184,-37.860502,1334.3357,1,0.62904145
700.60151,-36.951971,1332.6336,1,0.61286464
664.86081,-36.040464,1330.9317,1,0.59669043
630.0229,-35.125992,1329.23,1,0.58051905
596.09096,-34.208569,1327.5284,1,0.56435072
563.06816,-33.288211,1325.827,1,0.54818573
530.95769,-32.364938,1324.1258,1,0.53202438
499.76276,-31.438772,1322.4249,1,0.51586701
469.48655,-30.50974,1320.7242,1,0.49971401
440.1323,-29.577872,1319.0238,1,0.48356581
411.7032,-28.643206,1317.3237,1,0.46742291
384.20251,-27.705783,1315.6239,1,0.45128588
357.63344,-26.765656,1313.9245,1,0.43515538
331.99926,-25.822883,1312.2255,1,0.41903215
843.3761,-44.622008,1235.8242,1,0.61112902
800.13809,-43.512313,1234.1213,1,0.59493366
757.99678,-42.399055,1232.4185,1,0.57873994
716.95583,-41.282237,1230.7158,1,0.56254801
677.01897,-40.161866,1229.0132,1,0.54635804
638.18989,-39.037953,1227.3108,1,0.53017019
620.08797,-38.363613,1226.4126,1,0
582.30017,-37.21134,1224.6797,1,0
528.38661,-35.645082,1222.2044,1,0.48162153
494.02597,-34.50714,1220.5027,1,0.46544448
460.79182,-33.365746,1218.8012,1,0.44927087
428.68793,-32.220932,1217.0999,1,0.43310108
410.75356,-31.390821,1216.015,1,0
367.88606,-29.921198,1213.6982,1,0.40077484
339.19568,-28.76638,1211.9979,1,0.3846195
321.88214,-27.850785,1210.8163,1,0
285.25511,-26.447177,1208.5984,1,0.35232797
953.40537,-44.685509,1198.1936,0,0.62904645
936.63092,-45.150074,1198.1099,0,0
891.08723,-45.937248,1197.6002,0,0
844.84676,-46.122517,1196.7235,1,0
774.08812,-44.492646,1194.1846,1,0.56414537
731.1853,-43.293454,1192.4846,1,0.54799276
689.45966,-42.009454,1190.7356,1,0.53184083
648.7456,-40.794584,1189.0311,1,0.51562061
629.14535,-40.177388,1188.1812,1,0
570.91445,-38.35284,1185.6221,1,0.48318109
533.80532,-37.12595,1183.9177,1,0.46696186
497.90582,-35.895038,1182.2133,1,0.45074302
463.21994,-34.660099,1180.5089,1,0.43452462
429.75171,-33.421125,1178.8045,1,0.41830671
397.50516,-32.178113,1177.1002,1,0.40208936
366.48434,-30.931058,1175.396,1,0.38587264
336.69329,-29.679958,1173.6917,1,0.36965661
308.13609,-28.424813,1171.9876,1,0.3534414
871.5927,-32.722022,1342.0917,0,0
815.76461,-34.067619,1341.159,0,0.67052139
781.67251,-35.023592,1340.722,0,0.65412042
82.169705,-12.898315,1296.3897,1,26.686203
733.69248,-36.227333,1340.0529,0,0
675.20381,-36.089911,1338.182,1,0.60534423
640.39712,-35.191372,1336.4818,1,0.58920053
606.48308,-34.290049,1334.7818,1,0.5730614
573.46482,-33.385968,1333.0822,1,0.55692724
541.34551,-32.479162,1331.3828,1,0.54079851
510.1283,-31.569667,1329.6838,1,0.5246757
479.81636,-30.657524,1327.9852,1,0.50855937
417.29061,-28.512188,1324.2095,1,1.6298119
390.88203,-27.626024,1322.5761,1,1.5765323
365.32303,-26.737393,1320.9429,1,1.5232817
340.61648,-25.846348,1319.3101,1,1.4700633
353.14199,-26.097285,1319.9918,0,0
327.52216,-25.141819,1318.2589,0,0
302.85949,-24.182963,1316.5259,0,0
816.43817,-34.633893,1362.9569,0,0.68280557
805.28561,-35.064048,1362.8983,0,0
769.77748,-35.952181,1362.3886,0,0
733.41659,-36.487552,1361.6343,1,0
697.36707,-35.610963,1359.9013,1,0
641.33328,-34.498417,1357.332,1,0.60170176
608.11249,-33.636269,1355.6326,1,0.58557439
575.74959,-32.771492,1353.9335,1,0.56945256
544.24766,-31.90412,1352.2347,1,0.55333674
475.90272,-29.755694,1348.2727,1,1.7780062
448.3032,-28.912503,1346.639,1,1.7247241
421.51212,-28.066881,1345.0056,1,1.6714684
395.53226,-27.218869,1343.3725,1,1.6182415
370.36637,-26.368513,1341.7398,1,1.5650464
346.01722,-25.515867,1340.1075,1,1.5118865
359.48821,-25.756395,1340.8392,0,0
334.18922,-24.841029,1339.1062,0,0
309.80724,-23.922378,1337.3733,0,0
286.34556,-23.000433,1335.6404,0,0
1034.3649,-42.978629,1384.3776,1,0
991.8038,-42.143113,1382.6447,1,0
950.07973,-41.304515,1380.9118,1,0
909.1958,-40.462828,1379.1788,1,0
869.15511,-39.618043,1377.4459,1,0
829.96075,-38.770152,1375.713,1,0
791.61584,-37.919148,1373.9801,1,0
754.12349,-37.065024,1372.2471,1,0
717.48684,-36.20777,1370.5142,1,0
681.709,-35.34738,1368.7813,1,0
646.79313,-34.483844,1367.0483,1,0
612.74236,-33.617156,1365.3154,1,0
579.55987,-32.747308,1363.5825,1,0
547.2488,-31.87429,1361.8496,1,0
515.81235,-30.998096,1360.1166,1,0
485.25367,-30.118716,1358.3837,1,0
455.57598,-29.236144,1356.6508,1,0
426.78245,-28.35037,1354.9179,1,0
398.87631,-27.461387,1353.1849,1,0
371.86075,-26.569186,1351.452,1,0
982.40422,-40.586306,1366.0143,0,0
911.84211,-41.008294,1364.3705,1,0.71666428
872.24272,-40.158266,1362.6707,1,0.70052938
833.48874,-39.305534,1360.9711,1,0.68439873
795.58319,-38.450118,1359.2718,1,0.66827263
758.5291,-37.592038,1357.5728,1,0.65215142
722.32952,-36.73132,1355.8741,1,0.63603548
636.68762,-34.401566,1351.563,1,2.0516995
652.33979,-34.924729,1352.4244,1,0.60374702
618.55012,-34.049376,1350.7221,1,0.58756738
585.62699,-33.171119,1349.0199,1,0.5713903
553.57347,-32.28997,1347.3179,1,0.55521601
522.39266,-31.405942,1345.6161,1,0.53904474
492.08763,-30.519052,1343.9145,1,0.52287679
462.66151,-29.629319,1342.2131,1,0.50671247
434.11739,-28.736767,1340.5119,1,0.49055215
406.45839,-27.841422,1338.8109,1,0.47439622
379.68765,-26.943317,1337.1102,1,0.45824515
353.8083,-26.04249,1335.4098,1,0.44209948
339.5896,-25.333681,1334.3119,1,0
304.73633,-24.23286,1332.0101,1,0.40982687
828.80538,-39.44878,1353.3153,1,0.67753469
816.2823,-38.970164,1352.6245,1,0
753.28789,-37.700023,1349.9119,1,0.64519624
716.8297,-36.821331,1348.2105,1,0.6290313
681.24267,-35.939779,1346.5092,1,0.61286952
646.52987,-35.055382,1344.8082,1,0.59671116
612.69441,-34.168157,1343.1073,1,0.5805565
579.73939,-33.278124,1341.4067,1,0.56440586
547.66793,-32.385306,1339.7063,1,0.5482596
516.48315,-31.489731,1338.0062,1,0.53211811
486.18818,-30.591428,1336.3064,1,0.51598185
456.78616,-29.690436,1334.6069,1,0.49985131
428.28024,-28.786795,1332.9077,1,0.48372708
400.67357,-27.880556,1331.209,1,0.4676098
346.43261,-25.852237,1327.6072,1,1.4942843
322.52402,-24.972182,1325.9736,1,1.4410058
299.45909,-24.089722,1324.3404,1,1.3877592
277.24068,-23.204922,1322.7076,1,1.3345484
255.87163,-22.317857,1321.0752,1,1.2813777
841.33435,-38.48634,1312.5105,0,0
802.41801,-39.346293,1312.0008,0,0
738.83299,-38.819722,1309.8986,1,0.61508962
701.23868,-37.863565,1308.196,1,0.59890179
664.59007,-36.904271,1306.4935,1,0.58271601
628.89047,-35.941846,1304.7911,1,0.56653246
594.14316,-34.976301,1303.0889,1,0.55035134
560.35144,-34.007648,1301.3868,1,0.53417287
527.51862,-33.035901,1299.6849,1,0.51799729
495.64801,-32.061079,1297.9832,1,0.50182489
464.74295,-31.083202,1296.2817,1,0.48565598
434.80676,-30.102296,1294.5804,1,0.46949092
405.84279,-29.118391,1292.8793,1,0.45333013
377.85439,-28.131522,1291.1786,1,0.43717408
350.84493,-27.141732,1289.4782,1,0.42102331
324.81777,-26.149072,1287.7781,1,0.40487845
309.60739,-25.34703,1286.6186,1,0
275.72388,-24.155397,1284.3791,1,0.37260957
880.58545,-29.469239,1295.4868,0,0
850.69122,-30.319177,1294.9771,0,0
819.9472,-31.16881,1294.4674,0,0
788.3537,-32.01814,1293.9577,0,0
755.91102,-32.867165,1293.448,0,0
702.56327,-33.910728,1292.4316,0,0.59430663
688.47935,-34.564301,1292.4287,0,0
653.49097,-35.412411,1291.919,0,0
598.18117,-35.56267,1290.3683,1,0.54545711
563.90645,-34.5712,1288.6678,1,0.52930469
530.61569,-33.576738,1286.9676,1,0.51315683
498.31228,-32.579318,1285.2677,1,0.49701398
466.99962,-31.57898,1283.5681,1,0.48087665
436.6811,-30.575771,1281.8689,1,0.4647454
407.36013,-29.569744,1280.1701,1,0.44862089
379.04013,-28.560963,1278.4717,1,0.43250388
325.78846,-26.401082,1275.0126,1,1.3781023
301.41236,-25.422081,1273.3795,1,1.3248297
309.96397,-25.597369,1273.8354,0,0
1117.526,-34.33363,1251.7186,0,0
1082.7809,-35.156565,1251.2089,0,0
1047.213,-35.979175,1250.6992,0,0
1010.8226,-36.80146,1250.1895,0,0
973.61015,-37.623418,1249.6798,0,0
935.57589,-38.44505,1249.1701,0,0
871.81197,-39.574209,1248.2034,0,0.63261138
857.04329,-40.087333,1248.1508,0,0
816.5456,-40.907984,1247.6411,0,0
775.22743,-41.728308,1247.1314,0,0
710.53922,-40.558492,1244.7739,1,0.5675464
671.35154,-39.470353,1243.0723,1,0.55137206
633.24143,-38.378849,1241.3709,1,0.53520078
615.55788,-37.861329,1240.5667,1,0
578.25653,-36.74073,1238.8337,1,0
542.0777,-35.616292,1237.1008,1,0
507.02523,-34.488004,1235.3679,1,0
473.10298,-33.355856,1233.635,1,0
440.31481,-32.219835,1231.902,1,0
408.6646,-31.079933,1230.1691,1,0
862.25776,-40.693054,1342.8326,1,0.6834768
822.89833,-39.801874,1341.1316,1,0.66731767
784.42299,-38.907816,1339.4307,1,0.65116181
771.1072,-38.336661,1338.6547,1,0
710.13704,-37.111126,1336.0296,1,0.61886088
674.3327,-36.20853,1334.3294,1,0.6027164
639.42499,-35.303129,1332.6294,1,0.58657636
605.41705,-34.394949,1330.9297,1,0.57044111
572.31206,-33.484018,1329.2303,1,0.55431109
540.11317,-32.570371,1327.5313,1,0.53818677
508.82358,-31.654047,1325.8325,1,0.52206866
443.276,-29.466295,1322.0003,1,1.6745126
415.96737,-28.575983,1320.3668,1,1.6212249
389.51216,-27.683173,1318.7335,1,1.5679648
363.91325,-26.787911,1317.1007,1,1.5147352
339.17352,-25.890255,1315.4681,1,1.4615395
351.50421,-26.123452,1316.1267,0,0
217.82746,-20.884474,1306.4899,1,4.6594078
301.18452,-24.193961,1312.6608,0,0
1040.1951,-39.081285,1214.4719,0,0
1000.7146,-39.879709,1213.9623,0,0
960.43581,-40.677787,1213.4526,0,0
893.63417,-41.747352,1212.4904,0,0.61894748
877.48489,-42.272905,1212.4332,0,0
834.81344,-43.069944,1211.9235,0,0
766.35955,-43.621104,1210.6915,1,0.57009541
724.25412,-42.377123,1208.9405,1,0.55391411
683.29462,-41.208699,1207.2384,1,0.53773168
643.49124,-40.036662,1205.5366,1,0.52155189
624.61384,-39.295087,1204.6045,1,0
585.91968,-38.092552,1202.8715,1,0
531.05645,-36.499063,1200.4323,1,0.47303097
495.91623,-35.312788,1198.7313,1,0.45686458
461.95152,-34.123032,1197.0306,1,0.44070249
429.16623,-32.929839,1195.3302,1,0.42454517
397.56429,-31.733264,1193.6302,1,0.4083932
367.14961,-30.533369,1191.9306,1,0.39224723
337.92615,-29.330231,1190.2314,1,0.37610805
1052.1749,-43.050133,1348.1101,0,0
677.01812,-36.193067,1333.138,1,8.2812498
935.28532,-42.37862,1344.6311,1,0.71167466
894.37645,-41.49309,1342.9316,1,0.69554265
854.34851,-40.604795,1341.2324,1,0.67941506
815.20462,-39.713757,1339.5334,1,0.6632922
776.93587,-38.747692,1337.7854,1,0.6471709
739.39564,-37.844902,1336.0829,1,0.63098577
702.74864,-36.939105,1334.3805,1,0.61480274
666.99801,-36.030309,1332.6782,1,0.59862196
632.14691,-35.118523,1330.976,1,0.58244363
598.1985,-34.203756,1329.274,1,0.56626796
565.15594,-33.286023,1327.5722,1,0.55009518
533.02243,-32.365338,1325.8705,1,0.53392555
501.80115,-31.441719,1324.1691,1,0.51775937
471.49528,-30.515189,1322.4678,1,0.50159698
442.10805,-29.585773,1320.7668,1,0.48543874
413.64265,-28.653502,1319.0661,1,0.46928509
386.10232,-27.71841,1317.3657,1,0.45313652
359.49027,-26.780541,1315.6655,1,0.4369936
333.80975,-25.839944,1313.9658,1,0.42085697
671.46336,-40.560606,1213.7199,1,0.53646738
632.18394,-39.400102,1212.016,1,0.52025757
594.04975,-38.235825,1210.3123,1,0.50404871
557.06462,-37.067773,1208.6086,1,0.48784092
521.23238,-35.895948,1206.9049,1,0.47163429
486.55688,-34.720354,1205.2014,1,0.45542895
453.04198,-33.540994,1203.4979,1,0.43922505
420.69154,-32.357877,1201.7946,1,0.42302274
389.50944,-31.171013,1200.0914,1,0.40682223
371.2945,-30.381236,1199.0203,1,0
330.66586,-28.786102,1196.6853,1,0.3744275
312.96479,-27.945727,1195.5544,1,0
276.54246,-26.386429,1193.28,1,0.34204316
251.26066,-25.181138,1191.5776,1,0.32585585
227.1707,-23.97227,1189.8755,1,0.30967246
836.4617,-31.866859,1346.8175,0,0
782.40951,-33.190584,1345.8779,0,0.66020207
770.96934,-33.625315,1345.7981,0,0
736.9046,-34.504121,1345.2884,0,0
701.96119,-35.382645,1344.7787,0,0
666.36259,-35.368005,1343.6574,1,0
611.53652,-34.223554,1341.1222,1,0.57890219
578.59668,-33.331794,1339.4229,1,0.56277453
546.54411,-32.437362,1337.7239,1,0.54665262
515.38196,-31.540296,1336.0252,1,0.53053698
449.46721,-29.375144,1332.1574,1,1.7025506
422.24039,-28.503379,1330.5238,1,1.6492714
395.8494,-27.629152,1328.8906,1,1.5960199
370.29708,-26.75251,1327.2577,1,1.5427989
345.58624,-25.873508,1325.6252,1,1.4896118
358.65033,-26.119345,1326.3282,0,0
333.00228,-25.176201,1324.5952,0,0
308.29905,-24.229699,1322.8623,0,0
284.544,-23.279829,1321.1294,0,0
962.47223,-29.558945,1228.6383,0,0
932.50929,-30.366867,1228.1286,0,0
901.7386,-31.174451,1227.619,0,0
870.1605,-31.981697,1227.1093,0,0
837.77532,-32.788604,1226.5996,0,0
804.58341,-33.595173,1226.0899,0,0
770.58509,-34.401403,1225.5802,0,0
735.78071,-35.207293,1225.0705,0,0
680.4365,-36.127219,1224.0774,0,0.54816858
663.75514,-36.818054,1224.0512,0,0
626.53462,-37.622925,1223.5415,0,0
588.6664,-37.642363,1222.5425,1,0
551.60424,-36.481301,1220.8096,1,0
515.70512,-35.316285,1219.0767,1,0
480.97299,-34.147305,1217.3437,1,0
447.41184,-32.974349,1215.6108,1,0
415.02563,-31.797405,1213.8779,1,0
383.81836,-30.616463,1212.145,1,0
932.31603,-40.16949,1288.3623,0,0
891.72368,-41.015158,1287.8526,0,0
850.28582,-41.860517,1287.3429,0,0
782.98361,-41.002546,1285.0604,1,0.61765604
743.37081,-39.999752,1283.3596,1,0.60149588
704.75255,-38.99385,1281.6589,1,0.58533929
667.13224,-37.984862,1279.9585,1,0.56918658
651.07466,-37.283383,1279.0453,1,0
614.28182,-36.433233,1277.4347,1,0
560.08093,-34.854939,1274.8039,1,0.52065935
526.30436,-33.825272,1273.0992,1,0.50443679
493.54269,-32.792102,1271.3945,1,0.48821437
461.7994,-31.755419,1269.6899,1,0.47199211
431.07795,-30.715218,1267.9852,1,0.45577004
401.38184,-29.671489,1266.2806,1,0.43954816
372.71455,-28.624226,1264.576,1,0.4233265
345.07958,-27.573422,1262.8714,1,0.40710509
318.48046,-26.51907,1261.1668,1,0.39088396
302.53458,-25.855211,1260.1054,1,0
1047.3833,-36.460051,1337.108,0,0
983.10907,-37.815496,1336.1205,0,0.72928544
945.27997,-38.792442,1335.6995,0,0.71287904
934.07091,-39.081119,1335.5789,0,0
894.5532,-39.954237,1335.0693,0,0
827.33777,-40.267743,1333.4469,1,0.66408155
788.46104,-39.287165,1331.6971,1,0.64792703
750.42809,-38.373749,1329.9951,1,0.63175087
713.29967,-37.457342,1328.2932,1,0.61557728
677.07896,-36.537955,1326.5915,1,0.59940645
641.76916,-35.6156,1324.89,1,0.58323861
607.37345,-34.690293,1323.1887,1,0.56707402
573.89504,-33.762051,1321.4875,1,0.55091297
541.33712,-32.830896,1319.7866,1,0.53475578
509.70293,-31.896851,1318.086,1,0.51860281
478.99568,-30.959945,1316.3856,1,0.50245446
449.2186,-30.020212,1314.6855,1,0.48631119
420.37495,-29.077691,1312.9857,1,0.47017354
392.46797,-28.132429,1311.2862,1,0.45404209
365.50092,-27.184478,1309.5872,1,0.43791754
339.47707,-26.233904,1307.8886,1,0.42180067
1040.0787,-30.629437,1323.1322,0,0
1009.0162,-31.495509,1322.6225,0,0
977.08782,-32.36129,1322.1129,0,0
944.29376,-33.226779,1321.6032,0,0
910.63436,-34.091976,1321.0935,0,0
876.1099,-34.956881,1320.5838,0,0
817.17337,-36.163324,1319.5892,0,0.65515185
804.46701,-36.685815,1319.5644,0,0
767.34916,-37.549842,1319.0547,0,0
706.41674,-37.688768,1317.3975,1,0.60633209
670.01828,-36.749685,1315.6966,1,0.59017321
634.55132,-35.807652,1313.9958,1,0.57401806
600.01909,-34.862692,1312.2953,1,0.55786694
566.42486,-33.91483,1310.5951,1,0.54172022
533.77188,-32.964094,1308.8951,1,0.52557831
502.06343,-32.01052,1307.1955,1,0.50944166
471.30279,-31.054145,1305.4961,1,0.49331079
441.49324,-30.095016,1303.7972,1,0.47718628
412.63809,-29.133186,1302.0987,1,0.46106881
356.39911,-26.998355,1298.5213,1,1.4726359
331.43734,-26.064533,1296.888,1,1.4193575
838.24574,-40.163538,1262.305,0,0
797.66736,-40.993177,1261.7953,0,0
732.54391,-40.591386,1259.8858,1,0.58417938
693.28707,-39.534777,1258.1838,1,0.56799887
676.44366,-38.904376,1257.3305,1,0
617.91417,-37.411573,1254.7802,1,0.53564589
581.80523,-36.345011,1253.0787,1,0.51947392
546.75272,-35.27517,1251.3774,1,0.50330534
512.76021,-34.202074,1249.6763,1,0.4871405
479.83129,-33.125753,1247.9755,1,0.47097977
447.96956,-32.046243,1246.275,1,0.45482361
417.17862,-30.963587,1244.5747,1,0.43867251
387.4621,-29.877834,1242.8749,1,0.42252706
358.82363,-28.789044,1241.1754,1,0.40638791
331.26683,-27.697288,1239.4764,1,0.39025587
304.79536,-26.602652,1237.7779,1,0.37413185
279.41287,-25.505237,1236.0799,1,0.35801693
1131.7869,-32.236999,1262.0794,0,0
1099.1351,-33.066495,1261.5697,0,0
1065.654,-33.895672,1261.06,0,0
1031.3439,-34.724528,1260.5503,0,0
996.20508,-35.553063,1260.0406,0,0
960.23789,-36.381278,1259.531,0,0
923.44263,-37.20917,1259.0213,0,0
861.49536,-38.51515,1258.1571,0,0.63571548
847.36926,-38.863992,1258.0019,0,0
808.09178,-39.690919,1257.4922,0,0
689.65009,-39.5677,1254.3584,1,1.942322
727.20965,-40.579615,1255.9836,1,0
687.17318,-39.492704,1254.2506,1,0
648.2255,-38.402047,1252.5177,1,0
610.37034,-37.307635,1250.7848,1,0
573.61148,-36.209457,1249.0519,1,0
537.95269,-35.107502,1247.3189,1,0
503.39774,-34.00176,1245.586,1,0
469.95043,-32.892221,1243.8531,1,0
437.61457,-31.778873,1242.1202,1,0
799.03469,-30.091366,1363.147,0,0
747.96186,-31.533324,1362.2815,0,0.65724155
716.5782,-32.201659,1361.6379,0,0.64089414
704.76401,-32.755341,1361.6179,0,0
671.56492,-33.642783,1361.1082,0,0
617.4654,-33.763186,1359.4014,1,0.59206126
584.95097,-32.904508,1357.7018,1,0.57593092
553.29071,-32.043201,1356.0025,1,0.55980603
522.4877,-31.1793,1354.3036,1,0.54368709
456.37163,-29.065318,1350.3841,1,1.7460552
429.41405,-28.225615,1348.7503,1,1.6927622
403.26138,-27.383484,1347.1168,1,1.6394953
377.91636,-26.538965,1345.4835,1,1.5862572
353.38174,-25.692106,1343.8506,1,1.5330507
329.6603,-24.842961,1342.2181,1,1.4798793
341.96379,-25.064369,1342.9023,0,0
317.35488,-24.152904,1341.1694,0,0
293.65907,-23.238164,1339.4365,0,0
270.87964,-22.320139,1337.7036,0,0
879.86905,-44.239997,1267.826,1,0.64262556
837.0563,-43.200689,1266.1243,1,0.62645206
795.27295,-42.158105,1264.4229,1,0.61028129
754.52251,-41.112257,1262.7216,1,0.59411345
714.80849,-40.063162,1261.0206,1,0.57794881
697.99953,-39.575081,1260.2671,1,0
658.96299,-38.497384,1258.5342,1,0
621.006,-37.415967,1256.8012,1,0
584.1323,-36.330819,1255.0683,1,0
548.34561,-35.241931,1253.3354,1,0
513.64969,-34.149293,1251.6025,1,0
480.04828,-33.052893,1249.8695,1,0
447.54516,-31.952721,1248.1366,1,0
416.1441,-30.848768,1246.4037,1,0
385.84889,-29.741021,1244.6708,1,0
356.66332,-28.629472,1242.9378,1,0
328.59121,-27.514109,1241.2049,1,0
301.63638,-26.394921,1239.472,1,0
912.27718,-43.086573,1237.1872,0,0
868.7838,-43.900122,1236.6775,0,0
798.61737,-43.467575,1234.7759,1,0.59474516
756.6012,-42.358033,1233.0745,1,0.57857341
738.87741,-41.86457,1232.335,1,0
697.58198,-40.725638,1230.6021,1,0
657.42743,-39.582816,1228.8691,1,0
618.41765,-38.436092,1227.1362,1,0
580.55655,-37.285455,1225.4033,1,0
543.84805,-36.130894,1223.6704,1,0
508.29607,-34.972399,1221.9374,1,0
473.90456,-33.809958,1220.2045,1,0
440.67747,-32.643559,1218.4716,1,0
408.61877,-31.473192,1216.7387,1,0
377.73242,-30.298845,1215.0057,1,0
348.02241,-29.120507,1213.2728,1,0
319.49274,-27.938166,1211.5399,1,0
843.86929,-41.316107,1198.7186,0,0.5941099
826.79891,-41.91915,1198.6848,0,0
784.48595,-42.706725,1198.1751,0,0
717.99441,-42.727698,1196.6582,1,0.54531601
676.71223,-41.449076,1194.9063,1,0.52912231
636.54926,-40.244173,1193.2019,1,0.51290346
597.57429,-39.03531,1191.4975,1,0.496685
559.79126,-37.82248,1189.7931,1,0.48046697
523.20414,-36.605676,1188.0888,1,0.46424941
487.81688,-35.384893,1186.3845,1,0.44803237
453.63348,-34.160126,1184.6803,1,0.4318159
420.65792,-32.931372,1182.9761,1,0.41560009
388.8942,-31.698627,1181.2719,1,0.399385
358.34635,-30.46189,1179.5678,1,0.38317074
329.01838,-29.221164,1177.8637,1,0.3669574
300.91434,-27.97645,1176.1598,1,0.35074512
274.03826,-26.727754,1174.4559,1,0.33453404
921.39777,-38.927731,1282.1588,0,0.67140436
908.46411,-39.322265,1282.0683,0,0
868.72089,-40.16412,1281.5586,0,0
828.13597,-41.005665,1281.049,0,0
762.05307,-40.661669,1279.1247,1,0.6062713
746.28021,-40.061126,1278.3171,1,0
684.4336,-38.626679,1275.7218,1,0.57393157
647.1369,-37.604412,1274.0206,1,0.55776648
610.8535,-36.578989,1272.3197,1,0.54160497
575.58686,-35.550435,1270.619,1,0.52544735
541.34044,-34.518776,1268.9185,1,0.509294
508.11774,-33.484045,1267.2184,1,0.49314533
475.92223,-32.446281,1265.5186,1,0.47700184
444.75741,-31.405528,1263.8191,1,0.46086404
414.6268,-30.361839,1262.12,1,0.44473258
385.53392,-29.315277,1260.4213,1,0.42860815
357.48228,-28.265914,1258.7231,1,0.4124916
306.08887,-26.076663,1255.3465,1,1.3118738
314.50722,-26.262111,1255.789,0,0
793.63852,-42.860058,1226.2426,0,0
750.72775,-42.49123,1224.9989,1,0
708.81393,-41.335753,1223.266,1,0
668.05755,-40.176338,1221.5331,1,0
628.46257,-39.012974,1219.8002,1,0
590.03293,-37.84565,1218.0672,1,0
552.77259,-36.674356,1216.3343,1,0
516.68554,-35.499078,1214.6014,1,0
481.77577,-34.319807,1212.8685,1,0
448.04726,-33.136531,1211.1355,1,0
415.50404,-31.949238,1209.4026,1,0
384.15013,-30.757916,1207.6697,1,0
353.98956,-29.562555,1205.9368,1,0
325.02637,-28.363142,1204.2038,1,0
297.26463,-27.159667,1202.4709,1,0
270.7084,-25.952116,1200.738,1,0
1123.9765,-29.746884,1229.348,0,0
1093.8254,-30.555276,1228.8384,0,0
1062.8661,-31.363331,1228.3287,0,0
1031.0989,-32.171047,1227.819,0,0
998.5241,-32.978426,1227.3093,0,0
965.14213,-33.785466,1226.7996,0,0
930.95329,-34.592168,1226.2899,0,0
895.95791,-35.39853,1225.7803,0,0
860.15634,-36.204554,1225.2706,0,0
823.54891,-37.010238,1224.7609,0,0
764.15397,-38.064052,1223.8192,0,0.58012522
747.91786,-38.620586,1223.7415,0,0
708.89492,-39.42525,1223.2318,0,0
647.92346,-39.548424,1221.761,1,0.53128564
609.70699,-38.408485,1220.0586,1,0.51509878
591.33391,-37.707463,1219.134,1,0
554.21054,-36.538614,1217.4011,1,0
501.83735,-34.967381,1214.9526,1,0.466554
468.15335,-33.81332,1213.251,1,0.45037862
435.61195,-32.655791,1211.5496,1,0.43420692
404.21697,-31.494832,1209.8485,1,0.41803933
901.0963,-37.103685,1345.5334,0,0.70375957
889.9252,-37.536996,1345.501,0,0
851.94886,-38.415638,1344.9913,0,0
787.52854,-38.85477,1343.4531,1,0.65491992
750.06957,-37.96733,1341.7538,1,0.63879159
713.49365,-37.077168,1340.0548,1,0.62266827
677.67059,-36.10747,1338.3037,1,0.6064932
642.69644,-35.205048,1336.6007,1,0.59030127
628.43903,-34.7188,1335.817,1,0
575.42797,-33.39113,1333.1952,1,0.55792312
543.13996,-32.479648,1331.4926,1,0.54173725
511.75363,-31.565163,1329.7901,1,0.52555378
481.27216,-30.647688,1328.0878,1,0.50937294
451.69872,-29.727237,1326.3857,1,0.49319498
423.0365,-28.803829,1324.6837,1,0.4770202
395.28869,-27.877484,1322.9819,1,0.46084893
368.4585,-26.948229,1321.2804,1,0.44468156
342.54912,-26.016094,1319.5791,1,0.42851852
327.96789,-25.319674,1318.4877,1,0
293.50573,-24.143342,1316.1774,1,0.39620759
908.45734,-45.001821,1237.8025,0,0
835.98244,-44.404987,1235.7816,1,0.60853475
792.89541,-43.293514,1234.0776,1,0.59232317
750.90508,-42.178378,1232.3737,1,0.57611233
710.01513,-41.059575,1230.6698,1,0.55990229
670.22926,-39.937103,1228.966,1,0.54369313
631.55119,-38.810959,1227.2623,1,0.52748494
593.98463,-37.681145,1225.5586,1,0.51127779
575.75891,-37.055587,1224.673,1,0
522.20097,-35.410506,1222.1515,1,0.47886708
487.99137,-34.269688,1220.448,1,0.46266376
454.90826,-33.125212,1218.7447,1,0.44646201
422.95541,-31.977086,1217.0415,1,0.43026198
392.13662,-30.825321,1215.3384,1,0.41406389
362.45567,-29.669933,1213.6354,1,0.39786798
344.87465,-28.878942,1212.5425,1,0
306.52251,-27.348369,1210.23,1,0.36548383
280.27794,-26.182249,1208.5276,1,0.3492963
736.41294,-36.290152,1372.3164,1,2.2447381
782.52385,-37.246781,1374.3994,1,0
722.24946,-36.117886,1371.741,1,0.64595193
687.40252,-35.280567,1370.041,1,0.62981323
653.38793,-34.440591,1368.3411,1,0.61367906
620.20869,-33.597982,1366.6416,1,0.5975498
587.86778,-32.752765,1364.9423,1,0.58142586
556.36822,-31.904973,1363.2433,1,0.56530768
487.13474,-29.778814,1359.2334,1,1.8176127
459.49925,-28.954526,1357.5995,1,1.7643207
432.65396,-28.127824,1355.9659,1,1.7110538
406.60157,-27.298743,1354.3326,1,1.6578144
381.34481,-26.467325,1352.6997,1,1.6046052
356.88641,-25.633618,1351.067,1,1.5514292
333.22909,-24.79768,1349.4348,1,1.4982901
345.98528,-25.012152,1350.1385,0,0
321.4218,-24.114275,1348.4055,0,0
297.75781,-23.213156,1346.6726,0,0
274.99657,-22.308789,1344.9397,0,0
915.97119,-47.142106,1206.5764,0,0
841.59696,-45.933081,1204.2463,1,0.59282824
797.09131,-44.752056,1202.5432,1,0.57662888
753.75235,-43.567258,1200.8402,1,0.56043099
734.80875,-42.926128,1200.0117,1,0
670.59006,-41.186358,1197.4345,1,0.52804016
630.77453,-39.990271,1195.7318,1,0.51184753
592.14129,-38.790438,1194.0292,1,0.49565701
554.69428,-37.586873,1192.3269,1,0.47946879
518.43744,-36.379592,1190.6246,1,0.46328314
483.37473,-35.168616,1188.9226,1,0.44710032
449.51009,-33.95397,1187.2208,1,0.43092065
416.84751,-32.735686,1185.5192,1,0.41474451
385.39098,-31.513802,1183.8179,1,0.39857231
355.14449,-30.288363,1182.1169,1,0.38240458
326.11206,-29.059427,1180.4162,1,0.36624188
298.29769,-27.827062,1178.7159,1,0.35008493
843.8486,-32.131293,1336.3313,0,0
789.43147,-33.543346,1335.4629,0,0.65683588
756.04733,-34.254042,1334.8609,0,0.6404853
743.52443,-34.751055,1334.8023,0,0
708.33701,-35.623737,1334.2926,0,0
651.16133,-35.61393,1332.5314,1,0.5916707
616.77725,-34.70352,1330.8303,1,0.57551162
583.29621,-33.790233,1329.1295,1,0.55935634
550.72136,-32.874089,1327.4289,1,0.54320521
519.05591,-31.955117,1325.7285,1,0.52705859
488.30303,-31.033344,1324.0285,1,0.51091693
458.46592,-30.108808,1322.3288,1,0.4947807
429.54779,-29.181548,1320.6294,1,0.47865045
401.55185,-28.251614,1318.9303,1,0.46252682
374.48132,-27.31906,1317.2317,1,0.44641051
322.67056,-25.285714,1313.7175,1,1.4241297
299.30971,-24.380371,1312.0841,1,1.3708578
276.81684,-23.472617,1310.4511,1,1.3176201
255.19484,-22.562525,1308.8186,1,1.2644208
801.94972,-39.086328,1347.0876,1,0.66293891
764.29904,-38.206489,1345.3889,1,0.64682155
727.47835,-37.250744,1343.6404,1,0.63069133
691.4107,-36.359095,1341.938,1,0.61450949
656.22553,-35.464485,1340.2357,1,0.59832998
621.92596,-34.566924,1338.5336,1,0.58215298
588.51512,-33.666423,1336.8317,1,0.56597872
555.99615,-32.762994,1335.1299,1,0.54980743
524.3722,-31.856654,1333.4283,1,0.53363939
493.6464,-30.947422,1331.7269,1,0.5174749
478.96869,-30.323223,1330.7724,1,0
434.90194,-29.120373,1328.3248,1,0.48515799
406.88962,-28.202614,1326.6242,1,0.4690064
379.78815,-27.282079,1324.9238,1,0.45286005
353.60072,-26.358811,1323.2238,1,0.4367195
328.33054,-25.43286,1321.5241,1,0.42058543
303.9808,-24.504289,1319.8249,1,0.40445862
280.55473,-23.573167,1318.1261,1,0.38833996
239.00363,-21.69314,1314.8581,1,1.2319347
887.92368,-38.845563,1272.8133,0,0.65326316
874.2258,-39.353947,1272.7782,0,0
834.45375,-40.190107,1272.2686,0,0
793.8457,-41.025952,1271.7589,0,0
729.11411,-40.13612,1269.5143,1,0.58817567
690.35241,-39.101253,1267.8133,1,0.57201223
652.61668,-38.063202,1266.1125,1,0.55585236
615.91041,-37.02199,1264.4119,1,0.53969638
580.23709,-35.977643,1262.7116,1,0.52354465
545.60026,-34.930194,1261.0116,1,0.50739758
512.00342,-33.87968,1259.3119,1,0.49125564
479.45011,-32.826144,1257.6126,1,0.47511933
447.89511,-31.690631,1255.863,1,0.45896585
417.2544,-30.621493,1254.1585,1,0.4427448
387.66763,-29.548759,1252.4539,1,0.42652403
370.91152,-28.910472,1251.4531,1,0
342.5491,-27.813748,1249.7201,1,0
305.26678,-26.308915,1247.3403,1,0.37786378
759.49122,-29.044765,1325.6792,0,0
730.01267,-29.912289,1325.1695,0,0
699.66674,-30.779524,1324.6598,0,0
649.75692,-31.91601,1323.687,0,0.58928254
636.3739,-32.513121,1323.6404,0,0
603.42757,-33.379483,1323.1307,0,0
551.7633,-33.058184,1321.2304,1,0.54046292
519.75329,-32.122194,1319.5266,1,0.52425611
488.6673,-31.183034,1317.8229,1,0.50805044
458.50856,-30.240705,1316.1193,1,0.49184603
429.28031,-29.29521,1314.4157,1,0.47564301
400.98577,-28.346554,1312.7123,1,0.45944153
385.85738,-27.76097,1311.7342,1,0
347.2109,-26.439789,1309.3056,1,0.42704386
332.27999,-25.814133,1308.2684,1,0
306.95486,-24.835555,1306.5354,1,0
282.61003,-23.853525,1304.8025,1,0
259.24896,-22.868035,1303.0696,1,0
616.28207,-32.824539,1381.4671,1,2.0801651
585.84501,-32.040337,1379.8346,1,2.027007
415.25126,-27.170177,1369.8758,1,6.786153
568.73466,-31.739968,1378.9927,1,0.58026861
538.18965,-30.916351,1377.2932,1,0.56414296
508.46435,-30.090205,1375.594,1,0.54802316
479.56171,-29.261566,1373.8952,1,0.53190975
418.32429,-27.255864,1370.0254,1,1.7071048
393.06468,-26.450344,1368.3917,1,1.6538338
368.57757,-25.642496,1366.7582,1,1.600591
344.86564,-24.832364,1365.125,1,1.5473793
321.93156,-24.019997,1363.4922,1,1.4942021
299.77803,-23.205457,1361.8598,1,1.441063
310.36602,-23.373119,1362.473,0,0
287.43016,-22.498068,1360.7401,0,0
265.37094,-21.619835,1359.0072,0,0
244.19155,-20.738413,1357.2742,0,0
223.89518,-19.853791,1355.5413,0,0
685.72328,-35.839098,1349.7258,1,4.6532103
822.64776,-38.963386,1355.966,1,0
759.46208,-37.74287,1353.2757,1,0.64983016
723.00109,-36.871384,1351.575,1,0.63367807
687.40522,-35.997108,1349.8745,1,0.61752978
673.91199,-35.395912,1349.0343,1,0
618.82116,-34.240268,1346.4742,1,0.5852459
585.83915,-33.357751,1344.7744,1,0.56911102
553.73462,-32.472539,1343.075,1,0.5529814
522.51066,-31.584667,1341.3758,1,0.53685751
492.17041,-30.694173,1339.677,1,0.52073989
428.70554,-28.570698,1335.852,1,1.6701174
402.229,-27.705413,1334.2183,1,1.6168316
376.58195,-26.837681,1332.585,1,1.5635736
351.7672,-25.967549,1330.952,1,1.5103465
327.78757,-25.095073,1329.3193,1,1.4571535
339.62871,-25.316642,1329.9721,0,0
314.77985,-24.38053,1328.2392,0,0
290.86876,-23.441079,1326.5063,0,0
731.34831,-32.937013,1350.7938,0,0.64035789
719.24936,-33.492985,1350.775,0,0
685.31558,-34.374529,1350.2653,0,0
630.07481,-34.491847,1348.5705,1,0.591532
596.87126,-33.613894,1346.8712,1,0.57540578
564.54141,-32.733292,1345.1723,1,0.55928526
533.08836,-31.85008,1343.4737,1,0.54317095
465.60873,-29.686114,1339.5527,1,1.7443696
438.08535,-28.827641,1337.9191,1,1.6910942
411.38517,-27.966725,1336.2859,1,1.637846
385.51097,-27.103409,1334.653,1,1.5846278
360.46555,-26.237744,1333.0204,1,1.5314427
374.83044,-26.511286,1333.7923,0,0
348.78327,-25.582506,1332.0594,0,0
323.66654,-24.650405,1330.3264,0,0
299.48357,-23.714975,1328.5935,0,0
276.2377,-22.776208,1326.8606,0,0
253.93227,-21.834093,1325.1277,0,0
718.16564,-37.869968,1320.8519,1,0.61317857
681.56038,-36.936783,1319.1504,1,0.59701159
645.88004,-36.000618,1317.4492,1,0.58084783
611.12784,-35.061492,1315.7481,1,0.56468756
577.30701,-34.119423,1314.0473,1,0.54853111
544.42081,-33.174436,1312.3467,1,0.53237881
512.47248,-32.226558,1310.6464,1,0.51623105
481.4653,-31.275821,1308.9463,1,0.50008827
451.40252,-30.322263,1307.2466,1,0.48395098
422.28743,-29.365927,1305.5472,1,0.46781973
394.12332,-28.406865,1303.8483,1,0.45169519
366.91348,-27.445137,1302.1497,1,0.43557808
315.54671,-25.377669,1298.68,1,1.388276
292.11172,-24.444197,1297.0468,1,1.3350026
269.57161,-23.508277,1295.4139,1,1.2817641
276.46558,-23.620397,1295.7898,0,0
253.34671,-22.616758,1294.0569,0,0
953.47713,-46.273159,1263.3127,1,0.6649894
908.60069,-45.222548,1261.6099,1,0.64879653
864.76286,-44.168525,1259.9072,1,0.6326053
821.96717,-43.111095,1258.2046,1,0.61641584
780.21716,-42.050261,1256.5021,1,0.60022827
739.51638,-40.986032,1254.7998,1,0.58404278
699.86838,-39.918415,1253.0976,1,0.56785952
661.27674,-38.847421,1251.3955,1,0.5516787
623.74503,-37.773064,1249.6936,1,0.53550054
587.27683,-36.69536,1247.9919,1,0.51932529
551.87576,-35.614328,1246.2904,1,0.50315322
517.54541,-34.529991,1244.5891,1,0.48698466
484.2894,-33.442378,1242.8881,1,0.47081997
452.11137,-32.351521,1241.1873,1,0.45465955
421.01494,-31.257459,1239.4869,1,0.43850389
391.00376,-30.16024,1237.7867,1,0.42235352
362.08149,-29.05992,1236.0869,1,0.40620908
334.2518,-27.956565,1234.3876,1,0.39007131
307.51837,-26.850256,1232.6887,1,0.37394106
988.18451,-37.293367,1382.1041,0,0.76208682
979.12774,-37.706446,1382.1232,0,0
940.9721,-38.604788,1381.6135,0,0
901.91826,-39.502863,1381.1038,0,0
774.58917,-37.113333,1375.6564,1,2.307072
740.05868,-36.317729,1374.0229,1,2.2538072
706.29163,-35.5197,1372.3896,1,2.2005632
749.89154,-36.468143,1374.4168,1,0
691.38689,-35.309076,1371.7524,1,0.63262432
657.2951,-34.470871,1370.0517,1,0.61647446
624.0356,-33.629966,1368.3512,1,0.60032863
610.86653,-33.036,1367.4851,1,0
560.02539,-31.940142,1364.951,1,0.56805047
529.2807,-31.091275,1363.2512,1,0.55191892
499.3803,-30.23981,1361.5518,1,0.535793
470.32723,-29.385786,1359.8528,1,0.51967323
442.1245,-28.529242,1358.1541,1,0.5035602
384.2785,-26.523313,1354.4018,1,1.6132831
359.72243,-25.691004,1352.7682,1,1.5600166
335.96455,-24.85635,1351.1349,1,1.5067804
313.00761,-24.019404,1349.502,1,1.4535777
1012.0277,-38.731502,1358.511,0,0
972.85329,-39.617263,1358.0013,0,0
932.79326,-40.502749,1357.4916,0,0
864.05115,-40.267674,1355.4312,1,0.69250766
825.2338,-39.402806,1353.7323,1,0.67638766
787.27785,-38.535277,1352.0337,1,0.66027279
750.17449,-37.59347,1350.286,1,0.64415983
713.77837,-36.714387,1348.5839,1,0.62798205
678.25268,-35.832387,1346.8819,1,0.61180676
643.60049,-34.947479,1345.18,1,0.59563415
609.8249,-34.059675,1343.4783,1,0.57946446
576.92902,-33.16899,1341.7768,1,0.56329794
544.91597,-32.27544,1340.0754,1,0.54713487
513.78885,-31.379044,1338.3743,1,0.53097556
483.5508,-30.479826,1336.6734,1,0.51482036
454.20497,-29.577813,1334.9728,1,0.49866968
425.75448,-28.673036,1333.2724,1,0.48252397
398.20249,-27.765533,1331.5724,1,0.46638375
371.55217,-26.855347,1329.8727,1,0.4502496
345.80668,-25.942529,1328.1734,1,0.4341222
93.298997,-13.665124,1306.0399,1,12.19276
902.58878,-41.945753,1336.0466,1,0.69398567
862.0308,-41.042469,1334.3459,1,0.6778321
822.36942,-40.136299,1332.6455,1,0.66168201
783.60778,-39.227259,1330.9452,1,0.64553566
745.74905,-38.315368,1329.2451,1,0.62939335
708.79641,-37.400646,1327.5453,1,0.61325539
672.75303,-36.483117,1325.8458,1,0.59712213
637.48748,-35.484922,1324.0941,1,0.58093506
603.09662,-34.554563,1322.3904,1,0.56472996
569.62439,-33.621049,1320.6868,1,0.54852601
537.07401,-32.684381,1318.9832,1,0.53232334
505.44869,-31.744563,1317.2798,1,0.51612205
474.75166,-30.801597,1315.5764,1,0.49992228
444.98617,-29.855489,1313.8732,1,0.48372419
416.15546,-28.906247,1312.17,1,0.46752795
388.26277,-27.953879,1310.4669,1,0.45133375
361.31138,-26.998399,1308.764,1,0.43514184
335.30456,-26.039822,1307.0613,1,0.41895246
320.41478,-25.383925,1305.9969,1,0
1016.3551,-42.171442,1218.4262,0,0
946.35401,-43.105921,1217.3565,0,0.63850562
930.41012,-43.773293,1217.4068,0,0
886.2366,-44.573703,1216.8971,0,0
814.72631,-44.750257,1215.4083,1,0.58972487
796.53551,-44.198613,1214.6545,1,0
752.92614,-43.019465,1212.9216,1,0
710.49792,-41.836312,1211.1887,1,0
669.25486,-40.649142,1209.4557,1,0
629.20098,-39.457944,1207.7228,1,0
590.34031,-38.262707,1205.9899,1,0
552.67691,-37.063419,1204.257,1,0
516.21483,-35.860068,1202.524,1,0
0,0,0,0,0
446.91091,-33.44113,1199.0582,1,0
414.07724,-32.22552,1197.3253,1,0
382.46124,-31.005801,1195.5923,1,0
352.06701,-29.781959,1193.8594,1,0
1019.1919,-37.423603,1301.1604,0,0
954.59007,-38.767881,1300.2291,0,0.69487803
915.91757,-39.665585,1299.7668,0,0.67849655
903.08193,-39.982613,1299.6313,0,0
862.67309,-40.835013,1299.1217,0,0
821.44897,-41.317451,1298.3673,1,0
756.02874,-39.830675,1295.6544,1,0.61352005
740.81208,-39.317101,1294.9015,1,0
701.9974,-38.31166,1293.1685,1,0
643.2232,-36.868162,1290.5467,1,0.56495881
607.57713,-35.874254,1288.8445,1,0.54877618
572.91455,-34.877163,1287.1423,1,0.53259611
539.23885,-33.876902,1285.4404,1,0.51641885
506.55343,-32.873489,1283.7386,1,0.50024466
474.86168,-31.866945,1282.037,1,0.48407386
444.16701,-30.857294,1280.3357,1,0.46790679
414.47284,-29.844567,1278.6346,1,0.45174386
385.7826,-28.828798,1276.9338,1,0.43558553
358.09972,-27.810031,1275.2333,1,0.41943233
331.42765,-26.788316,1273.5331,1,0.40328487
802.32728,-35.023249,1311.0165,0,0.64600689
789.78403,-35.438025,1310.91,0,0
753.91647,-36.297048,1310.4003,0,0
717.19004,-37.155774,1309.8907,0,0
679.83416,-37.097525,1308.7693,1,0
622.92289,-35.725414,1306.1637,1,0.56468167
588.40714,-34.763168,1304.4619,1,0.54850734
554.84435,-33.79786,1302.7602,1,0.53233607
522.23782,-32.829507,1301.0588,1,0.51616816
490.59086,-31.858134,1299.3575,1,0.50000394
459.90679,-30.883764,1297.6565,1,0.48384376
444.25762,-30.181703,1296.6389,1,0
401.44064,-28.926166,1294.2554,1,0.45153731
373.66524,-27.943017,1292.5552,1,0.43539206
346.86609,-26.957034,1290.8555,1,0.41925295
321.04656,-25.968277,1289.1561,1,0.40312072
296.21001,-24.976818,1287.4572,1,0.38699622
272.35983,-23.982743,1285.7588,1,0.37088046
