1329.4026,-25.140745,1423.4858,0,0
1316.7173,-25.600463,1423.231,0,0
1303.8021,-26.060119,1422.9762,0,0
1290.6572,-26.519711,1422.7213,0,0
1277.2824,-26.97924,1422.4665,0,0
1263.6779,-27.438707,1422.2116,0,0
1249.8437,-27.89811,1421.9568,0,0
1235.7798,-28.35745,1421.7019,0,0
1221.4863,-28.816728,1421.4471,0,0
1206.9631,-29.275942,1421.1923,0,0
1192.2104,-29.735093,1420.9374,0,0
1177.228,-30.194181,1420.6826,0,0
1162.0162,-30.653206,1420.4277,0,0
1146.5749,-31.112168,1420.1729,0,0
1130.904,-31.571066,1419.9181,0,0
1115.0038,-32.029902,1419.6632,0,0
1098.8741,-32.488674,1419.4084,0,0
1082.5151,-32.947383,1419.1535,0,0
1065.9268,-33.406029,1418.8987,0,0
1021.551,-34.541852,1418.1882,0,0.80608137
1004.5434,-34.770673,1417.777,0,0.79797005
987.31752,-34.997326,1417.3644,0,0.78971494
997.2806,-35.239978,1417.8793,0,0
979.54603,-35.698307,1417.6245,0,0
961.5823,-36.156573,1417.3696,0,0
943.38946,-36.614775,1417.1148,0,0
924.96754,-37.072914,1416.8599,0,0
906.31656,-37.530989,1416.6051,0,0
859.62778,-37.783425,1415.3444,1,0.73264197
841.31489,-37.403218,1414.4948,1,0.72458263
823.19123,-37.022393,1413.6452,1,0.71652448
805.25716,-36.640952,1412.7957,1,0.70846758
787.51304,-36.258896,1411.9463,1,0.70041195
713.75987,-34.420818,1408.1875,1,2.291421
697.65148,-34.049843,1407.3705,1,2.2647737
681.72083,-33.678282,1406.5534,1,2.2381312
665.96821,-33.306136,1405.7364,1,2.2114936
650.39395,-32.933408,1404.9195,1,2.1848611
634.99836,-32.5601,1404.1026,1,2.1582339
619.78177,-32.186214,1403.2858,1,2.1316122
604.74448,-31.811753,1402.4691,1,2.1049962
589.88682,-31.43672,1401.6524,1,2.0783861
575.2091,-31.061118,1400.8357,1,2.0517822
560.71165,-30.68495,1400.0192,1,2.0251846
546.39477,-30.308221,1399.2026,1,1.9985938
532.25878,-29.930932,1398.3862,1,1.9720098
518.30402,-29.553089,1397.5698,1,1.945433
504.53079,-29.174696,1396.7536,1,1.9188638
1239.6912,-25.483557,1308.8223,0,0
1226.8421,-25.912497,1308.5674,0,0
1213.7787,-26.341362,1308.3126,0,0
1200.5008,-26.770153,1308.0577,0,0
1187.0085,-27.19887,1307.8029,0,0
1173.3019,-27.627512,1307.5481,0,0
1159.381,-28.05608,1307.2932,0,0
1145.2459,-28.484573,1307.0384,0,0
1130.8965,-28.912991,1306.7835,0,0
1116.3329,-29.341335,1306.5287,0,0
1101.5552,-29.769604,1306.2738,0,0
1086.5633,-30.197799,1306.019,0,0
1071.3574,-30.625919,1305.7642,0,0
1055.9374,-31.053964,1305.5093,0,0
1040.3034,-31.481934,1305.2545,0,0
1024.4555,-31.90983,1304.9996,0,0
1008.3936,-32.33765,1304.7448,0,0
992.11783,-32.765396,1304.49,0,0
0,0,0,0,0
958.92478,-33.620663,1303.9803,0,0
942.00756,-34.048184,1303.7254,0,0
924.87661,-34.475631,1303.4706,0,0
907.53195,-34.903002,1303.2157,0,0
889.97362,-35.330298,1302.9609,0,0
848.49883,-36.273345,1302.3396,0,0.65836102
830.64228,-36.450532,1301.9277,0,0.65021682
812.38903,-37.051272,1301.797,0,0.64200414
817.60439,-37.038732,1301.9415,0,0
798.97829,-37.465652,1301.6867,0,0
780.13875,-37.892498,1301.4318,0,0
761.0858,-38.319268,1301.177,0,0
741.81949,-38.745963,1300.9222,0,0
699.70654,-38.221933,1299.3999,1,0.59323805
681.20956,-37.737334,1298.5507,1,0.58518074
662.95375,-37.252038,1297.7017,1,0.57712498
644.92756,-36.691409,1296.8034,1,0.56906694
627.06575,-36.201054,1295.9522,1,0.56097495
609.44631,-35.709908,1295.1011,1,0.55288356
592.06966,-35.217972,1294.25,1,0.54479279
574.93622,-34.725248,1293.3989,1,0.53670268
558.04641,-34.231737,1292.5479,1,0.52861325
541.40065,-33.737442,1291.6969,1,0.52052453
1000.1957,-26.500563,1421.9375,0,0
986.83056,-26.959898,1421.6827,0,0
973.23579,-27.419171,1421.4278,0,0
959.4114,-27.87838,1421.173,0,0
945.35742,-28.337527,1420.9181,0,0
931.07388,-28.79661,1420.6633,0,0
916.56082,-29.25563,1420.4084,0,0
901.81826,-29.714587,1420.1536,0,0
886.84625,-30.173481,1419.8988,0,0
848.77356,-31.27267,1419.2398,0,0.73915959
833.37493,-31.50215,1418.8287,0,0.73105837
817.74092,-31.762525,1418.4403,0,0.72280685
824.66417,-32.008424,1418.8794,0,0
808.54531,-32.467002,1418.6246,0,0
792.19718,-32.925516,1418.3697,0,0
775.61981,-33.383967,1418.1149,0,0
758.81322,-33.842354,1417.86,0,0
741.77746,-34.300678,1417.6052,0,0
724.72424,-33.912106,1416.7387,0,0
707.86548,-33.5228,1415.8723,0,0
691.20156,-33.132759,1415.0058,0,0
674.73284,-32.741983,1414.1393,0,0
658.4597,-32.35047,1413.2729,0,0
642.3825,-31.958219,1412.4064,0,0
626.5016,-31.56523,1411.5399,0,0
610.81739,-31.171502,1410.6735,0,0
595.33022,-30.777034,1409.807,0,0
580.04048,-30.381824,1408.9406,0,0
564.94852,-29.985873,1408.0741,0,0
550.05473,-29.589178,1407.2076,0,0
535.35947,-29.19174,1406.3412,0,0
520.86311,-28.793557,1405.4747,0,0
506.56604,-28.394628,1404.6082,0,0
52.28228,-9.6071815,1364.6114,1,22.861629
478.57121,-27.59453,1402.8753,0,0
464.8742,-27.193359,1402.0089,0,0
451.37797,-26.791438,1401.1424,0,0
438.08289,-26.388767,1400.2759,0,0
424.98933,-25.985345,1399.4095,0,0
412.09767,-25.581171,1398.543,0,0
1290.3756,-21.005375,1120.9631,0,0
1279.7817,-21.370279,1120.7083,0,0
1269.0053,-21.735082,1120.4535,0,0
1258.0466,-22.099783,1120.1986,0,0
1246.9056,-22.464383,1119.9438,0,0
1235.5823,-22.828881,1119.6889,0,0
1224.0767,-23.193278,1119.4341,0,0
1212.389,-23.557573,1119.1792,0,0
1200.5192,-23.921766,1118.9244,0,0
1188.4673,-24.285857,1118.6696,0,0
1176.2333,-24.649847,1118.4147,0,0
1163.8174,-25.013735,1118.1599,0,0
1151.2196,-25.37752,1117.905,0,0
1138.4399,-25.741204,1117.6502,0,0
1125.4784,-26.104786,1117.3953,0,0
1112.3351,-26.468266,1117.1405,0,0
1099.0102,-26.831644,1116.8857,0,0
1085.5035,-27.194919,1116.6308,0,0
1071.8153,-27.558092,1116.376,0,0
1057.9454,-27.921163,1116.1211,0,0
1043.8941,-28.284132,1115.8663,0,0
1029.6613,-28.646999,1115.6115,0,0
1015.2471,-29.009763,1115.3566,0,0
1000.6516,-29.372425,1115.1018,0,0
985.87473,-29.734984,1114.8469,0,0
970.91662,-30.09744,1114.5921,0,0
955.77731,-30.459794,1114.3372,0,0
940.45684,-30.822046,1114.0824,0,0
924.95528,-31.184195,1113.8276,0,0
909.27266,-31.546241,1113.5727,0,0
893.40905,-31.908184,1113.3179,0,0
877.3645,-32.270025,1113.063,0,0
861.13905,-32.631763,1112.8082,0,0
844.73275,-32.993397,1112.5533,0,0
828.14567,-33.354929,1112.2985,0,0
811.37784,-33.716358,1112.0437,0,0
794.42932,-34.077684,1111.7888,0,0
777.30017,-34.438907,1111.534,0,0
759.99044,-34.800026,1111.2791,0,0
742.50016,-35.161043,1111.0243,0,0
724.82941,-35.521956,1110.7695,0,0
706.97822,-35.882766,1110.5146,0,0
1450.4032,-29.302519,1392.4465,0,0
1435.639,-29.754406,1392.1917,0,0
1420.6488,-30.206227,1391.9368,0,0
1405.4327,-30.657982,1391.682,0,0
1389.9908,-31.109672,1391.4272,0,0
1374.3231,-31.561296,1391.1723,0,0
1358.4295,-32.012854,1390.9175,0,0
1342.3102,-32.464346,1390.6626,0,0
1325.9652,-32.915772,1390.4078,0,0
1309.3945,-33.367132,1390.153,0,0
1292.5981,-33.818427,1389.8981,0,0
1275.5761,-34.269655,1389.6433,0,0
1258.3284,-34.720818,1389.3884,0,0
1240.8553,-35.171914,1389.1336,0,0
1223.1565,-35.622944,1388.8787,0,0
1205.2323,-36.073909,1388.6239,0,0
1187.0826,-36.524807,1388.3691,0,0
1168.7075,-36.975639,1388.1142,0,0
1119.3904,-37.983395,1387.3178,0,0.81551452
1100.6419,-38.198235,1386.9057,0,0.80732756
1081.4432,-38.827249,1386.7865,0,0.79910303
1092.9534,-38.778306,1387.0949,0,0
1073.4516,-39.228808,1386.84,0,0
1053.7246,-39.679243,1386.5852,0,0
1033.7724,-40.129611,1386.3303,0,0
1013.595,-40.579914,1386.0755,0,0
993.19249,-41.03015,1385.8206,0,0
942.08719,-40.808468,1384.2419,1,0.74210298
952.02406,-40.89067,1384.577,1,0
902.46151,-39.988871,1382.5389,1,0.72591072
882.9524,-39.578,1381.6874,1,0.71781514
863.64626,-39.166414,1380.8359,1,0.70971994
844.54348,-38.754114,1379.9845,1,0.70162514
825.6444,-38.3411,1379.1331,1,0.69353075
806.94941,-37.927371,1378.2817,1,0.68543678
788.45886,-37.512929,1377.4303,1,0.67734326
770.17314,-37.097774,1376.579,1,0.66925019
752.09261,-36.681906,1375.7276,1,0.6611576
734.21763,-36.265326,1374.8763,1,0.6530655
716.54859,-35.848034,1374.0251,1,0.6449739
699.08584,-35.430031,1373.1738,1,0.63688284
681.82978,-35.011318,1372.3226,1,0.62879232
664.78075,-34.591896,1371.4715,1,0.62070237
669.00682,-34.551507,1371.5801,1,0
651.83825,-34.122669,1370.7136,1,0
614.87969,-33.329384,1368.9181,1,0.59643619
598.66258,-32.907136,1368.0671,1,0.58834877
601.62177,-32.831447,1368.1142,1,0
1292.3688,-22.261793,1044.3458,0,0
1281.1548,-22.593966,1044.091,0,0
1269.7748,-22.926022,1043.8361,0,0
1258.2288,-23.257961,1043.5813,0,0
1246.5169,-23.589783,1043.3265,0,0
1234.6391,-23.921489,1043.0716,0,0
1222.5954,-24.253076,1042.8168,0,0
1210.386,-24.584547,1042.5619,0,0
1198.0109,-24.915901,1042.3071,0,0
1185.4701,-25.247137,1042.0522,0,0
1172.7638,-25.578256,1041.7974,0,0
1159.8919,-25.909258,1041.5426,0,0
1146.8545,-26.240142,1041.2877,0,0
1133.6518,-26.570908,1041.0329,0,0
1120.2836,-26.901557,1040.778,0,0
1106.7502,-27.232088,1040.5232,0,0
1093.0516,-27.562502,1040.2684,0,0
1079.1877,-27.892798,1040.0135,0,0
1065.1588,-28.222976,1039.7587,0,0
1050.9648,-28.553036,1039.5038,0,0
1036.6058,-28.882979,1039.249,0,0
1022.0818,-29.212803,1038.9941,0,0
1007.393,-29.542509,1038.7393,0,0
992.53934,-29.872098,1038.4845,0,0
977.52092,-30.201568,1038.2296,0,0
962.33779,-30.530919,1037.9748,0,0
946.99002,-30.860153,1037.7199,0,0
931.47766,-31.189268,1037.4651,0,0
915.80077,-31.518265,1037.2102,0,0
899.95941,-31.847144,1036.9554,0,0
883.95365,-32.175904,1036.7006,0,0
867.78353,-32.504545,1036.4457,0,0
851.44912,-32.833068,1036.1909,0,0
834.95048,-33.161472,1035.936,0,0
818.28767,-33.489757,1035.6812,0,0
801.46075,-33.817924,1035.4264,0,0
784.46977,-34.145971,1035.1715,0,0
767.31479,-34.4739,1034.9167,0,0
749.99589,-34.80171,1034.6618,0,0
732.5131,-35.129401,1034.407,0,0
1427.8979,-26.722071,1417.9625,0,0
1414.4223,-27.18042,1417.7077,0,0
1400.7175,-27.638707,1417.4528,0,0
1386.7836,-28.09693,1417.198,0,0
1372.6206,-28.555089,1416.9432,0,0
1358.2285,-29.013185,1416.6883,0,0
1343.6074,-29.471217,1416.4335,0,0
0,0,0,0,0
1313.6783,-30.387092,1415.9238,0,0
1298.3703,-30.844934,1415.6689,0,0
1282.8333,-31.302712,1415.4141,0,0
1267.0676,-31.760427,1415.1593,0,0
1251.0729,-32.218078,1414.9044,0,0
1234.8495,-32.675665,1414.6496,0,0
1218.3973,-33.133189,1414.3947,0,0
1201.7163,-33.590649,1414.1399,0,0
1184.8066,-34.048045,1413.8851,0,0
1167.6683,-34.505378,1413.6302,0,0
1150.3013,-34.962647,1413.3754,0,0
1132.7056,-35.419852,1413.1205,0,0
1085.184,-36.373539,1412.2617,0,0.82332985
1067.1877,-36.598218,1411.8493,0,0.81509932
1048.6239,-37.432626,1411.8758,0,0.80688178
1060.0376,-37.248033,1412.1012,0,0
1041.2993,-37.704919,1411.8463,0,0
1022.3327,-38.161741,1411.5915,0,0
1003.1376,-38.618499,1411.3366,0,0
983.71419,-39.075193,1411.0818,0,0
964.06244,-39.531823,1410.8269,0,0
914.63911,-39.185507,1409.1212,1,0.74989427
895.52311,-38.797503,1408.2697,1,0.74179999
904.96323,-38.857802,1408.5945,1,0
857.86668,-38.019435,1406.5669,1,0.72561265
839.32697,-37.629371,1405.7155,1,0.71751961
820.98005,-37.23862,1404.8641,1,0.70942701
802.8263,-36.847184,1404.0128,1,0.70133488
810.3007,-36.869119,1404.2622,1,0
767.09968,-36.062254,1402.3102,1,0.68515203
749.52753,-35.668763,1401.459,1,0.67706137
732.14997,-35.274587,1400.6077,1,0.66897122
714.96734,-34.879728,1399.7565,1,0.66088163
720.63319,-34.861762,1399.9299,1,0
681.18834,-34.087963,1398.0542,1,0.64470415
664.59269,-33.691058,1397.2031,1,0.63661631
648.1934,-33.293474,1396.3521,1,0.62852911
631.99085,-32.895211,1395.501,1,0.62044256
615.9854,-32.49627,1394.65,1,0.6123567
600.17739,-32.096653,1393.7991,1,0.60427155
584.5672,-31.696361,1392.9481,1,0.59618713
1160.464,-29.165655,1195.4854,0,0
1145.783,-29.55837,1195.2305,0,0
1130.9056,-29.950996,1194.9757,0,0
1115.832,-30.343533,1194.7208,0,0
1100.5621,-30.735981,1194.466,0,0
1085.096,-31.128339,1194.2111,0,0
1069.4338,-31.520608,1193.9563,0,0
1053.5754,-31.912787,1193.7015,0,0
1037.521,-32.304878,1193.4466,0,0
1021.2706,-32.696878,1193.1918,0,0
1004.8242,-33.088789,1192.9369,0,0
988.1818,-33.480611,1192.6821,0,0
971.34356,-33.872343,1192.4272,0,0
954.30947,-34.263985,1192.1724,0,0
937.07959,-34.655538,1191.9176,0,0
919.65395,-35.047001,1191.6627,0,0
902.0326,-35.438374,1191.4079,0,0
884.21559,-35.829658,1191.153,0,0
866.20296,-36.220852,1190.8982,0,0
847.99475,-36.611956,1190.6434,0,0
829.59102,-37.00297,1190.3885,0,0
810.9918,-37.393894,1190.1337,0,0
792.19714,-37.784728,1189.8788,0,0
773.20709,-38.175472,1189.624,0,0
732.77919,-38.766606,1188.9499,0,0.55009405
734.64098,-38.95669,1189.1143,0,0
715.06501,-39.347164,1188.8595,0,0
695.29383,-39.737548,1188.6046,0,0
675.32748,-40.127841,1188.3498,0,0
655.166,-40.518045,1188.0949,0,0
614.80451,-39.819309,1186.6892,1,0.50129711
595.43651,-39.20956,1185.8381,1,0.49320456
576.36984,-38.598875,1184.9871,1,0.48511267
557.60499,-37.987256,1184.1361,1,0.47702148
539.14246,-37.374707,1183.2851,1,0.46893102
520.98276,-36.76123,1182.4343,1,0.46084132
503.12638,-36.146828,1181.5834,1,0.45275245
1479.4644,-21.621159,1489.6748,0,0
1468.5349,-22.096486,1489.42,0,0
1457.3679,-22.571756,1489.1651,0,0
1445.9632,-23.046969,1488.9103,0,0
1434.3209,-23.522124,1488.6554,0,0
1422.4411,-23.997222,1488.4006,0,0
1410.3237,-24.472262,1488.1458,0,0
1397.9688,-24.947245,1487.8909,0,0
1385.3765,-25.42217,1487.6361,0,0
1372.5467,-25.897037,1487.3812,0,0
1359.4794,-26.371847,1487.1264,0,0
1346.1748,-26.846599,1486.8715,0,0
1332.6329,-27.321294,1486.6167,0,0
1318.8535,-27.795931,1486.3619,0,0
1304.8369,-28.27051,1486.107,0,0
1290.583,-28.745032,1485.8522,0,0
1276.0919,-29.219496,1485.5973,0,0
1261.3636,-29.693902,1485.3425,0,0
1246.398,-30.16825,1485.0876,0,0
1231.1953,-30.642541,1484.8328,0,0
1215.7555,-31.116774,1484.578,0,0
1200.0786,-31.590949,1484.3231,0,0
1184.1645,-32.065066,1484.0683,0,0
1138.1405,-33.35708,1483.3195,0,0.90697743
1121.7297,-33.61159,1482.9088,0,0.89890639
1105.0929,-33.864269,1482.4969,0,0.8906986
1088.0198,-34.451472,1482.3379,0,0.88244776
1101.0394,-34.434784,1482.7941,0,0
1083.7036,-34.908554,1482.5392,0,0
1066.1309,-35.382266,1482.2844,0,0
1048.3213,-35.855919,1482.0295,0,0
1030.275,-36.329515,1481.7747,0,0
1011.9918,-36.803053,1481.5199,0,0
993.47194,-37.276533,1481.265,0,0
974.72341,-37.587896,1480.8879,1,0
956.01376,-37.2506,1480.0214,1,0
937.47293,-36.912632,1479.1549,1,0
919.10124,-36.57399,1478.2885,1,0
900.89905,-36.234674,1477.422,1,0
882.86668,-35.894684,1476.5555,1,0
865.00448,-35.554018,1475.6891,1,0
847.31278,-35.212675,1474.8226,1,0
829.79192,-34.870656,1473.9562,1,0
812.44223,-34.527958,1473.0897,1,0
795.26407,-34.184581,1472.2232,1,0
778.25777,-33.840525,1471.3568,1,0
761.42366,-33.495789,1470.4903,1,0
744.76209,-33.150371,1469.6238,1,0
728.2734,-32.804271,1468.7574,1,0
711.95793,-32.457489,1467.8909,1,0
695.81603,-32.110022,1467.0244,1,0
679.84802,-31.761872,1466.158,1,0
1406.7668,-24.479729,1397.9728,0,0
1394.4137,-24.933035,1397.7179,0,0
1381.8338,-25.386277,1397.4631,0,0
1369.0274,-25.839453,1397.2083,0,0
1355.9944,-26.292564,1396.9534,0,0
1342.7348,-26.745609,1396.6986,0,0
1329.2488,-27.19859,1396.4437,0,0
1315.5363,-27.651505,1396.1889,0,0
1301.5973,-28.104354,1395.934,0,0
1287.4319,-28.557138,1395.6792,0,0
1273.0402,-29.009857,1395.4244,0,0
1258.4221,-29.462511,1395.1695,0,0
1243.5777,-29.915098,1394.9147,0,0
1228.507,-30.367621,1394.6598,0,0
1213.21,-30.820078,1394.405,0,0
1197.6869,-31.272469,1394.1501,0,0
1181.9376,-31.724795,1393.8953,0,0
1165.9621,-32.177055,1393.6405,0,0
1149.7605,-32.62925,1393.3856,0,0
1133.3329,-33.081379,1393.1308,0,0
1116.6792,-33.533442,1392.8759,0,0
1099.7995,-33.98544,1392.6211,0,0
1082.6938,-34.437372,1392.3663,0,0
1065.3621,-34.889238,1392.1114,0,0
1019.9076,-35.91482,1391.362,0,0.78367552
1002.1916,-36.131756,1390.9501,0,0.77551017
984.08632,-36.667011,1390.7641,0,0.76727851
993.77664,-36.696045,1391.092,0,0
975.31573,-37.147582,1390.8372,0,0
956.62907,-37.599053,1390.5824,0,0
937.71669,-38.050459,1390.3275,0,0
918.57862,-38.501798,1390.0727,0,0
899.2149,-38.953072,1389.8178,0,0
852.10345,-38.680559,1388.2351,1,0.7102919
833.36272,-38.277568,1387.3857,1,0.70223379
814.82259,-37.873941,1386.5363,1,0.69417695
796.48344,-37.46968,1385.6869,1,0.68612142
721.48606,-35.557737,1381.9838,1,2.244126
704.84787,-35.165322,1381.1668,1,2.2174792
688.39768,-34.7723,1380.3499,1,2.1908373
672.13579,-34.378675,1379.533,1,2.1642005
656.06256,-33.984448,1378.7162,1,2.1375689
640.17829,-33.589622,1377.8995,1,2.1109427
624.48333,-33.194201,1377.0828,1,2.0843221
608.97799,-32.798187,1376.2662,1,2.0577075
593.66262,-32.401583,1375.4496,1,2.0310989
578.53753,-32.004393,1374.6331,1,2.0044967
563.60306,-31.60662,1373.8167,1,1.977901
1413.183,-27.839146,1344.7994,0,0
1399.1536,-28.278308,1344.5446,0,0
1384.9047,-28.717399,1344.2898,0,0
1370.4362,-29.156421,1344.0349,0,0
1355.7483,-29.595371,1343.7801,0,0
1340.8409,-30.034251,1343.5252,0,0
1325.714,-30.473061,1343.2704,0,0
1310.3678,-30.911799,1343.0155,0,0
1294.8023,-31.350468,1342.7607,0,0
1279.0174,-31.789065,1342.5059,0,0
1263.0132,-32.227592,1342.251,0,0
1246.7898,-32.666048,1341.9962,0,0
1230.3472,-33.104433,1341.7413,0,0
1213.6854,-33.542748,1341.4865,0,0
1196.8044,-33.980991,1341.2317,0,0
1179.7044,-34.419164,1340.9768,0,0
1162.3853,-34.857266,1340.722,0,0
1144.8471,-35.295298,1340.4671,0,0
1127.09,-35.733258,1340.2123,0,0
1109.1139,-36.171147,1339.9574,0,0
1090.9189,-36.608965,1339.7026,0,0
1072.5049,-37.046713,1339.4478,0,0
1053.8722,-37.484389,1339.1929,0,0
1006.882,-38.340942,1338.4062,0,0.73889978
987.921,-38.551892,1338.006,0,0.73066777
996.66104,-38.796992,1338.4284,0,0
977.15319,-39.234384,1338.1735,0,0
957.42666,-39.671704,1337.9187,0,0
937.4815,-40.108954,1337.6639,0,0
917.31772,-40.546132,1337.409,0,0
896.93538,-40.98324,1337.1542,0,0
786.81674,-39.057894,1332.8313,1,2.2297217
768.54949,-38.623193,1332.0146,1,2.2030861
750.49058,-38.187849,1331.1981,1,2.1764556
732.64036,-37.751863,1330.3816,1,2.1498305
714.99917,-37.315241,1329.5651,1,2.123211
752.61033,-38.396664,1331.3873,1,0.6334698
733.95287,-37.940957,1330.5369,1,0.62539205
715.52131,-37.484527,1329.6865,1,0.61731521
697.31605,-37.027376,1328.8362,1,0.60923931
679.33749,-36.569507,1327.986,1,0.60116439
661.58603,-36.110923,1327.1358,1,0.5930905
665.03321,-35.941935,1327.1236,1,0
626.76597,-35.19162,1325.4356,1,0.57694595
609.69818,-34.730907,1324.5856,1,0.56887538
592.85908,-34.269491,1323.7357,1,0.56080603
1148.3885,-28.99785,1223.4213,0,0
1133.7891,-29.400118,1223.1664,0,0
1118.9884,-29.8023,1222.9116,0,0
1103.9868,-30.204397,1222.6567,0,0
1088.7841,-30.606409,1222.4019,0,0
1073.3804,-31.008336,1222.1471,0,0
1057.7757,-31.410177,1221.8922,0,0
1041.9702,-31.811933,1221.6374,0,0
1025.9638,-32.213603,1221.3825,0,0
1009.7566,-32.615189,1221.1277,0,0
993.34865,-33.016688,1220.8728,0,0
976.73995,-33.418102,1220.618,0,0
959.93056,-33.819431,1220.3632,0,0
942.92053,-34.220674,1220.1083,0,0
925.7099,-34.621832,1219.8535,0,0
908.29871,-35.022904,1219.5986,0,0
890.68701,-35.42389,1219.3438,0,0
872.87484,-35.82479,1219.089,0,0
854.86224,-36.225605,1218.8341,0,0
836.64925,-36.626334,1218.5793,0,0
818.23592,-37.026977,1218.3244,0,0
799.62228,-37.427535,1218.0696,0,0
759.0011,-38.111976,1217.4122,0,0.57492594
740.05791,-38.546042,1217.1866,0,0.5667281
742.58002,-38.628691,1217.3051,0,0
723.16561,-39.028905,1217.0502,0,0
703.55113,-39.429033,1216.7954,0,0
683.7366,-39.829074,1216.5405,0,0
663.73193,-40.031697,1216.1634,1,0
623.49795,-39.086623,1214.5551,1,0.51800505
604.53671,-38.510876,1213.7051,1,0.50992892
585.86091,-37.934292,1212.8551,1,0.50185395
567.47102,-37.356876,1212.0052,1,0.49378021
549.36751,-36.778633,1211.1554,1,0.48570776
531.55086,-36.199569,1210.3057,1,0.47763666
514.02155,-35.619691,1209.4561,1,0.46956699
496.78007,-35.039005,1208.6065,1,0.46149881
1125.7297,-21.731991,1109.2096,0,0
1114.7737,-22.092168,1108.9548,0,0
1103.6376,-22.452241,1108.6999,0,0
1092.3215,-22.81221,1108.4451,0,0
1080.8254,-23.172076,1108.1902,0,0
1069.1494,-23.531838,1107.9354,0,0
1057.2936,-23.891496,1107.6805,0,0
1045.2579,-24.251051,1107.4257,0,0
1033.0425,-24.610501,1107.1709,0,0
1020.6474,-24.969848,1106.916,0,0
1008.0727,-25.32909,1106.6612,0,0
995.31837,-25.688229,1106.4063,0,0
982.3845,-26.047263,1106.1515,0,0
969.27113,-26.406193,1105.8966,0,0
955.97832,-26.76502,1105.6418,0,0
942.50613,-27.123741,1105.387,0,0
928.8546,-27.482359,1105.1321,0,0
915.02378,-27.840872,1104.8773,0,0
901.01374,-28.199281,1104.6224,0,0
886.82452,-28.557585,1104.3676,0,0
872.45617,-28.915785,1104.1128,0,0
857.90875,-29.273881,1103.8579,0,0
843.18231,-29.631872,1103.6031,0,0
828.2769,-29.989758,1103.3482,0,0
813.19257,-30.34754,1103.0934,0,0
797.92938,-30.705216,1102.8385,0,0
782.48737,-31.062788,1102.5837,0,0
766.86661,-31.420256,1102.3289,0,0
751.06713,-31.777618,1102.074,0,0
735.08901,-32.134876,1101.8192,0,0
718.93227,-32.492028,1101.5643,0,0
702.59699,-32.849076,1101.3095,0,0
686.08322,-33.206018,1101.0547,0,0
669.39099,-33.562856,1100.7998,0,0
652.52038,-33.919588,1100.545,0,0
635.47142,-34.276215,1100.2901,0,0
618.24418,-34.632737,1100.0353,0,0
600.8387,-34.989153,1099.7804,0,0
1389.9824,-29.005917,1398.5804,0,0
1375.3661,-29.459379,1398.3256,0,0
1360.5231,-29.912776,1398.0708,0,0
1345.4533,-30.366107,1397.8159,0,0
1330.157,-30.819374,1397.5611,0,0
1314.634,-31.272575,1397.3062,0,0
1298.8844,-31.725711,1397.0514,0,0
1282.9083,-32.178782,1396.7966,0,0
1266.7056,-32.631787,1396.5417,0,0
1250.2765,-33.084727,1396.2869,0,0
1233.6209,-33.537602,1396.032,0,0
1216.7389,-33.990411,1395.7772,0,0
1199.6305,-34.443155,1395.5223,0,0
1182.2958,-34.895834,1395.2675,0,0
1164.7347,-35.348447,1395.0127,0,0
1146.9473,-35.800994,1394.7578,0,0
1128.9337,-36.253476,1394.503,0,0
1080.9365,-37.180324,1393.6556,0,0.80669852
1062.5442,-37.397171,1393.2431,0,0.79846391
1043.5588,-38.286503,1393.3082,0,0.79025225
1054.6173,-38.062749,1393.4836,0,0
1035.4729,-38.514903,1393.2288,0,0
1016.1024,-38.966992,1392.9739,0,0
996.5059,-39.419015,1392.7191,0,0
976.6834,-39.870972,1392.4642,0,0
859.16483,-38.643263,1388.199,1,2.4537443
907.07844,-39.772596,1390.4007,1,0.73329715
887.67199,-39.36851,1389.5491,1,0.72520107
868.46516,-38.963717,1388.6976,1,0.71710535
849.45829,-38.558215,1387.8461,1,0.70901001
830.65175,-38.152006,1386.9947,1,0.70091507
812.04592,-37.745089,1386.1432,1,0.69282054
793.64115,-37.337465,1385.2918,1,0.68472643
775.4378,-36.929135,1384.4404,1,0.67663275
782.01125,-36.947931,1384.6559,1,0
739.63687,-36.110354,1382.7377,1,0.66044678
722.04001,-35.699906,1381.8864,1,0.65235452
704.64604,-35.288753,1381.0351,1,0.64426276
687.45533,-34.876895,1380.1839,1,0.63617153
670.46826,-34.464334,1379.3326,1,0.62808084
653.68518,-34.05107,1378.4814,1,0.61999072
637.10647,-33.637105,1377.6303,1,0.61190119
620.7325,-33.222439,1376.7791,1,0.60381227
604.56363,-32.807074,1375.928,1,0.59572399
588.60023,-32.39101,1375.077,1,0.58763637
572.84269,-31.974249,1374.226,1,0.57954945
557.29136,-31.556793,1373.375,1,0.57146325
1340.4337,-26.883991,1464.3979,0,0
1326.8743,-27.353524,1464.1431,0,0
1313.0802,-27.822998,1463.8883,0,0
1299.0513,-28.292412,1463.6334,0,0
1284.7878,-28.761767,1463.3786,0,0
1270.2896,-29.231062,1463.1237,0,0
1255.5567,-29.700297,1462.8689,0,0
1240.5893,-30.169474,1462.6141,0,0
1225.3873,-30.63859,1462.3592,0,0
1209.9507,-31.107647,1462.1044,0,0
1194.2796,-31.576644,1461.8495,0,0
1178.3741,-32.045582,1461.5947,0,0
1162.2341,-32.51446,1461.3398,0,0
1145.8596,-32.983279,1461.085,0,0
1099.868,-34.113167,1460.271,0,0.87064788
1083.0304,-34.357982,1459.8595,0,0.8624948
1065.9063,-34.705061,1459.5244,0,0.8542306
1078.0182,-34.857955,1460.0656,0,0
1060.4721,-35.326475,1459.8108,0,0
1042.6918,-35.794935,1459.556,0,0
1024.6772,-36.263335,1459.3011,0,0
1006.4285,-36.731675,1459.0463,0,0
987.94554,-37.199956,1458.7914,0,0
969.22851,-37.668176,1458.5366,0,0
920.61132,-37.410751,1456.792,1,0.78900935
902.37568,-37.061887,1455.9408,1,0.78092087
884.31266,-36.712386,1455.0896,1,0.77283288
866.4226,-36.36225,1454.2384,1,0.76474541
848.70582,-36.011478,1453.3873,1,0.75665847
831.16265,-35.660072,1452.5362,1,0.74857209
813.79344,-35.308031,1451.6851,1,0.74048627
796.5985,-34.955356,1450.8341,1,0.73240104
779.57818,-34.602048,1449.983,1,0.72431641
787.40806,-34.584432,1450.2389,1,0
746.06272,-33.893535,1448.2811,1,0.70814907
729.56824,-33.538332,1447.4302,1,0.7000664
713.24972,-33.1825,1446.5793,1,0.69198442
697.10747,-32.826038,1445.7284,1,0.68390315
681.14185,-32.468948,1444.8776,1,0.67582264
686.91838,-32.404472,1445.0402,1,0
649.74182,-31.752889,1443.1761,1,0.65966395
634.30807,-31.393923,1442.3254,1,0.65158584
619.0523,-31.034335,1441.4748,1,0.64350859
603.97482,-30.674125,1440.6241,1,0.63543224
589.07599,-30.313296,1439.7736,1,0.62735681
574.35613,-29.951849,1438.9231,1,0.61928235
559.81559,-29.589787,1438.0726,1,0.6112089
545.45471,-29.227112,1437.2222,1,0.60313649
531.27383,-28.863825,1436.3718,1,0.59506516
1290.2469,-28.719639,1030.7828,0,0
1275.8057,-29.045511,1030.528,0,0
1261.2015,-29.371262,1030.2732,0,0
1246.4344,-29.696894,1030.0183,0,0
1231.5046,-30.022406,1029.7635,0,0
1216.412,-30.347797,1029.5086,0,0
1201.1568,-30.673069,1029.2538,0,0
1185.739,-30.99822,1028.9989,0,0
1170.1586,-31.32325,1028.7441,0,0
1154.4157,-31.648161,1028.4893,0,0
1138.5105,-31.97295,1028.2344,0,0
1122.4428,-32.29762,1027.9796,0,0
1106.2129,-32.622168,1027.7247,0,0
1089.8207,-32.946597,1027.4699,0,0
1073.2663,-33.270904,1027.215,0,0
1056.5498,-33.595091,1026.9602,0,0
1039.6712,-33.919156,1026.7054,0,0
1022.6306,-34.243101,1026.4505,0,0
1005.4281,-34.566925,1026.1957,0,0
988.06374,-34.890628,1025.9408,0,0
970.53753,-35.21421,1025.686,0,0
952.84955,-35.537671,1025.4312,0,0
934.99988,-35.861011,1025.1763,0,0
916.98856,-36.184229,1024.9215,0,0
898.81567,-36.507326,1024.6666,0,0
880.48126,-36.830302,1024.4118,0,0
861.98539,-37.153156,1024.1569,0,0
843.32812,-37.475889,1023.9021,0,0
824.50952,-37.7985,1023.6473,0,0
805.52964,-38.12099,1023.3924,0,0
786.38855,-38.443358,1023.1376,0,0
767.08631,-38.765604,1022.8827,0,0
747.62297,-39.087729,1022.6279,0,0
727.9986,-39.409731,1022.3731,0,0
708.21326,-39.731612,1022.1182,0,0
688.267,-40.053371,1021.8634,0,0
668.15991,-40.375008,1021.6085,0,0
1305.9191,-24.869841,1223.7261,0,0
1293.3836,-25.27221,1223.4712,0,0
1280.6469,-25.674494,1223.2164,0,0
1267.7091,-26.076693,1222.9615,0,0
1254.5702,-26.478807,1222.7067,0,0
1241.2303,-26.880835,1222.4519,0,0
1227.6894,-27.282779,1222.197,0,0
1213.9475,-27.684637,1221.9422,0,0
1200.0047,-28.086409,1221.6873,0,0
1185.8611,-28.488097,1221.4325,0,0
1171.5167,-28.889699,1221.1777,0,0
1156.9714,-29.291215,1220.9228,0,0
1142.2255,-29.692646,1220.668,0,0
1127.2788,-30.093991,1220.4131,0,0
1112.1315,-30.495251,1220.1583,0,0
1096.7836,-30.896426,1219.9034,0,0
1081.2351,-31.297514,1219.6486,0,0
1065.4861,-31.698517,1219.3938,0,0
1049.5366,-32.099435,1219.1389,0,0
1033.3866,-32.500266,1218.8841,0,0
1017.0363,-32.901012,1218.6292,0,0
1000.4856,-33.301672,1218.3744,0,0
983.73466,-33.702246,1218.1196,0,0
966.78342,-34.102735,1217.8647,0,0
949.63194,-34.503137,1217.6099,0,0
932.28029,-34.903453,1217.355,0,0
914.72851,-35.303684,1217.1002,0,0
896.97662,-35.703828,1216.8453,0,0
879.02469,-36.103887,1216.5905,0,0
860.87275,-36.503859,1216.3357,0,0
842.52085,-36.903745,1216.0808,0,0
823.96902,-37.303545,1215.826,0,0
805.21732,-37.703259,1215.5711,0,0
764.28444,-38.376573,1214.9077,0,0.57545289
745.19304,-38.843709,1214.7031,0,0.56725507
747.76336,-38.901883,1214.8066,0,0
728.21258,-39.301252,1214.5518,0,0
708.46213,-39.700534,1214.2969,0,0
688.51206,-40.09973,1214.0421,0,0
647.23744,-39.886134,1212.8801,1,0.52661278
627.86146,-39.307737,1212.0296,1,0.51852952
420.64489,-32.299564,1201.9413,1,5.8080215
1072.0294,-29.125977,1190.9469,0,0
1057.3686,-29.517098,1190.6921,0,0
1042.5123,-29.908129,1190.4372,0,0
1027.4605,-30.29907,1190.1824,0,0
1012.2133,-30.689921,1189.9275,0,0
996.77063,-31.080683,1189.6727,0,0
981.13261,-31.471354,1189.4178,0,0
965.29929,-31.861935,1189.163,0,0
949.27069,-32.252426,1188.9082,0,0
933.04688,-32.642827,1188.6533,0,0
916.62788,-33.033138,1188.3985,0,0
900.01375,-33.423359,1188.1436,0,0
883.20454,-33.813489,1187.8888,0,0
866.20028,-34.203529,1187.634,0,0
849.00102,-34.593479,1187.3791,0,0
831.60681,-34.983338,1187.1243,0,0
814.0177,-35.373107,1186.8694,0,0
796.23372,-35.762786,1186.6146,0,0
778.25493,-36.152373,1186.3597,0,0
760.08136,-36.541871,1186.1049,0,0
741.71307,-36.931278,1185.8501,0,0
702.97631,-37.694958,1185.2941,0,0.5380345
684.421,-37.809474,1184.8814,0,0.52985419
685.4403,-38.098954,1185.0855,0,0
666.29356,-38.487999,1184.8307,0,0
646.95231,-38.876952,1184.5758,0,0
627.41662,-39.265815,1184.321,0,0
588.45529,-39.107713,1183.2575,1,0.48920954
569.50039,-38.496014,1182.4077,1,0.48113582
550.84887,-37.883451,1181.558,1,0.47306341
532.50123,-37.27003,1180.7084,1,0.4649924
514.45797,-36.655759,1179.8589,1,0.45692285
496.71961,-36.040647,1179.0094,1,0.44885485
479.28663,-35.4247,1178.1601,1,0.44078847
462.15956,-34.80793,1177.3109,1,0.43272382
1253.0898,-27.551838,1098.8892,0,0
1239.2249,-27.90778,1098.6343,0,0
1225.1821,-28.263617,1098.3795,0,0
1210.9613,-28.619348,1098.1246,0,0
1196.5628,-28.974973,1097.8698,0,0
1181.9864,-29.330493,1097.615,0,0
1167.2323,-29.685907,1097.3601,0,0
1152.3005,-30.041215,1097.1053,0,0
1137.1911,-30.396418,1096.8504,0,0
1121.9041,-30.751514,1096.5956,0,0
1106.4396,-31.106504,1096.3407,0,0
1090.7976,-31.461389,1096.0859,0,0
1074.9782,-31.816167,1095.8311,0,0
1058.9815,-32.170839,1095.5762,0,0
1042.8074,-32.525405,1095.3214,0,0
1026.4561,-32.879865,1095.0665,0,0
1009.9275,-33.234219,1094.8117,0,0
993.22187,-33.588466,1094.5568,0,0
976.33909,-33.942607,1094.302,0,0
959.27928,-34.296642,1094.0472,0,0
942.04247,-34.65057,1093.7923,0,0
924.62872,-35.004391,1093.5375,0,0
907.0381,-35.358106,1093.2826,0,0
889.27064,-35.711715,1093.0278,0,0
871.3264,-36.065216,1092.773,0,0
853.20544,-36.418611,1092.5181,0,0
834.9078,-36.7719,1092.2633,0,0
816.43356,-37.125081,1092.0084,0,0
797.78274,-37.478156,1091.7536,0,0
778.95542,-37.831124,1091.4987,0,0
759.95164,-38.183984,1091.2439,0,0
740.77145,-38.536738,1090.9891,0,0
721.41492,-38.889385,1090.7342,0,0
701.88208,-39.241925,1090.4794,0,0
682.17301,-39.594357,1090.2245,0,0
643.43062,-40.164392,1089.6662,0,0.47109146
642.22634,-40.2989,1089.7148,0,0
621.98886,-40.651011,1089.46,0,0
1353.7369,-25.238834,1281.5765,0,0
1341.0123,-25.659651,1281.3217,0,0
1328.0773,-26.08039,1281.0669,0,0
1314.9319,-26.501052,1280.812,0,0
1301.5763,-26.921636,1280.5572,0,0
1288.0103,-27.342142,1280.3023,0,0
1274.2341,-27.76257,1280.0475,0,0
1260.2478,-28.182921,1279.7926,0,0
1246.0512,-28.603193,1279.5378,0,0
1231.6446,-29.023388,1279.283,0,0
1217.0278,-29.443506,1279.0281,0,0
1202.2011,-29.863545,1278.7733,0,0
1187.1643,-30.283506,1278.5184,0,0
1171.9176,-30.703389,1278.2636,0,0
1156.4609,-31.123195,1278.0088,0,0
1140.7944,-31.542922,1277.7539,0,0
1124.918,-31.962571,1277.4991,0,0
1108.8319,-32.382143,1277.2442,0,0
1092.5359,-32.801636,1276.9894,0,0
1076.0302,-33.221051,1276.7345,0,0
1059.3149,-33.640388,1276.4797,0,0
1042.3899,-34.059646,1276.2249,0,0
1025.2552,-34.478827,1275.97,0,0
1007.911,-34.897929,1275.7152,0,0
990.35732,-35.316953,1275.4603,0,0
972.5941,-35.735898,1275.2055,0,0
954.62143,-36.154765,1274.9506,0,0
936.43935,-36.573554,1274.6958,0,0
918.04789,-36.992264,1274.441,0,0
899.4471,-37.410896,1274.1861,0,0
856.27325,-38.135571,1273.4537,0,0.64230205
837.2863,-38.585124,1273.2278,0,0.63409331
842.3891,-38.666321,1273.4216,0,0
822.95135,-39.084639,1273.1668,0,0
803.30447,-39.502878,1272.9119,0,0
783.44849,-39.921038,1272.6571,0,0
763.38344,-40.33912,1272.4022,0,0
719.74736,-39.828575,1270.9304,1,0.58531217
700.40699,-39.313516,1270.0801,1,0.57723533
681.32196,-38.797675,1269.23,1,0.56915951
662.49271,-38.281056,1268.3799,1,0.56108474
643.91967,-37.763662,1267.5299,1,0.55301107
625.60328,-37.245497,1266.6799,1,0.54493856
607.54398,-36.726566,1265.8301,1,0.53686724
1292.6573,-22.13311,1273.7366,0,0
1281.4862,-22.551525,1273.4817,0,0
1270.1058,-22.969861,1273.2269,0,0
1258.5163,-23.388119,1272.972,0,0
1246.7177,-23.806298,1272.7172,0,0
1234.7101,-24.224398,1272.4624,0,0
1222.4933,-24.64242,1272.2075,0,0
1210.0676,-25.060363,1271.9527,0,0
1197.433,-25.478227,1271.6978,0,0
1184.5894,-25.896013,1271.443,0,0
1171.537,-26.313719,1271.1882,0,0
1158.2757,-26.731347,1270.9333,0,0
1144.8057,-27.148896,1270.6785,0,0
1131.1268,-27.566366,1270.4236,0,0
1117.2393,-27.983757,1270.1688,0,0
1103.1431,-28.401069,1269.9139,0,0
1088.8383,-28.818302,1269.6591,0,0
1074.3248,-29.235456,1269.4043,0,0
1059.6028,-29.652531,1269.1494,0,0
1044.6723,-30.069527,1268.8946,0,0
1029.5333,-30.486443,1268.6397,0,0
1014.1859,-30.903281,1268.3849,0,0
998.63003,-31.320039,1268.13,0,0
982.86584,-31.736718,1267.8752,0,0
966.89332,-32.153318,1267.6204,0,0
950.71253,-32.569839,1267.3655,0,0
934.3235,-32.98628,1267.1107,0,0
917.72627,-33.402641,1266.8558,0,0
900.92087,-33.818924,1266.601,0,0
883.90735,-34.235127,1266.3462,0,0
866.68576,-34.65125,1266.0913,0,0
849.25612,-35.067294,1265.8365,0,0
831.61848,-35.483259,1265.5816,0,0
813.77287,-35.899144,1265.3268,0,0
773.6395,-36.588899,1264.6143,0,0.60656084
755.38643,-37.104692,1264.4326,0,0.598354
758.98868,-37.146321,1264.5623,0,0
740.31163,-37.561887,1264.3074,0,0
721.42681,-37.977374,1264.0526,0,0
702.33427,-38.392781,1263.7977,0,0
661.46408,-38.454064,1262.7326,1,0.55768069
642.7966,-37.930477,1261.8824,1,0.54960363
624.38866,-37.406102,1261.0323,1,0.54152762
606.24071,-36.880944,1260.1822,1,0.53345272
1062.6208,-23.658438,1309.4929,0,0
1050.6843,-24.087573,1309.2381,0,0
1038.5333,-24.516635,1308.9832,0,0
1026.1677,-24.945622,1308.7284,0,0
1013.5877,-25.374534,1308.4736,0,0
1000.7932,-25.803372,1308.2187,0,0
987.78432,-26.232136,1307.9639,0,0
974.56108,-26.660825,1307.709,0,0
961.12351,-27.08944,1307.4542,0,0
947.47165,-27.51798,1307.1993,0,0
933.60554,-27.946446,1306.9445,0,0
919.52522,-28.374837,1306.6897,0,0
905.23071,-28.803153,1306.4348,0,0
890.72207,-29.231395,1306.18,0,0
875.99933,-29.659562,1305.9251,0,0
861.06253,-30.087654,1305.6703,0,0
845.91169,-30.515672,1305.4154,0,0
830.54687,-30.943614,1305.1606,0,0
814.96809,-31.371482,1304.9058,0,0
799.1754,-31.799275,1304.6509,0,0
783.16883,-32.226994,1304.3961,0,0
766.94842,-32.654637,1304.1412,0,0
730.09393,-33.549752,1303.5362,0,0.6131931
713.56455,-33.727371,1303.1242,0,0.60503585
717.00452,-33.937118,1303.3767,0,0
699.92912,-34.364461,1303.1219,0,0
682.64007,-34.79173,1302.867,0,0
665.1374,-35.218923,1302.6122,0,0
647.42116,-35.646042,1302.3573,0,0
629.50059,-35.888759,1301.9802,1,0
592.36192,-35.030517,1300.2837,1,0.5480759
575.33889,-34.544368,1299.433,1,0.53999236
558.55654,-34.057459,1298.5823,1,0.5319097
542.0153,-33.569791,1297.7317,1,0.52382795
525.71557,-33.081368,1296.8812,1,0.51574717
509.65778,-32.592193,1296.0307,1,0.50766739
493.84234,-32.10227,1295.1803,1,0.49958868
478.26967,-31.611602,1294.33,1,0.49151107
462.94019,-31.120194,1293.4797,1,0.48343462
1047.2742,-26.776972,1000.9395,0,0
1033.8078,-27.088378,1000.6847,0,0
1020.1858,-27.399656,1000.4298,0,0
1006.4082,-27.710807,1000.175,0,0
992.47503,-28.021831,999.92015,0,0
978.38638,-28.332727,999.6653,0,0
964.14232,-28.643496,999.41046,0,0
949.74291,-28.954137,999.15562,0,0
935.18821,-29.264651,998.90078,0,0
920.47828,-29.575037,998.64594,0,0
905.61319,-29.885295,998.39109,0,0
890.593,-30.195425,998.13625,0,0
875.41779,-30.505428,997.88141,0,0
860.0876,-30.815302,997.62657,0,0
844.6025,-31.125049,997.37173,0,0
828.96257,-31.434667,997.11688,0,0
813.16786,-31.744157,996.86204,0,0
797.21843,-32.053519,996.6072,0,0
781.11436,-32.362753,996.35236,0,0
764.8557,-32.671858,996.09752,0,0
748.44252,-32.980835,995.84267,0,0
731.87489,-33.289683,995.58783,0,0
715.15286,-33.598403,995.33299,0,0
698.27651,-33.906995,995.07815,0,0
681.24589,-34.215457,994.82331,0,0
664.06107,-34.523791,994.56846,0,0
646.72212,-34.831996,994.31362,0,0
629.2291,-35.140072,994.05878,0,0
611.58207,-35.448019,993.80394,0,0
593.7811,-35.755837,993.5491,0,0
575.82625,-36.063526,993.29425,0,0
557.7176,-36.371086,993.03941,0,0
539.45519,-36.678517,992.78457,0,0
1347.9124,-25.165119,1195.7969,0,0
1335.2316,-25.557943,1195.542,0,0
1322.3544,-25.950678,1195.2872,0,0
1309.2809,-26.343324,1195.0323,0,0
1296.0111,-26.735881,1194.7775,0,0
1282.5451,-27.128348,1194.5227,0,0
1268.8828,-27.520727,1194.2678,0,0
1255.0243,-27.913015,1194.013,0,0
1240.9698,-28.305215,1193.7581,0,0
1226.7191,-28.697325,1193.5033,0,0
1212.2725,-29.089345,1193.2485,0,0
1197.6298,-29.481276,1192.9936,0,0
1182.7912,-29.873118,1192.7388,0,0
1167.7567,-30.26487,1192.4839,0,0
1152.5264,-30.656532,1192.2291,0,0
1137.1002,-31.048105,1191.9742,0,0
1121.4783,-31.439588,1191.7194,0,0
1105.6606,-31.830981,1191.4646,0,0
1089.6473,-32.222284,1191.2097,0,0
1073.4384,-32.613498,1190.9549,0,0
1057.0338,-33.004622,1190.7,0,0
1040.4337,-33.395656,1190.4452,0,0
1023.6382,-33.7866,1190.1904,0,0
1006.6472,-34.177454,1189.9355,0,0
989.46074,-34.568219,1189.6807,0,0
972.07895,-34.958893,1189.4258,0,0
954.50186,-35.349477,1189.171,0,0
936.72949,-35.739971,1188.9161,0,0
918.7619,-36.130374,1188.6613,0,0
900.59913,-36.520688,1188.4065,0,0
882.24123,-36.910912,1188.1516,0,0
863.68824,-37.301045,1187.8968,0,0
844.9402,-37.691088,1187.6419,0,0
825.99716,-38.08104,1187.3871,0,0
806.85918,-38.470902,1187.1322,0,0
787.52628,-38.860674,1186.8774,0,0
746.27869,-39.389525,1186.1641,0,0.55327528
748.27594,-39.639946,1186.3677,0,0
728.35859,-40.029446,1186.1129,0,0
708.24651,-40.418856,1185.858,0,0
687.93975,-40.808175,1185.6032,0,0
598.80442,-39.323458,1182.5569,1,1.696511
1482.1082,-27.092718,1188.0146,0,0
1468.4643,-27.482803,1187.7598,0,0
1454.6254,-27.872797,1187.505,0,0
1440.5915,-28.262701,1187.2501,0,0
1426.3627,-28.652515,1186.9953,0,0
1411.939,-29.042238,1186.7404,0,0
1397.3205,-29.43187,1186.4856,0,0
1382.5071,-29.821412,1186.2308,0,0
1367.4991,-30.210864,1185.9759,0,0
1352.2963,-30.600225,1185.7211,0,0
1336.8989,-30.989495,1185.4662,0,0
1321.3068,-31.378675,1185.2114,0,0
1305.5202,-31.767764,1184.9565,0,0
1289.5391,-32.156762,1184.7017,0,0
1273.3634,-32.54567,1184.4469,0,0
1256.9934,-32.934486,1184.192,0,0
1240.429,-33.323212,1183.9372,0,0
1223.6702,-33.711847,1183.6823,0,0
1206.7171,-34.100391,1183.4275,0,0
1189.5698,-34.488844,1183.1727,0,0
1172.2283,-34.877205,1182.9178,0,0
1154.6926,-35.265476,1182.663,0,0
1136.9629,-35.653656,1182.4081,0,0
1119.039,-36.041745,1182.1533,0,0
1100.9211,-36.429742,1181.8984,0,0
1082.6093,-36.817648,1181.6436,0,0
1064.1035,-37.205463,1181.3888,0,0
1045.4038,-37.593187,1181.1339,0,0
1026.5103,-37.980819,1180.8791,0,0
1007.423,-38.36836,1180.6242,0,0
988.14197,-38.755809,1180.3694,0,0
968.66723,-39.143168,1180.1145,0,0
948.99882,-39.530434,1179.8597,0,0
929.13681,-39.917609,1179.6049,0,0
909.08123,-40.304693,1179.35,0,0
888.83213,-40.691684,1179.0952,0,0
868.38956,-41.078585,1178.8403,0,0
823.83426,-41.665547,1178.1444,0,0.57620758
826.92418,-41.85211,1178.3307,0,0
805.90147,-42.238735,1178.0758,0,0
784.68546,-42.625268,1177.821,0,0
763.27621,-43.011709,1177.5661,0,0
741.67377,-43.398059,1177.3113,0,0
719.96993,-43.172526,1176.6895,0,0
1198.7732,-28.907808,1470.2,0,0
1184.2016,-29.378689,1469.9451,0,0
1169.3945,-29.849511,1469.6903,0,0
1154.3521,-30.320274,1469.4354,0,0
1139.0743,-30.790977,1469.1806,0,0
1123.5611,-31.261622,1468.9257,0,0
1107.8126,-31.732208,1468.6709,0,0
1063.6786,-32.954035,1467.929,0,0.86448598
1047.4527,-33.202564,1467.518,0,0.85639392
1031.0026,-33.44915,1467.1059,0,0.84816011
1014.0205,-34.21092,1467.0791,0,0.8399262
1025.5418,-34.08425,1467.3967,0,0
1008.3821,-34.55448,1467.1418,0,0
990.98729,-35.024652,1466.887,0,0
973.35743,-35.494765,1466.6322,0,0
955.49253,-35.964818,1466.3773,0,0
937.39262,-36.434812,1466.1225,0,0
890.34463,-36.511492,1464.6257,1,0.78286056
872.6242,-36.170325,1463.7756,1,0.77479546
855.0734,-35.828565,1462.9256,1,0.76673136
837.69258,-35.486211,1462.0756,1,0.75866828
820.48205,-35.143266,1461.2257,1,0.75060626
803.44215,-34.799732,1460.3758,1,0.74254534
786.57319,-34.45561,1459.526,1,0.73448556
769.87552,-34.110903,1458.6762,1,0.72642694
753.34947,-33.765612,1457.8265,1,0.71836954
736.99535,-33.419739,1456.9769,1,0.71031338
668.2584,-31.736148,1453.1853,1,2.324187
653.40412,-31.400163,1452.368,1,2.2975377
638.7108,-31.063623,1451.5507,1,2.2708931
624.17874,-30.72653,1450.7335,1,2.2442533
609.80825,-30.388886,1449.9164,1,2.2176184
595.59961,-30.050692,1449.0993,1,2.1909887
581.55313,-29.711952,1448.2822,1,2.1643644
567.6691,-29.372667,1447.4652,1,2.1377456
553.94782,-29.03284,1446.6483,1,2.1111326
540.38959,-28.692474,1445.8314,1,2.0845255
526.9947,-28.351571,1445.0146,1,2.0579247
513.76346,-28.010134,1444.1978,1,2.0313303
373.96386,-24.066193,1434.9239,1,6.8922655
487.79312,-27.325673,1442.5645,1,1.9781619
354.75599,-23.46388,1433.5146,1,6.7095228
462.48095,-26.639118,1440.9314,1,1.9250226
450.07243,-26.295065,1440.115,1,1.8984647
437.82935,-25.950501,1439.2987,1,1.8719149
425.75203,-25.60543,1438.4824,1,1.8453738
1053.4987,-20.213537,1201.9844,0,0
1043.2931,-20.608514,1201.7295,0,0
1032.8902,-21.003403,1201.4747,0,0
1022.2898,-21.398204,1201.2198,0,0
1011.492,-21.792916,1200.965,0,0
1000.4969,-22.18754,1200.7102,0,0
989.30444,-22.582076,1200.4553,0,0
977.91479,-22.976523,1200.2005,0,0
966.32794,-23.370882,1199.9456,0,0
954.54392,-23.765152,1199.6908,0,0
942.5628,-24.159333,1199.436,0,0
930.3846,-24.553426,1199.1811,0,0
918.00939,-24.947431,1198.9263,0,0
905.43719,-25.341347,1198.6714,0,0
892.66805,-25.735174,1198.4166,0,0
879.70203,-26.128912,1198.1617,0,0
866.53916,-26.522562,1197.9069,0,0
853.17948,-26.916123,1197.6521,0,0
839.62305,-27.309595,1197.3972,0,0
825.8699,-27.702978,1197.1424,0,0
811.92009,-28.096273,1196.8875,0,0
797.77364,-28.489478,1196.6327,0,0
783.43062,-28.882594,1196.3779,0,0
768.89106,-29.275621,1196.123,0,0
754.15502,-29.66856,1195.8682,0,0
739.22252,-30.061409,1195.6133,0,0
724.09362,-30.454169,1195.3585,0,0
708.76837,-30.84684,1195.1036,0,0
693.2468,-31.239421,1194.8488,0,0
677.52896,-31.631914,1194.594,0,0
661.6149,-32.024317,1194.3391,0,0
645.50466,-32.416631,1194.0843,0,0
629.19828,-32.808855,1193.8294,0,0
612.69582,-33.20099,1193.5746,0,0
579.35177,-33.911206,1193.0265,0,0.49341853
562.59416,-34.15313,1192.6886,0,0.48523442
562.01233,-34.376858,1192.8101,0,0
544.72595,-34.768635,1192.5552,0,0
1119.988,-23.996771,1257.9958,0,0
1107.8863,-24.410273,1257.741,0,0
1095.5778,-24.823695,1257.4862,0,0
1083.0626,-25.237036,1257.2313,0,0
1070.3408,-25.650296,1256.9765,0,0
1057.4123,-26.063476,1256.7216,0,0
1044.2773,-26.476575,1256.4668,0,0
1030.9357,-26.889593,1256.212,0,0
1017.3877,-27.302531,1255.9571,0,0
1003.6332,-27.715388,1255.7023,0,0
989.67234,-28.128164,1255.4474,0,0
975.50508,-28.540859,1255.1926,0,0
961.13149,-28.953473,1254.9377,0,0
946.55162,-29.366007,1254.6829,0,0
931.7655,-29.778459,1254.4281,0,0
916.77317,-30.190831,1254.1732,0,0
901.57468,-30.603121,1253.9184,0,0
886.17007,-31.01533,1253.6635,0,0
870.55937,-31.427459,1253.4087,0,0
854.74262,-31.839506,1253.1539,0,0
838.71987,-32.251472,1252.899,0,0
822.49116,-32.663357,1252.6442,0,0
806.05653,-33.075161,1252.3893,0,0
789.41602,-33.486883,1252.1345,0,0
772.56966,-33.898525,1251.8796,0,0
755.5175,-34.310085,1251.6248,0,0
738.25959,-34.721563,1251.37,0,0
700.70998,-35.368371,1250.6751,0,0.57062736
683.02339,-35.970593,1250.5505,0,0.56242152
685.25169,-35.955511,1250.6054,0,0
667.17115,-36.366663,1250.3506,0,0
648.88504,-36.777735,1250.0957,0,0
630.39342,-37.188725,1249.8409,0,0
592.39141,-36.847792,1248.5686,1,0.52178387
574.50017,-36.308864,1247.7182,1,0.51370296
556.87586,-35.769126,1246.8678,1,0.50562307
539.51894,-35.228581,1246.0175,1,0.49754423
522.42987,-34.687234,1245.1673,1,0.48946651
505.60908,-34.14509,1244.3171,1,0.48138995
1268.8536,-22.958582,1257.9032,0,0
1257.271,-23.372055,1257.6484,0,0
1245.4816,-23.785447,1257.3935,0,0
1233.4855,-24.198759,1257.1387,0,0
1221.2829,-24.61199,1256.8838,0,0
1208.8736,-25.02514,1256.629,0,0
1196.2577,-25.43821,1256.3741,0,0
1183.4354,-25.851199,1256.1193,0,0
1170.4065,-26.264107,1255.8645,0,0
1157.1713,-26.676935,1255.6096,0,0
1143.7296,-27.089681,1255.3548,0,0
1130.0816,-27.502347,1255.0999,0,0
1116.2273,-27.914932,1254.8451,0,0
1102.1667,-28.327436,1254.5903,0,0
1087.8999,-28.739859,1254.3354,0,0
1073.4268,-29.152201,1254.0806,0,0
1058.7477,-29.564462,1253.8257,0,0
1043.8624,-29.976642,1253.5709,0,0
1028.771,-30.388741,1253.316,0,0
1013.4737,-30.800759,1253.0612,0,0
997.9703,-31.212695,1252.8064,0,0
982.26098,-31.624551,1252.5515,0,0
966.34576,-32.036325,1252.2967,0,0
950.22467,-32.448018,1252.0418,0,0
933.89776,-32.85963,1251.787,0,0
917.36506,-33.27116,1251.5321,0,0
900.62661,-33.682609,1251.2773,0,0
883.68246,-34.093977,1251.0225,0,0
866.53265,-34.505263,1250.7676,0,0
849.17721,-34.916468,1250.5128,0,0
831.61619,-35.327591,1250.2579,0,0
813.84963,-35.738633,1250.0031,0,0
795.87758,-36.149593,1249.7483,0,0
756.0451,-36.816082,1249.0457,0,0.59105006
737.66498,-37.370701,1248.891,0,0.58284566
740.7288,-37.381984,1248.9837,0,0
721.93515,-37.792618,1248.7289,0,0
702.9362,-38.203169,1248.474,0,0
683.73199,-38.61364,1248.2192,0,0
643.34027,-38.498895,1247.0713,1,0.5421937
624.66603,-37.959103,1246.2213,1,0.53412002
626.05246,-37.727108,1246.1091,1,0
588.12123,-36.877145,1244.5216,1,0.5179763
1378.4268,-25.259245,1107.9451,0,0
1365.7072,-25.618907,1107.6902,0,0
1352.8079,-25.978465,1107.4354,0,0
1339.7288,-26.33792,1107.1805,0,0
1326.47,-26.69727,1106.9257,0,0
1313.0315,-27.056517,1106.6709,0,0
1299.4135,-27.415659,1106.416,0,0
1285.6159,-27.774698,1106.1612,0,0
1271.6388,-28.133632,1105.9063,0,0
1257.4823,-28.492462,1105.6515,0,0
1243.1463,-28.851188,1105.3966,0,0
1228.6311,-29.209809,1105.1418,0,0
1213.9365,-29.568326,1104.887,0,0
1199.0628,-29.926739,1104.6321,0,0
1184.0098,-30.285048,1104.3773,0,0
1168.7777,-30.643252,1104.1224,0,0
1153.3666,-31.001351,1103.8676,0,0
1137.7764,-31.359346,1103.6128,0,0
1122.0073,-31.717236,1103.3579,0,0
1106.0592,-32.075022,1103.1031,0,0
1089.9323,-32.432702,1102.8482,0,0
1073.6265,-32.790279,1102.5934,0,0
1057.142,-33.14775,1102.3385,0,0
1040.4788,-33.505116,1102.0837,0,0
1023.6369,-33.862378,1101.8289,0,0
1006.6164,-34.219534,1101.574,0,0
989.41738,-34.576586,1101.3192,0,0
972.03985,-34.933532,1101.0643,0,0
954.48387,-35.290374,1100.8095,0,0
936.74949,-35.64711,1100.5547,0,0
918.83678,-36.003741,1100.2998,0,0
879.77759,-36.758128,1099.7463,0,0.57371295
882.47653,-36.716687,1099.7901,0,0
864.0291,-37.073002,1099.5353,0,0
845.40354,-37.429212,1099.2804,0,0
826.59991,-37.785316,1099.0256,0,0
807.61824,-38.141315,1098.7708,0,0
788.45861,-38.497208,1098.5159,0,0
769.12105,-38.852996,1098.2611,0,0
749.60563,-39.208678,1098.0062,0,0
729.91239,-39.564254,1097.7514,0,0
1205.1833,-28.13476,1254.7377,0,0
1191.0128,-28.54723,1254.4828,0,0
1176.6361,-28.959619,1254.228,0,0
1162.0532,-29.371927,1253.9731,0,0
1147.2642,-29.784153,1253.7183,0,0
1132.2691,-30.196299,1253.4635,0,0
1117.0679,-30.608364,1253.2086,0,0
1101.6608,-31.020347,1252.9538,0,0
1086.0476,-31.43225,1252.6989,0,0
1070.2285,-31.844071,1252.4441,0,0
1054.2035,-32.255811,1252.1893,0,0
1037.9727,-32.66747,1251.9344,0,0
1021.5361,-33.079047,1251.6796,0,0
1004.8937,-33.490543,1251.4247,0,0
988.04556,-33.901958,1251.1699,0,0
970.99174,-34.313291,1250.915,0,0
953.73228,-34.724543,1250.6602,0,0
936.26721,-35.135713,1250.4054,0,0
918.59658,-35.546802,1250.1505,0,0
900.72042,-35.95781,1249.8957,0,0
882.63878,-36.368736,1249.6408,0,0
864.3517,-36.77958,1249.386,0,0
845.85922,-37.190342,1249.1311,0,0
804.20131,-37.914486,1248.4474,0,0.60875601
785.37303,-38.296689,1248.183,0,0.60055233
789.14976,-38.42214,1248.3666,0,0
769.83608,-38.832576,1248.1118,0,0
750.3172,-39.24293,1247.8569,0,0
656.13343,-38.952445,1245.2198,1,1.8799857
710.66401,-40.063392,1247.3473,0,0
668.86521,-39.299635,1245.7781,1,0.55178786
649.76873,-38.757528,1244.9276,1,0.54370494
630.94066,-38.214596,1244.0771,1,0.5356229
612.38145,-37.67084,1243.2266,1,0.5275418
594.09157,-37.126266,1242.3763,1,0.51946167
594.88916,-36.928154,1242.2708,1,0
558.32159,-36.034674,1240.6757,1,0.50330452
540.8424,-35.487665,1239.8256,1,0.49522761
523.63435,-34.939853,1238.9755,1,0.48715187
506.6979,-34.391243,1238.1255,1,0.47907737
1215.3229,-28.887167,1179.4288,0,0
1200.7825,-29.274187,1179.174,0,0
1186.0487,-29.661116,1178.9191,0,0
1171.1214,-30.047953,1178.6643,0,0
1156.0008,-30.434698,1178.4095,0,0
1140.6868,-30.821351,1178.1546,0,0
1125.1794,-31.207913,1177.8998,0,0
1109.4789,-31.594382,1177.6449,0,0
1093.5851,-31.98076,1177.3901,0,0
1077.4981,-32.367046,1177.1353,0,0
1061.218,-32.75324,1176.8804,0,0
1044.7449,-33.139342,1176.6256,0,0
1028.0787,-33.525352,1176.3707,0,0
1011.2195,-33.91127,1176.1159,0,0
994.16745,-34.297096,1175.861,0,0
976.92247,-34.682829,1175.6062,0,0
959.48464,-35.068471,1175.3514,0,0
941.85401,-35.45402,1175.0965,0,0
924.03063,-35.839477,1174.8417,0,0
906.01455,-36.224841,1174.5868,0,0
887.80581,-36.610114,1174.332,0,0
869.40445,-36.995293,1174.0772,0,0
850.81053,-37.380381,1173.8223,0,0
832.02409,-37.765376,1173.5675,0,0
813.04517,-38.150278,1173.3126,0,0
793.87382,-38.535088,1173.0578,0,0
774.5101,-38.919805,1172.8029,0,0
733.63182,-39.498645,1172.139,0,0.54182501
735.20568,-39.688962,1172.2933,0,0
715.26509,-40.073401,1172.0384,0,0
695.1323,-40.457747,1171.7836,0,0
674.80736,-40.842001,1171.5287,0,0
654.29031,-41.226162,1171.2739,0,0
613.68116,-40.473695,1169.864,1,0.49305716
594.082,-39.846553,1169.0146,1,0.48498893
574.79421,-39.218549,1168.1653,1,0.4769222
555.8183,-38.589691,1167.3161,1,0.46885704
537.15479,-37.959987,1166.467,1,0.46079355
1478.6475,-26.003441,1009.0826,0,0
1465.5669,-26.318879,1008.8277,0,0
1452.3286,-26.634191,1008.5729,0,0
1438.9327,-26.949379,1008.3181,0,0
1425.3792,-27.264441,1008.0632,0,0
1411.6683,-27.579377,1007.8084,0,0
1397.7999,-27.894189,1007.5535,0,0
1383.7741,-28.208874,1007.2987,0,0
1369.591,-28.523434,1007.0438,0,0
1355.2507,-28.837869,1006.789,0,0
1340.7532,-29.152178,1006.5342,0,0
1326.0985,-29.466361,1006.2793,0,0
1311.2868,-29.780418,1006.0245,0,0
1296.3182,-30.094349,1005.7696,0,0
1281.1925,-30.408154,1005.5148,0,0
1265.91,-30.721833,1005.26,0,0
1250.4707,-31.035387,1005.0051,0,0
1234.8747,-31.348814,1004.7503,0,0
1219.1219,-31.662114,1004.4954,0,0
1203.2126,-31.975289,1004.2406,0,0
1187.1466,-32.288337,1003.9857,0,0
1170.9242,-32.601259,1003.7309,0,0
1154.5454,-32.914054,1003.4761,0,0
1138.0102,-33.226723,1003.2212,0,0
1121.3187,-33.539265,1002.9664,0,0
1104.471,-33.85168,1002.7115,0,0
1087.467,-34.163969,1002.4567,0,0
1070.307,-34.476131,1002.2018,0,0
1052.9909,-34.788166,1001.947,0,0
1035.5189,-35.100074,1001.6922,0,0
0,0,0,0,0
1000.107,-35.723509,1001.1825,0,0
982.1674,-36.035036,1000.9276,0,0
964.07202,-36.346436,1000.6728,0,0
945.82098,-36.657709,1000.418,0,0
927.41434,-36.968854,1000.1631,0,0
908.85215,-37.279872,999.90827,0,0
890.13449,-37.590762,999.65343,0,0
871.26141,-37.901525,999.39858,0,0
852.23298,-38.21216,999.14374,0,0
833.04927,-38.522668,998.8889,0,0
1183.2462,-20.90288,1091.3392,0,0
1172.7066,-21.255674,1091.0844,0,0
1161.9906,-21.60836,1090.8295,0,0
1151.0982,-21.96094,1090.5747,0,0
1140.0296,-22.313413,1090.3199,0,0
1128.7848,-22.665778,1090.065,0,0
1117.3639,-23.018036,1089.8102,0,0
1105.7668,-23.370187,1089.5553,0,0
1093.9937,-23.72223,1089.3005,0,0
1082.0446,-24.074167,1089.0457,0,0
1069.9196,-24.425995,1088.7908,0,0
1057.6186,-24.777717,1088.536,0,0
1045.1419,-25.12933,1088.2811,0,0
1032.4893,-25.480836,1088.0263,0,0
1019.661,-25.832235,1087.7714,0,0
1006.6571,-26.183525,1087.5166,0,0
993.47754,-26.534709,1087.2618,0,0
980.12241,-26.885784,1087.0069,0,0
966.59177,-27.236751,1086.7521,0,0
952.88568,-27.587611,1086.4972,0,0
939.00418,-27.938362,1086.2424,0,0
924.94733,-28.289006,1085.9876,0,0
910.71519,-28.639541,1085.7327,0,0
896.30781,-28.989969,1085.4779,0,0
881.72524,-29.340288,1085.223,0,0
866.96754,-29.690499,1084.9682,0,0
852.03476,-30.040602,1084.7133,0,0
836.92695,-30.390597,1084.4585,0,0
821.64418,-30.740483,1084.2037,0,0
806.18649,-31.090261,1083.9488,0,0
790.55394,-31.43993,1083.694,0,0
774.74658,-31.789491,1083.4391,0,0
0,0,0,0,0
742.60765,-32.488287,1082.9294,0,0
726.27619,-32.837522,1082.6746,0,0
709.77015,-33.186648,1082.4198,0,0
693.08956,-33.535666,1082.1649,0,0
676.2345,-33.884575,1081.9101,0,0
659.20501,-34.233375,1081.6552,0,0
1459.621,-21.563751,1363.8475,0,0
1448.728,-22.008107,1363.5927,0,0
1437.6129,-22.452394,1363.3379,0,0
1426.2756,-22.896613,1363.083,0,0
1414.7163,-23.340763,1362.8282,0,0
1402.9349,-23.784845,1362.5733,0,0
1390.9314,-24.228858,1362.3185,0,0
1378.706,-24.672802,1362.0636,0,0
1366.2587,-25.116678,1361.8088,0,0
1353.5894,-25.560485,1361.554,0,0
1340.6982,-26.004223,1361.2991,0,0
1327.5851,-26.447892,1361.0443,0,0
1314.2503,-26.891493,1360.7894,0,0
1300.6937,-27.335025,1360.5346,0,0
1286.9153,-27.778488,1360.2797,0,0
1272.9152,-28.221882,1360.0249,0,0
1258.6934,-28.665207,1359.7701,0,0
1244.25,-29.108463,1359.5152,0,0
1229.585,-29.551651,1359.2604,0,0
1214.6984,-29.994769,1359.0055,0,0
1199.5902,-30.437819,1358.7507,0,0
1184.2605,-30.880799,1358.4959,0,0
1168.7094,-31.32371,1358.241,0,0
1152.9368,-31.766553,1357.9862,0,0
1136.9429,-32.209326,1357.7313,0,0
1120.7275,-32.65203,1357.4765,0,0
1104.2909,-33.094665,1357.2216,0,0
1087.6329,-33.53723,1356.9668,0,0
1070.7536,-33.979727,1356.712,0,0
1053.6532,-34.422154,1356.4571,0,0
1036.3315,-34.864512,1356.2023,0,0
1018.7887,-35.306801,1355.9474,0,0
1001.0247,-35.749021,1355.6926,0,0
956.40868,-36.606835,1354.904,0,0.73265684
938.29317,-36.828399,1354.5062,0,0.72442143
946.40641,-37.075263,1354.9281,0,0
927.75829,-37.517205,1354.6732,0,0
908.88922,-37.959078,1354.4184,0,0
889.79923,-38.400881,1354.1635,0,0
870.48835,-38.842614,1353.9087,0,0
850.95663,-39.284278,1353.6539,0,0
805.1519,-38.967452,1352.1297,1,0.66745113
786.27182,-38.532403,1351.2802,1,0.65939112
767.6082,-38.096687,1350.4309,1,0.65133242
749.16141,-37.660308,1349.5816,1,0.64327506
730.93183,-37.223269,1348.7323,1,0.63521911
660.72972,-35.282455,1345.2389,1,2.0756585
644.22755,-34.858516,1344.422,1,2.049011
627.92843,-34.433945,1343.6053,1,2.0223688
611.83271,-34.008746,1342.7885,1,1.995732
1094.2771,-29.442469,1318.1439,0,0
1079.448,-29.874111,1317.8891,0,0
1064.403,-30.305679,1317.6342,0,0
1049.1423,-30.737175,1317.3794,0,0
1033.6658,-31.168597,1317.1246,0,0
1017.9737,-31.599945,1316.8697,0,0
1002.0659,-32.03122,1316.6149,0,0
985.94249,-32.462422,1316.36,0,0
969.6035,-32.893549,1316.1052,0,0
953.04896,-33.324604,1315.8503,0,0
936.2789,-33.755585,1315.5955,0,0
919.29338,-34.186492,1315.3407,0,0
902.09243,-34.617325,1315.0858,0,0
884.67607,-35.048085,1314.831,0,0
843.39093,-35.896037,1314.1348,0,0.66343702
825.66836,-36.077735,1313.7222,0,0.65522659
831.13498,-36.339922,1314.0664,0,0
812.8574,-36.770387,1313.8116,0,0
794.36461,-37.200778,1313.5568,0,0
775.65663,-37.631095,1313.3019,0,0
756.73352,-38.061339,1313.0471,0,0
714.34864,-38.105384,1311.8761,1,0.60637056
695.82042,-37.630619,1311.0254,1,0.59828759
677.5273,-37.1551,1310.1748,1,0.59020542
659.46968,-36.67883,1309.3242,1,0.58212409
641.64798,-36.201811,1308.4737,1,0.57404363
624.06259,-35.724044,1307.6232,1,0.56596409
606.71394,-35.245534,1306.7728,1,0.5578855
589.60243,-34.766282,1305.9225,1,0.54980791
572.72847,-34.286292,1305.0722,1,0.54173136
556.09247,-33.805567,1304.2219,1,0.53365589
539.69486,-33.32411,1303.3718,1,0.52558156
523.53603,-32.841927,1302.5217,1,0.51750842
507.6164,-32.35902,1301.6717,1,0.50943653
491.93638,-31.875395,1300.8217,1,0.50136594
476.4964,-31.391055,1299.9718,1,0.49329672
461.29686,-30.906008,1299.1221,1,0.48522894
446.33818,-30.420258,1298.2724,1,0.47716268
431.62078,-29.933812,1297.4228,1,0.469098
1240.4548,-23.946035,1093.7306,0,0
1228.3934,-24.299831,1093.4757,0,0
1216.155,-24.65352,1093.2209,0,0
1203.7399,-25.007103,1092.9661,0,0
1191.1479,-25.360579,1092.7112,0,0
1178.3793,-25.713948,1092.4564,0,0
1165.434,-26.06721,1092.2015,0,0
1152.3121,-26.420366,1091.9467,0,0
1139.0137,-26.773415,1091.6919,0,0
1125.5387,-27.126357,1091.437,0,0
1111.8873,-27.479192,1091.1822,0,0
1098.0595,-27.831919,1090.9273,0,0
1084.0554,-28.18454,1090.6725,0,0
1069.875,-28.537054,1090.4176,0,0
1055.5184,-28.88946,1090.1628,0,0
1040.9856,-29.24176,1089.908,0,0
1026.2766,-29.593952,1089.6531,0,0
1011.3916,-29.946036,1089.3983,0,0
996.33062,-30.298014,1089.1434,0,0
981.09364,-30.649884,1088.8886,0,0
965.68075,-31.001646,1088.6338,0,0
950.09201,-31.353301,1088.3789,0,0
934.32747,-31.704848,1088.1241,0,0
918.38718,-32.056288,1087.8692,0,0
291.62357,-30.226405,1071.1892,1,17.060992
885.97958,-32.758845,1087.3595,0,0
869.51237,-33.109961,1087.1047,0,0
852.86964,-33.46097,1086.8499,0,0
836.05142,-33.811871,1086.595,0,0
819.05778,-34.162664,1086.3402,0,0
801.88878,-34.513349,1086.0853,0,0
784.54445,-34.863926,1085.8305,0,0
767.02487,-35.214395,1085.5756,0,0
749.33008,-35.564756,1085.3208,0,0
731.46013,-35.915008,1085.066,0,0
713.41509,-36.265153,1084.8111,0,0
695.195,-36.615189,1084.5563,0,0
676.79992,-36.965117,1084.3014,0,0
658.2299,-37.314936,1084.0466,0,0
1476.9738,-23.562349,1138.5856,0,0
1465.0996,-23.934159,1138.3307,0,0
1453.0396,-24.30587,1138.0759,0,0
1440.7938,-24.677483,1137.821,0,0
1428.3621,-25.048997,1137.5662,0,0
1415.7448,-25.420413,1137.3114,0,0
1402.9417,-25.79173,1137.0565,0,0
1389.9531,-26.162949,1136.8017,0,0
1376.7788,-26.53407,1136.5468,0,0
1363.419,-26.905091,1136.292,0,0
1349.8737,-27.276014,1136.0372,0,0
1336.143,-27.646838,1135.7823,0,0
1322.2269,-28.017564,1135.5275,0,0
1308.1255,-28.38819,1135.2726,0,0
1293.8387,-28.758718,1135.0178,0,0
1279.3668,-29.129147,1134.7629,0,0
1264.7096,-29.499477,1134.5081,0,0
1249.8673,-29.869707,1134.2533,0,0
1234.8399,-30.239839,1133.9984,0,0
1219.6275,-30.609872,1133.7436,0,0
1204.2301,-30.979806,1133.4887,0,0
1188.6477,-31.34964,1133.2339,0,0
1172.8804,-31.719375,1132.979,0,0
1156.9283,-32.089011,1132.7242,0,0
1140.7915,-32.458548,1132.4694,0,0
1124.4698,-32.827985,1132.2145,0,0
1107.9635,-33.197323,1131.9597,0,0
1091.2725,-33.566561,1131.7048,0,0
1074.3969,-33.9357,1131.45,0,0
1057.3368,-34.30474,1131.1952,0,0
1040.0922,-34.673679,1130.9403,0,0
1022.6632,-35.04252,1130.6855,0,0
1005.0497,-35.41126,1130.4306,0,0
987.25192,-35.779901,1130.1758,0,0
969.26983,-36.148442,1129.9209,0,0
951.10349,-36.516883,1129.6661,0,0
932.75296,-36.885225,1129.4113,0,0
914.21829,-37.253466,1129.1564,0,0
895.49951,-37.621608,1128.9016,0,0
876.59669,-37.989649,1128.6467,0,0
857.50988,-38.357591,1128.3919,0,0
838.23912,-38.725432,1128.137,0,0
818.78446,-39.093174,1127.8822,0,0
799.14596,-39.460815,1127.6274,0,0
1394.5557,-23.351324,1232.7314,0,0
1382.7787,-23.756679,1232.4766,0,0
1370.799,-24.16195,1232.2218,0,0
1358.6167,-24.567137,1231.9669,0,0
1346.2319,-24.97224,1231.7121,0,0
1333.6445,-25.377258,1231.4572,0,0
1320.8546,-25.782193,1231.2024,0,0
1307.8623,-26.187044,1230.9476,0,0
1294.6676,-26.591811,1230.6927,0,0
1281.2705,-26.996494,1230.4379,0,0
1267.6711,-27.401092,1230.183,0,0
1253.8694,-27.805607,1229.9282,0,0
1239.8655,-28.210037,1229.6733,0,0
1225.6594,-28.614383,1229.4185,0,0
1211.2512,-29.018644,1229.1637,0,0
1196.6408,-29.422821,1228.9088,0,0
1181.8284,-29.826914,1228.654,0,0
1166.8139,-30.230922,1228.3991,0,0
1151.5974,-30.634846,1228.1443,0,0
1136.1791,-31.038686,1227.8894,0,0
1120.5588,-31.442441,1227.6346,0,0
1104.7366,-31.846111,1227.3798,0,0
1088.7127,-32.249697,1227.1249,0,0
1072.4869,-32.653198,1226.8701,0,0
1056.0595,-33.056615,1226.6152,0,0
1039.4303,-33.459947,1226.3604,0,0
1022.5996,-33.863194,1226.1056,0,0
1005.5672,-34.266356,1225.8507,0,0
988.33322,-34.669434,1225.5959,0,0
970.89775,-35.072426,1225.341,0,0
953.26081,-35.475334,1225.0862,0,0
935.42243,-35.878157,1224.8313,0,0
917.38266,-36.280895,1224.5765,0,0
899.14155,-36.683548,1224.3217,0,0
880.69913,-37.086117,1224.0668,0,0
862.05545,-37.4886,1223.812,0,0
843.21054,-37.890998,1223.5571,0,0
801.31999,-38.698198,1222.9544,0,0.59371008
782.26123,-38.833879,1222.5418,0,0.58552712
785.46894,-39.097681,1222.7926,0,0
765.81958,-39.499738,1222.5378,0,0
745.96921,-39.90171,1222.2829,0,0
725.91788,-40.303597,1222.0281,0,0
705.66563,-40.705398,1221.7732,0,0
1275.5249,-23.572212,1211.8435,0,0
1263.6392,-23.970574,1211.5887,0,0
1251.5543,-24.36885,1211.3338,0,0
1239.2704,-24.767038,1211.079,0,0
1226.7873,-25.16514,1210.8241,0,0
1214.1052,-25.563154,1210.5693,0,0
1201.2242,-25.961082,1210.3145,0,0
1188.1442,-26.358923,1210.0596,0,0
1174.8653,-26.756676,1209.8048,0,0
1161.3875,-27.154343,1209.5499,0,0
1147.7109,-27.551923,1209.2951,0,0
1133.8356,-27.949415,1209.0402,0,0
1119.7615,-28.34682,1208.7854,0,0
1105.4888,-28.744138,1208.5306,0,0
1091.0174,-29.141369,1208.2757,0,0
1076.3474,-29.538513,1208.0209,0,0
1061.4789,-29.935569,1207.766,0,0
1046.4119,-30.332538,1207.5112,0,0
1031.1464,-30.729419,1207.2563,0,0
1015.6825,-31.126213,1207.0015,0,0
1000.0202,-31.52292,1206.7467,0,0
984.15958,-31.919539,1206.4918,0,0
968.10067,-32.31607,1206.237,0,0
951.84352,-32.712514,1205.9821,0,0
935.38817,-33.108871,1205.7273,0,0
918.73467,-33.505139,1205.4725,0,0
901.88305,-33.90132,1205.2176,0,0
884.83336,-34.297414,1204.9628,0,0
867.58565,-34.693419,1204.7079,0,0
850.13996,-35.089337,1204.4531,0,0
832.49633,-35.485167,1204.1982,0,0
814.65481,-35.880909,1203.9434,0,0
796.61543,-36.276563,1203.6886,0,0
778.37826,-36.672129,1203.4337,0,0
759.94332,-37.067607,1203.1789,0,0
720.54538,-37.72953,1202.5377,0,0.55288433
701.78118,-38.19473,1202.3339,0,0.54468869
703.45238,-38.253514,1202.4144,0,0
684.22684,-38.64864,1202.1595,0,0
664.80376,-39.043677,1201.9047,0,0
645.18318,-39.438627,1201.6498,0,0
605.61317,-39.020301,1200.3968,1,0.50406006
1422.6158,-22.194035,1072.5166,0,0
1411.4326,-22.538786,1072.2618,0,0
1400.0771,-22.883426,1072.0069,0,0
1388.5492,-23.227956,1071.7521,0,0
1376.8491,-23.572375,1071.4972,0,0
1364.9769,-23.916683,1071.2424,0,0
1352.9325,-24.260879,1070.9875,0,0
1340.716,-24.604965,1070.7327,0,0
1328.3275,-24.948939,1070.4779,0,0
1315.7671,-25.292803,1070.223,0,0
1303.0347,-25.636555,1069.9682,0,0
1290.1306,-25.980195,1069.7133,0,0
1277.0546,-26.323725,1069.4585,0,0
1263.8068,-26.667143,1069.2037,0,0
1250.3874,-27.010449,1068.9488,0,0
1236.7964,-27.353644,1068.694,0,0
1223.0338,-27.696728,1068.4391,0,0
1209.0997,-28.039699,1068.1843,0,0
1194.9941,-28.38256,1067.9294,0,0
1180.7172,-28.725308,1067.6746,0,0
1166.2688,-29.067945,1067.4198,0,0
1151.6492,-29.410469,1067.1649,0,0
1136.8584,-29.752882,1066.9101,0,0
1121.8964,-30.095183,1066.6552,0,0
1106.7632,-30.437372,1066.4004,0,0
1091.459,-30.779449,1066.1456,0,0
1075.9838,-31.121414,1065.8907,0,0
1060.3376,-31.463267,1065.6359,0,0
1044.5206,-31.805007,1065.381,0,0
1028.5326,-32.146635,1065.1262,0,0
1012.3739,-32.488151,1064.8713,0,0
996.04451,-32.829555,1064.6165,0,0
979.5444,-33.170846,1064.3617,0,0
962.87368,-33.512024,1064.1068,0,0
946.0324,-33.85309,1063.852,0,0
929.02061,-34.194044,1063.5971,0,0
911.83837,-34.534885,1063.3423,0,0
894.48574,-34.875613,1063.0874,0,0
876.96278,-35.216228,1062.8326,0,0
859.26953,-35.556731,1062.5778,0,0
841.40606,-35.897121,1062.3229,0,0
823.37243,-36.237398,1062.0681,0,0
805.16869,-36.577562,1061.8132,0,0
1197.1683,-22.242411,1143.6436,0,0
1185.9537,-22.616163,1143.3887,0,0
1174.5522,-22.989817,1143.1339,0,0
1162.9639,-23.363375,1142.879,0,0
1151.1888,-23.736834,1142.6242,0,0
1139.2271,-24.110196,1142.3693,0,0
1127.0787,-24.483461,1142.1145,0,0
1114.7436,-24.856627,1141.8597,0,0
1102.222,-25.229696,1141.6048,0,0
1089.5139,-25.602667,1141.35,0,0
1076.6194,-25.975541,1141.0951,0,0
1063.5384,-26.348316,1140.8403,0,0
1050.2711,-26.720994,1140.5855,0,0
1036.8174,-27.093573,1140.3306,0,0
1023.1775,-27.466055,1140.0758,0,0
1009.3514,-27.838439,1139.8209,0,0
995.33911,-28.210724,1139.5661,0,0
981.1407,-28.582912,1139.3112,0,0
966.75621,-28.955001,1139.0564,0,0
952.18571,-29.326992,1138.8016,0,0
937.42924,-29.698885,1138.5467,0,0
922.48684,-30.070679,1138.2919,0,0
907.35857,-30.442376,1138.037,0,0
892.04448,-30.813973,1137.7822,0,0
876.54462,-31.185473,1137.5273,0,0
860.85903,-31.556874,1137.2725,0,0
844.98776,-31.928176,1137.0177,0,0
828.93087,-32.29938,1136.7628,0,0
812.6884,-32.670485,1136.508,0,0
796.2604,-33.041492,1136.2531,0,0
779.64692,-33.412399,1135.9983,0,0
762.84802,-33.783208,1135.7435,0,0
745.86373,-34.153919,1135.4886,0,0
728.69411,-34.52453,1135.2338,0,0
711.33922,-34.895043,1134.9789,0,0
693.79909,-35.265457,1134.7241,0,0
676.07378,-35.635771,1134.4692,0,0
658.16333,-36.005987,1134.2144,0,0
640.06781,-36.376104,1133.9596,0,0
1030.6783,-25.76346,1442.7087,0,0
1017.6805,-26.227859,1442.4539,0,0
1004.4505,-26.692197,1442.1991,0,0
990.98833,-27.156474,1441.9442,0,0
977.29403,-27.620689,1441.6894,0,0
963.36765,-28.084843,1441.4345,0,0
949.2092,-28.548936,1441.1797,0,0
934.81872,-29.012967,1440.9248,0,0
920.19624,-29.476937,1440.67,0,0
905.34179,-29.940845,1440.4152,0,0
866.90019,-30.975875,1439.6727,0,0.76174546
851.60194,-31.212686,1439.2612,0,0.75358309
835.93618,-31.724883,1439.0518,0,0.74533667
843.60492,-31.795865,1439.3958,0,0
827.59108,-32.259467,1439.141,0,0
811.34546,-32.723006,1438.8861,0,0
794.86809,-33.186485,1438.6313,0,0
778.15899,-33.649901,1438.3764,0,0
761.22654,-33.946365,1437.9993,0,0
744.34622,-33.57481,1437.1328,0,0
727.65185,-33.202543,1436.2663,0,0
711.14379,-32.829561,1435.3999,0,0
694.82241,-32.455865,1434.5334,0,0
678.68805,-32.081452,1433.6669,0,0
662.74108,-31.706323,1432.8005,0,0
646.98185,-31.330477,1431.934,0,0
631.41072,-30.953912,1431.0676,0,0
616.02805,-30.576628,1430.2011,0,0
600.83421,-30.198624,1429.3346,0,0
585.82955,-29.819898,1428.4682,0,0
571.01443,-29.440451,1427.6017,0,0
556.38922,-29.060281,1426.7352,0,0
541.95427,-28.679388,1425.8688,0,0
527.70995,-28.29777,1425.0023,0,0
513.65662,-27.915427,1424.1359,0,0
499.79465,-27.532357,1423.2694,0,0
486.12439,-27.14856,1422.4029,0,0
472.64621,-26.764035,1421.5365,0,0
459.36047,-26.378782,1420.67,0,0
446.26755,-25.992798,1419.8035,0,0
433.3678,-25.606084,1418.9371,0,0
1071.8124,-23.002129,1150.5905,0,0
1060.2172,-23.378521,1150.3356,0,0
1048.4339,-23.754817,1150.0808,0,0
1036.4624,-24.131017,1149.8259,0,0
1024.3029,-24.50712,1149.5711,0,0
1011.9553,-24.883127,1149.3162,0,0
999.41976,-25.259038,1149.0614,0,0
986.69628,-25.634852,1148.8066,0,0
973.78493,-26.010569,1148.5517,0,0
960.68573,-26.38619,1148.2969,0,0
947.39875,-26.761714,1148.042,0,0
933.92403,-27.137142,1147.7872,0,0
920.26163,-27.512472,1147.5324,0,0
906.41158,-27.887706,1147.2775,0,0
892.37394,-28.262844,1147.0227,0,0
878.14875,-28.637884,1146.7678,0,0
863.73607,-29.012828,1146.513,0,0
849.13594,-29.387674,1146.2581,0,0
834.34841,-29.762424,1146.0033,0,0
819.37353,-30.137076,1145.7485,0,0
804.21135,-30.511632,1145.4936,0,0
788.86192,-30.88609,1145.2388,0,0
773.32528,-31.260451,1144.9839,0,0
757.60148,-31.634716,1144.7291,0,0
741.69058,-32.008882,1144.4742,0,0
725.59261,-32.382952,1144.2194,0,0
709.30764,-32.756924,1143.9646,0,0
692.83571,-33.130799,1143.7097,0,0
676.17686,-33.504576,1143.4549,0,0
659.33115,-33.878256,1143.2,0,0
642.29862,-34.251839,1142.9452,0,0
625.07932,-34.625324,1142.6904,0,0
607.67331,-34.998711,1142.4355,0,0
573.46457,-35.667732,1141.911,0,0.46798222
555.83543,-35.943727,1141.6074,0,0.45980549
554.33545,-36.118287,1141.671,0,0
1363.2831,-28.981789,1388.5885,0,0
1348.6795,-29.432678,1388.3337,0,0
1333.8504,-29.883501,1388.0788,0,0
1318.796,-30.334258,1387.824,0,0
1303.5162,-30.784948,1387.5691,0,0
1288.011,-31.235573,1387.3143,0,0
1272.2806,-31.686131,1387.0594,0,0
1256.3249,-32.136623,1386.8046,0,0
1240.144,-32.587049,1386.5498,0,0
1223.7379,-33.037408,1386.2949,0,0
1207.1066,-33.487702,1386.0401,0,0
1190.2502,-33.937929,1385.7852,0,0
1173.1687,-34.388089,1385.5304,0,0
1155.8621,-34.838183,1385.2756,0,0
1138.3305,-35.288211,1385.0207,0,0
1120.5739,-35.738172,1384.7659,0,0
1102.5923,-36.188067,1384.511,0,0
1055.2927,-37.123263,1383.6948,0,0.78990061
1036.9417,-37.336085,1383.2824,0,0.78167989
1018.0347,-38.170738,1383.3085,0,0.77346584
1028.4171,-37.986982,1383.4917,0,0
1009.3112,-38.436544,1383.2368,0,0
989.98059,-38.88604,1382.982,0,0
970.42521,-39.335469,1382.7271,0,0
950.64513,-39.784831,1382.4723,0,0
835.72087,-38.485246,1378.2505,1,2.3981681
881.98323,-39.647121,1380.415,1,0.7165283
862.70989,-39.235928,1379.5646,1,0.70845205
843.64048,-38.824057,1378.7142,1,0.70037663
824.77537,-38.411508,1377.8639,1,0.69230208
806.11494,-37.998283,1377.0136,1,0.68422842
787.65955,-37.584384,1376.1633,1,0.67615569
769.40957,-37.169812,1375.3132,1,0.66808392
751.36537,-36.75457,1374.463,1,0.66001315
733.52733,-36.33866,1373.613,1,0.6519434
715.89581,-35.922085,1372.763,1,0.64387473
698.47119,-35.504846,1371.913,1,0.63580717
681.25384,-35.086946,1371.0631,1,0.62774077
664.24414,-34.668388,1370.2133,1,0.61967556
647.44245,-34.249176,1369.3635,1,0.6116116
630.84915,-33.829312,1368.5139,1,0.60354894
614.46461,-33.4088,1367.6643,1,0.59548763
598.28922,-32.987644,1366.8147,1,0.58742773
582.32333,-32.565848,1365.9653,1,0.57936929
566.56734,-32.143415,1365.1159,1,0.57131237
551.02162,-31.720351,1364.2666,1,0.56325705
1429.741,-29.584141,1084.6564,0,0
1414.8614,-29.934111,1084.4015,0,0
1399.8069,-30.283973,1084.1467,0,0
1384.5774,-30.633727,1083.8918,0,0
1369.1732,-30.983372,1083.637,0,0
1353.5941,-31.332908,1083.3822,0,0
1337.8403,-31.682336,1083.1273,0,0
1321.9118,-32.031656,1082.8725,0,0
1305.8086,-32.380867,1082.6176,0,0
1289.5309,-32.729969,1082.3628,0,0
1273.0787,-33.078962,1082.108,0,0
1256.452,-33.427847,1081.8531,0,0
1239.6509,-33.776622,1081.5983,0,0
1222.6754,-34.125289,1081.3434,0,0
1205.5256,-34.473847,1081.0886,0,0
1188.2015,-34.822295,1080.8337,0,0
1170.7033,-35.170635,1080.5789,0,0
1153.0309,-35.518865,1080.3241,0,0
1135.1845,-35.866987,1080.0692,0,0
1117.164,-36.214999,1079.8144,0,0
1098.9695,-36.562902,1079.5595,0,0
1080.6011,-36.910695,1079.3047,0,0
1062.0588,-37.258379,1079.0498,0,0
1043.3427,-37.605954,1078.795,0,0
1024.4529,-37.953419,1078.5402,0,0
1005.3893,-38.300775,1078.2853,0,0
986.15211,-38.648021,1078.0305,0,0
966.74132,-38.995157,1077.7756,0,0
947.15698,-39.342184,1077.5208,0,0
927.39915,-39.689101,1077.266,0,0
907.46789,-40.035908,1077.0111,0,0
887.36326,-40.382605,1076.7563,0,0
867.08531,-40.729192,1076.5014,0,0
846.63409,-41.07567,1076.2466,0,0
826.00965,-41.422037,1075.9917,0,0
805.21207,-41.768295,1075.7369,0,0
784.24138,-42.114442,1075.4821,0,0
763.09764,-42.460479,1075.2272,0,0
720.69763,-43.092746,1074.6929,0,0.49105413
699.40876,-43.389383,1074.4185,0,0.48288218
1088.6851,-27.523453,1351.9875,0,0
1074.813,-27.964592,1351.7327,0,0
1060.7205,-28.405662,1351.4779,0,0
1046.4074,-28.846661,1351.223,0,0
1031.8738,-29.287591,1350.9682,0,0
1017.1198,-29.728451,1350.7133,0,0
1002.1454,-30.169242,1350.4585,0,0
986.95058,-30.609962,1350.2037,0,0
971.53544,-31.050613,1349.9488,0,0
955.89998,-31.491193,1349.694,0,0
940.04426,-31.931704,1349.4391,0,0
923.96829,-32.372145,1349.1843,0,0
907.67212,-32.812515,1348.9294,0,0
891.15579,-33.252816,1348.6746,0,0
874.41932,-33.693047,1348.4198,0,0
834.12477,-34.483069,1347.6461,0,0.68131717
816.9632,-34.860454,1347.3574,0,0.67309067
822.88947,-35.013318,1347.6552,0,0
805.27282,-35.453268,1347.4004,0,0
787.43621,-35.893148,1347.1456,0,0
769.37968,-36.332958,1346.8907,0,0
751.10326,-36.772697,1346.6359,0,0
709.54916,-36.758261,1345.375,1,0.62423554
691.71828,-36.316293,1344.5251,1,0.61616677
674.10689,-35.873639,1343.6752,1,0.60809915
656.71537,-35.430302,1342.8254,1,0.60003274
639.54411,-34.986284,1341.9756,1,0.59196759
622.5935,-34.541591,1341.126,1,0.58390375
605.86394,-34.096225,1340.2764,1,0.57584126
589.35581,-33.650191,1339.4269,1,0.5677802
573.0695,-33.203493,1338.5775,1,0.55972063
557.0054,-32.756136,1337.7282,1,0.5516626
541.16391,-32.308125,1336.8789,1,0.54360618
486.95351,-30.547734,1333.7721,1,1.7724567
472.68131,-30.113544,1332.9553,1,1.7458093
458.61703,-29.678729,1332.1385,1,1.7191681
444.76102,-29.243292,1331.3218,1,1.6925334
431.11362,-28.807238,1330.5052,1,1.6659054
417.6752,-28.370572,1329.6886,1,1.6392846
404.44609,-27.933301,1328.8721,1,1.6126713
1340.0107,-25.025595,1119.7207,0,0
1327.4068,-25.390004,1119.4659,0,0
1314.6208,-25.754312,1119.211,0,0
1301.6525,-26.118517,1118.9562,0,0
1288.5023,-26.482621,1118.7013,0,0
1275.1699,-26.846624,1118.4465,0,0
1261.6556,-27.210524,1118.1917,0,0
1247.9594,-27.574323,1117.9368,0,0
1234.0813,-27.938019,1117.682,0,0
1220.0214,-28.301614,1117.4271,0,0
1205.7797,-28.665106,1117.1723,0,0
1191.3563,-29.028497,1116.9174,0,0
1176.7513,-29.391785,1116.6626,0,0
1161.9646,-29.754971,1116.4078,0,0
1146.9963,-30.118055,1116.1529,0,0
1131.8465,-30.481036,1115.8981,0,0
1116.5153,-30.843916,1115.6432,0,0
1101.0026,-31.206692,1115.3884,0,0
1085.3086,-31.569367,1115.1335,0,0
1069.4333,-31.931939,1114.8787,0,0
1053.3767,-32.294408,1114.6239,0,0
1037.1389,-32.656775,1114.369,0,0
1020.7199,-33.019039,1114.1142,0,0
1004.1199,-33.381201,1113.8593,0,0
987.33875,-33.74326,1113.6045,0,0
970.37663,-34.105216,1113.3497,0,0
953.23355,-34.46707,1113.0948,0,0
935.90958,-34.82882,1112.84,0,0
918.40475,-35.190468,1112.5851,0,0
900.71913,-35.552012,1112.3303,0,0
882.85276,-35.913454,1112.0754,0,0
864.80569,-36.274793,1111.8206,0,0
846.57798,-36.636029,1111.5658,0,0
828.16968,-36.997161,1111.3109,0,0
809.58084,-37.35819,1111.0561,0,0
790.81151,-37.719116,1110.8012,0,0
771.86174,-38.079939,1110.5464,0,0
752.73158,-38.440659,1110.2915,0,0
733.4211,-38.801275,1110.0367,0,0
713.93033,-39.161788,1109.7819,0,0
694.25933,-39.522197,1109.527,0,0
1179.6737,-29.243307,1122.804,0,0
1164.9606,-29.608943,1122.5491,0,0
1150.0648,-29.974477,1122.2943,0,0
1134.9862,-30.339911,1122.0394,0,0
1119.7249,-30.705243,1121.7846,0,0
1104.281,-31.070474,1121.5297,0,0
1088.6544,-31.435604,1121.2749,0,0
1072.8454,-31.800632,1121.0201,0,0
1056.8538,-32.165559,1120.7652,0,0
1040.6798,-32.530385,1120.5104,0,0
1024.3234,-32.895109,1120.2555,0,0
1007.7847,-33.259731,1120.0007,0,0
991.06373,-33.624252,1119.7459,0,0
974.1605,-33.988671,1119.491,0,0
957.07508,-34.352989,1119.2362,0,0
939.80752,-34.717205,1118.9813,0,0
922.35789,-35.081319,1118.7265,0,0
904.72622,-35.445331,1118.4716,0,0
886.91257,-35.809242,1118.2168,0,0
868.917,-36.17305,1117.962,0,0
850.73954,-36.536757,1117.7071,0,0
832.38026,-36.900362,1117.4523,0,0
813.8392,-37.263864,1117.1974,0,0
795.11641,-37.627265,1116.9426,0,0
776.21195,-37.990563,1116.6877,0,0
757.12586,-38.353759,1116.4329,0,0
737.85821,-38.716853,1116.1781,0,0
718.40903,-39.079845,1115.9232,0,0
698.77838,-39.442734,1115.6684,0,0
659.55659,-39.901928,1115.0187,0,0.48771132
658.97288,-40.168206,1115.1587,0,0
638.79812,-40.530788,1114.9039,0,0
555.39318,-40.667584,1113.109,1,1.5333034
597.90487,-41.255644,1114.3942,0,0
577.28342,-40.971573,1113.7724,0,0
556.97657,-40.255635,1112.9059,0,0
1246.5382,-22.324587,1354.652,0,0
1235.2654,-22.766454,1354.3971,0,0
1223.7718,-23.208251,1354.1423,0,0
1212.0572,-23.649979,1353.8875,0,0
1200.1218,-24.091637,1353.6326,0,0
1187.9656,-24.533226,1353.3778,0,0
1175.5886,-24.974745,1353.1229,0,0
1162.9908,-25.416195,1352.8681,0,0
1150.1724,-25.857575,1352.6132,0,0
1137.1333,-26.298885,1352.3584,0,0
1123.8735,-26.740126,1352.1036,0,0
1110.3932,-27.181297,1351.8487,0,0
1096.6922,-27.622398,1351.5939,0,0
1082.7708,-28.06343,1351.339,0,0
1068.6288,-28.504391,1351.0842,0,0
1054.2664,-28.945283,1350.8293,0,0
1039.6836,-29.386105,1350.5745,0,0
1024.8803,-29.826858,1350.3197,0,0
1009.8567,-30.26754,1350.0648,0,0
994.61278,-30.708152,1349.81,0,0
979.14857,-31.148695,1349.5551,0,0
963.4641,-31.589167,1349.3003,0,0
947.55941,-32.02957,1349.0455,0,0
931.43454,-32.469903,1348.7906,0,0
915.08952,-32.910165,1348.5358,0,0
898.52439,-33.350358,1348.2809,0,0
881.73917,-33.79048,1348.0261,0,0
841.229,-34.602655,1347.2649,0,0.68394327
824.05179,-34.910015,1346.9283,0,0.67571512
830.06342,-35.110426,1347.2616,0,0
812.39824,-35.550268,1347.0067,0,0
794.51316,-35.990039,1346.7519,0,0
776.40821,-36.429741,1346.497,0,0
758.08343,-36.869371,1346.2422,0,0
663.83701,-35.467786,1342.4203,1,2.0746419
647.25735,-35.041609,1341.6036,1,2.0480081
630.88194,-34.614804,1340.787,1,2.02138
614.71112,-34.187376,1339.9704,1,1.9947577
598.74524,-33.759327,1339.154,1,1.9681416
582.98464,-33.330661,1338.3375,1,1.9415317
567.42968,-32.901383,1337.5212,1,1.9149285
552.08071,-32.471497,1336.7049,1,1.8883321
536.93806,-32.041007,1335.8887,1,1.8617429
581.66513,-33.028401,1338.0669,0,0
565.26587,-32.5685,1337.2004,0,0
