107.36655,6.3050443,78.134181,-15.494359,-0.77701866,-11.273199,1276.6143
131.37135,-2.4794471,78.188635,-17.742244,0.36617707,-10.842006,1286.9458
82.252536,-7.5042453,78.208411,-11.001669,0.8285655,-12.393269,1255.2345
123.78942,11.222714,78.332077,-18.435887,-1.5575986,-11.791206,1199.5725
111.00182,4.7887217,78.346432,-16.647696,-0.71982406,-11.700093,1228.3307
87.682953,9.8159988,78.386936,-13.233978,-1.3169181,-11.715504,1269.2869
89.915051,-4.8805176,78.398545,-12.452517,0.4959334,-12.19518,1248.1664
142.29418,-14.454834,78.434338,-19.001339,2.1551899,-11.848828,1205.4184
124.09382,-7.6824727,78.448753,-17.433304,0.84638871,-11.279654,1256.8193
75.554767,0.73797387,78.470713,-12.995937,0.3118134,-13.66843,1189.7145
117.41094,1.797994,78.473592,-16.675315,-0.27305789,-11.159253,1272.6983
153.7824,-6.2349717,78.588797,-20.440359,0.91055854,-11.225022,1230.504
93.391623,5.2826417,78.75695,-14.247025,-0.81248088,-11.888877,1245.086
99.470414,-5.6152827,78.840755,-14.658802,0.7329207,-12.151262,1229.2049
101.60445,2.7199588,78.944413,-15.747297,-0.50997499,-12.125712,1205.4441
93.986144,-1.7100162,79.06411,-14.027082,0.14743686,-11.635181,1272.0284
111.19905,20.30068,79.108452,-15.719199,-2.5166472,-11.168574,1287.7899
79.301961,3.7108015,79.115322,-13.307431,-0.3169967,-12.91659,1213.5219
94.147261,-5.4048581,79.156165,-13.152646,0.65542595,-12.019175,1266.1197
103.25366,-1.6747399,79.223026,-15.321783,0.0030558081,-11.964564,1225.8347
151.18114,6.7470926,79.253506,-20.784325,-0.89137161,-11.159476,1224.4177
96.964408,-2.4248279,79.396044,-13.983404,0.10370929,-12.122341,1239.1737
80.927688,-10.205632,79.506924,-12.080771,1.0565883,-12.884119,1208.3157
89.020403,2.4705494,79.508934,-13.288757,-0.37182256,-11.683663,1280.6089
84.723168,1.5375525,79.51838,-13.801996,-0.25018578,-12.744957,1208.2454
105.0582,-10.614967,79.547121,-15.508919,1.3209317,-12.381037,1202.0901
69.000555,12.741429,79.558697,-11.924852,-0.72071107,-14.197584,1205.0023
91.046478,15.921307,79.575452,-14.553753,-2.0827893,-13.173962,1193.0525
143.64884,-8.6107371,79.663287,-18.987977,1.0456418,-11.24567,1257.0929
82.321403,2.103947,79.940682,-12.484003,-0.27685581,-11.933868,1272.9575
95.559908,8.2465829,79.949232,-14.576427,-1.2857347,-12.031897,1233.7038
103.59004,-12.336153,79.98339,-15.773796,1.6279923,-12.510538,1190.6231
136.00657,-8.0610346,80.086038,-17.666117,1.0620443,-11.372759,1274.3837
78.072501,-6.843916,80.096855,-11.972304,0.73528237,-12.877564,1209.4035
89.564222,-0.11311809,80.193499,-13.63736,-0.10217133,-12.362201,1225.5148
99.067328,-7.3176103,80.322282,-14.208403,0.89234972,-11.98518,1260.2474
146.67558,-6.175667,80.325337,-20.089593,0.95495025,-11.629105,1213.4195
87.492574,-0.99123388,80.446555,-13.071208,0.060045854,-11.887102,1274.4343
55.060709,-4.3657457,80.538394,-12.234907,3.2216855,-14.67765,1196.0148
148.22323,-7.1756701,80.843435,-17.960009,1.3504082,-11.956353,1252.0311
140.279,6.3660479,80.844652,-19.842701,-0.73094644,-11.851591,1195.6694
58.951764,-5.7717205,80.86673,-11.74437,1.7093964,-13.410036,1211.3632
124.96192,-8.7271307,80.912729,-16.266967,1.4038154,-12.094596,1249.7647
127.22946,0.96257142,80.945718,-17.464059,-0.13182644,-11.215847,1276.5674
72.48026,4.2259344,81.022852,-11.070313,-0.63106295,-12.259495,1269.5012
68.728069,-2.3626244,81.035078,-10.457251,0.090956107,-12.801765,1236.4787
132.55915,-9.2201575,81.04285,-14.270923,1.3703461,-12.436712,1274.2991
167.12702,11.247298,81.097708,-22.041255,-1.2493465,-11.1634,1222.5707
142.47675,-5.8271446,81.154185,-19.525858,0.72248307,-11.670305,1221.0335
154.66655,-8.1547147,81.327917,-18.750461,1.4244724,-11.83528,1252.3774
98.068954,-6.1455002,81.381298,-13.070458,0.70898733,-12.457603,1248.6298
146.69511,-2.3011975,81.397859,-20.081912,0.27012204,-11.679569,1213.0415
162.8725,-9.8256089,81.405285,-21.247776,1.4176227,-11.512876,1219.5081
111.38938,-2.8549732,81.459197,-16.203261,0.42369523,-12.305561,1208.1438
100.19305,14.715773,81.466061,-15.172422,-2.117768,-12.260149,1226.4251
57.860599,16.446641,81.542846,-9.382008,5.7813846,-16.542817,1230.1483
128.67063,13.890871,81.647866,-17.56885,-1.5799069,-11.268055,1275.5266
123.73492,-2.574191,81.694923,-17.385814,0.27435874,-11.952578,1228.6867
107.78383,1.6768248,81.792052,-15.325887,-0.1892689,-11.681216,1273.1307
95.818764,10.006147,81.838621,-14.157892,-1.3150235,-11.995921,1259.8466
110.10276,-3.4520587,81.889877,-16.38304,0.45540652,-12.444191,1196.1279
61.133644,-16.328561,81.937261,-9.9791468,2.2467031,-12.549224,1260.3578
102.8736,10.900568,81.941922,-15.877447,-1.1434983,-12.910628,1207.6842
115.8593,0.49062863,81.968171,-16.620831,-0.1706894,-11.766249,1249.4537
98.063549,-5.8075739,82.178069,-14.593254,0.75099792,-12.529305,1222.4844
151.23425,-5.0936912,82.240819,-20.307126,0.4767676,-11.549948,1226.3334
61.239505,5.5591752,82.293336,-9.7505221,-0.94652534,-12.779846,1250.9892
94.641385,-1.3962717,82.331827,-13.530392,-0.061123164,-12.413409,1244.3288
71.178714,0.80297936,82.390372,-10.91991,-0.13847265,-12.337203,1275.6583
71.539818,-7.8149308,82.487295,-11.681341,1.0974132,-13.127992,1218.5082
159.31707,-7.1859418,82.535062,-20.653267,1.0966672,-11.588922,1230.4611
104.10303,-12.64244,82.634775,-15.33681,1.5544609,-12.755092,1206.5052
129.59766,-3.1137347,82.693929,-17.990526,0.23799652,-11.56059,1253.3847
147.96134,-8.589807,82.711475,-15.94625,1.3967042,-12.226804,1284.2016
107.86381,2.9799686,82.772168,-15.766605,-0.47607641,-12.00776,1246.1654
103.82926,-9.7668684,82.795123,-11.761567,1.1158002,-12.754304,1267.7675
69.952102,-10.944715,82.850404,-12.373273,1.7191537,-13.286504,1203.2918
127.79367,-0.62906141,82.959646,-17.788267,0.21676401,-11.999767,1229.7078
97.706398,8.5698925,82.969453,-14.19741,-1.1813349,-11.947335,1272.2522
121.89102,-14.230456,83.045759,-17.180014,1.8087071,-12.266664,1220.6724
121.71621,2.1433897,83.051443,-17.028091,-0.23096568,-11.840072,1248.4902
86.086608,-6.4772833,83.387872,-13.28291,0.65999307,-12.944302,1192.541
121.03996,-4.9263897,83.412,-16.832844,0.53391102,-12.124811,1236.4754
136.92955,20.417535,83.461237,-19.392366,-2.5158867,-12.142223,1207.9914
118.63134,0.42474473,83.501018,-17.130235,-0.13268633,-12.461224,1204.9909
147.79406,1.1811208,83.507176,-19.242666,-0.10095203,-11.055283,1283.6477
116.78056,4.2338727,83.58669,-16.494041,-0.49261598,-11.814327,1258.3563
117.99499,-3.8141175,83.645677,-16.183526,0.47743647,-11.852054,1267.4581
140.38355,-2.6675958,83.705162,-18.306166,0.38666485,-11.224148,1287.8123
65.434531,-13.635117,83.7139,-10.746356,1.8755917,-12.642185,1256.6782
163.37342,-7.3555067,83.866012,-20.565748,1.2512346,-11.782757,1234.2519
163.66387,-0.83644378,83.866686,-21.522413,0.4322388,-11.719792,1214.885
115.24933,6.6963138,83.87191,-16.036524,-0.78788392,-11.677696,1277.4808
152.00782,-4.6069388,83.909037,-20.238002,0.73210494,-11.838202,1221.7515
107.08781,-7.7848403,83.956148,-15.923704,1.0628036,-12.723408,1204.746
93.365108,-12.082561,84.11365,-14.336638,1.6020962,-12.661866,1226.0533
125.8913,1.9369952,84.152045,-17.245885,-0.28295845,-11.554539,1273.5648
132.95498,-8.1076403,84.191801,-18.010863,0.85410562,-11.692612,1257.6858
182.16193,-6.4220297,84.244985,-17.431535,1.7700128,-12.675786,1289.1927
119.47714,5.1544535,84.304588,-17.253387,-0.74326552,-12.132466,1229.1972
164.15784,-6.6985432,84.307375,-21.060762,0.9438154,-11.649451,1231.3705
133.17207,12.013147,84.336385,-19.094647,-1.6044603,-12.225985,1200.4389
94.424555,10.481092,84.353073,-13.732259,-1.343245,-12.148944,1270.1533
151.92207,-15.553265,84.481933,-19.50803,2.2388103,-12.342048,1206.2849
87.836014,-7.9168881,84.535479,-11.330574,0.82194477,-12.915136,1256.101
96.246395,-5.1259363,84.621782,-12.871806,0.48599603,-12.697699,1249.0328
119.19359,21.571857,84.790547,-16.258778,-2.5677309,-11.559733,1288.6563
100.65068,5.6958667,84.812598,-14.788921,-0.84045716,-12.333587,1245.9524
161.74309,7.1993672,84.933215,-21.463169,-0.91786973,-11.559365,1225.2842
101.1306,-1.7824192,84.986186,-14.550808,0.14207379,-12.052955,1272.8949
106.92491,-5.9853991,85.037963,-15.157852,0.74768676,-12.637859,1230.0714
109.62998,2.980452,85.124158,-16.354565,-0.53196739,-12.593067,1206.3105
100.82636,-5.7342183,85.284008,-13.562549,0.66195888,-12.492391,1266.9861
111.05749,-1.6704158,85.321542,-15.893116,-0.020205671,-12.429275,1226.7011
153.28367,-9.1402675,85.390891,-19.5506,1.0724593,-11.664954,1257.9594
82.172199,0.58988444,85.408527,-13.474699,0.28036215,-14.085137,1190.581
95.789246,2.6597667,85.455549,-13.786663,-0.38506241,-12.102643,1281.4753
104.0775,-2.4707522,85.579783,-14.467505,0.080076953,-12.612913,1240.0401
86.080743,3.8754584,85.683317,-13.808299,-0.34240294,-13.356285,1214.3884
112.94721,-11.280142,85.862434,-16.046474,1.3398185,-12.880137,1202.9565
144.95987,-8.601622,85.881275,-18.145675,1.1004523,-11.808609,1275.2501
91.756741,1.6666485,86.007346,-14.332388,-0.26677114,-13.211317,1209.1119
88.683962,2.243144,86.016309,-12.966333,-0.27979441,-12.368458,1273.8239
102.9883,8.900413,86.078866,-15.136811,-1.3295964,-12.486371,1234.5703
87.072978,-10.731826,86.086301,-12.499274,1.048323,-13.433273,1209.1822
156.87743,-6.6634416,86.250451,-20.716852,0.9963112,-12.07166,1214.286
98.452084,16.986203,86.266527,-15.069693,-2.1774408,-13.59285,1193.919
111.62008,-13.159154,86.362476,-16.345783,1.6639733,-13.005806,1191.4896
106.28848,-7.7668051,86.429362,-14.675124,0.90425584,-12.443396,1261.1139
96.512588,-0.058803716,86.497402,-14.155145,-0.11492662,-12.853437,1226.3812
94.150588,-1.0195134,86.497522,-13.560857,0.052975474,-12.316625,1275.3007
136.10479,1.029012,86.651118,-18.03699,-0.13386939,-11.605765,1277.4339
84.170049,-7.211517,86.670863,-12.416702,0.7353892,-13.418456,1210.27
75.063157,13.149859,86.730825,-12.327479,-0.90801351,-14.497209,1205.8688
178.32067,11.877369,86.779504,-22.73289,-1.2706339,-11.563759,1223.4372
150.36637,6.7342854,86.883234,-20.506213,-0.74175989,-12.302742,1196.5358
157.29554,-7.8713436,86.948195,-18.326169,1.4328786,-12.463398,1252.8976
133.19156,-9.4462988,87.086157,-16.648283,1.4733366,-12.600061,1250.6312
152.39443,-6.1924215,87.099014,-20.144214,0.73860374,-12.109176,1221.9
78.126688,4.5453416,87.266432,-11.515531,-0.64638141,-12.714589,1270.3677
173.6524,-10.547117,87.270127,-21.87094,1.4683436,-11.946737,1220.3745
156.89633,-2.4366938,87.347255,-20.722423,0.27186132,-12.118115,1213.908
164.1463,-8.8867002,87.367155,-19.166349,1.5038541,-12.322174,1253.2439
137.599,14.68561,87.379269,-18.14442,-1.5987213,-11.657514,1276.3931
139.73886,-9.9184694,87.395979,-14.444503,1.4230928,-12.976424,1275.1655
74.058163,-2.4025505,87.567711,-10.861478,0.068534801,-13.329059,1237.3452
64.943282,-6.6286603,87.680982,-12.220823,1.7180121,-13.848968,1212.2297
107.91966,15.792802,87.708963,-15.733927,-2.1907715,-12.711385,1227.2915
119.63241,-3.0695606,87.733514,-16.768003,0.43507632,-12.79166,1209.0103
115.57854,1.771129,87.736669,-15.852607,-0.18778774,-12.097265,1273.9971
104.70075,-6.5006369,87.737758,-13.455084,0.71180076,-12.968373,1249.4963
132.57018,-2.7114038,87.785168,-17.95435,0.27458078,-12.408577,1229.5531
61.287409,-5.9065839,87.938699,-12.67237,2.9574776,-14.935848,1196.8812
103.02741,10.670468,87.945684,-14.676457,-1.3420895,-12.432223,1260.7131
124.31446,0.57938247,87.956555,-17.199563,-0.18442796,-12.187239,1250.3201
161.54682,-5.331205,88.121509,-20.94271,0.4731087,-11.97287,1227.1999
118.44287,-3.6822521,88.233826,-16.976845,0.46567959,-12.931487,1196.9944
66.235387,-17.463846,88.326473,-10.428733,2.2940017,-13.007203,1261.2242
169.79445,-7.7458375,88.437647,-21.25536,1.1430481,-12.021664,1231.3276
110.95051,11.481889,88.502517,-16.430672,-1.182374,-13.332882,1208.5506
105.48893,-6.1873149,88.564304,-15.107243,0.76804705,-13.015816,1223.3509
138.74353,-3.2307225,88.575296,-18.592771,0.22977033,-11.964809,1254.2512
101.5208,-1.3583938,88.662587,-13.985275,-0.090544809,-12.910227,1245.1953
76.748455,0.87348615,88.670717,-11.359413,-0.14352252,-12.783923,1276.5248
66.219581,6.042739,88.805239,-10.169716,-0.98797551,-13.267618,1251.8556
115.88864,3.2227768,88.883826,-16.332454,-0.49524515,-12.438783,1247.0319
155.99912,-9.3067381,88.949132,-16.204144,1.4712992,-12.723572,1285.0681
104.93167,9.1696627,89.049346,-14.7035,-1.2178298,-12.372159,1273.1186
136.83214,-0.74183811,89.071842,-18.36476,0.23460474,-12.449191,1230.5743
130.37262,2.2588399,89.078527,-17.597088,-0.23066127,-12.268287,1249.3567
157.5661,1.2302996,89.126489,-19.845392,-0.095609738,-11.421909,1284.5142
111.89652,-13.427613,89.139454,-15.835574,1.5861559,-13.264041,1207.3717
77.49263,-8.3693895,89.17709,-12.129065,1.1200842,-13.631525,1219.3746
130.6161,-15.146295,89.297439,-17.718863,1.8545501,-12.740477,1221.5389
109.76744,-10.325294,89.30451,-11.989547,1.1177037,-13.28307,1268.6339
149.67714,-2.8663729,89.412834,-18.867848,0.40868664,-11.606575,1288.6788
62.851103,14.321334,89.559069,-10.498946,3.1152936,-15.709491,1231.0147
129.59207,-5.194196,89.58883,-17.374666,0.5373151,-12.582699,1237.3418
125.16966,4.4812207,89.597513,-17.062176,-0.49660672,-12.228865,1259.2227
76.27009,-11.815371,89.614094,-12.898155,1.7627938,-13.76891,1204.1583
146.79188,21.691739,89.633076,-20.057424,-2.5810596,-12.545132,1208.8579
126.21435,-4.0561142,89.679454,-16.692998,0.49060876,-12.283293,1268.3246
85.231221,10.975792,89.719132,-13.982574,5.2558141,-17.662651,1201.9315
123.40282,7.0927376,89.811857,-16.5772,-0.79762723,-12.082059,1278.3472
174.59074,-1.0630367,89.833273,-22.184284,0.47459751,-12.146809,1215.7514
127.33889,0.49378882,89.853505,-17.698711,-0.14346277,-12.949066,1205.8573
173.79449,-7.9973316,89.87012,-21.117047,1.3163742,-12.234116,1235.1183
162.28093,-4.9813608,89.937923,-20.853523,0.76576481,-12.277634,1222.618
92.865781,-6.806125,89.993513,-13.83354,0.65600369,-13.477644,1193.4075
134.6566,2.0809675,90.028115,-17.815092,-0.29294772,-11.949715,1274.4313
142.10418,-8.5363691,90.141458,-18.585468,0.86059089,-12.106103,1258.5522
70.926087,-14.583138,90.149064,-11.220072,1.9161284,-13.098416,1257.5447
174.84247,-7.1788541,90.238439,-21.677081,0.97746574,-12.074991,1232.237
115.18832,-8.3247262,90.439338,-16.477348,1.0968216,-13.209569,1205.6125
128.25498,5.532166,90.478827,-17.857737,-0.76775718,-12.5644,1230.0636
101.41504,11.159019,90.535777,-14.229536,-1.3682448,-12.58176,1271.0198
142.88397,12.827503,90.557993,-19.752814,-1.6532525,-12.660344,1201.3054
100.66517,-12.893505,90.563243,-14.862341,1.6415227,-13.136962,1226.9198
127.45765,22.868032,90.668113,-16.797291,-2.6165829,-11.95045,1289.5228
190.88678,-7.3388242,90.671811,-17.49244,1.9073502,-13.100359,1289.9369
161.79998,-16.693886,90.776875,-20.001621,2.3238448,-12.838122,1207.1514
172.64396,7.6651102,90.812889,-22.139966,-0.94523709,-11.959344,1226.1506
108.18027,6.1231465,91.090407,-15.329175,-0.86871118,-12.777519,1246.8189
102.78572,-5.3667603,91.096198,-13.284374,0.47750669,-13.19993,1249.8993
108.53703,-1.8519725,91.116897,-15.074978,0.1360192,-12.469723,1273.7613
93.58125,-8.3260815,91.123745,-11.648524,0.81467994,-13.438151,1256.9674
163.19864,-9.683148,91.328468,-20.10849,1.0989905,-12.085558,1258.8258
114.62683,-6.3630913,91.478944,-15.648429,0.76316678,-13.126376,1230.9379
117.95878,3.251919,91.537267,-16.960405,-0.55391636,-13.059154,1207.177
102.80712,2.8556345,91.611422,-14.284852,-0.39843493,-12.520696,1282.3418
107.70852,-6.0667385,91.648766,-13.964855,0.66802822,-12.966824,1267.8526
119.14636,-1.654655,91.65207,-16.461991,-0.042757495,-12.89261,1227.5676
154.15078,-9.1616138,91.895081,-18.616607,1.139604,-12.246992,1276.1166
111.43027,-2.5049563,92.009327,-14.941941,0.056743734,-13.105649,1240.9066
95.28783,2.3835969,92.30896,-13.449208,-0.28188314,-12.801974,1274.6904
167.39135,-7.1721255,92.397352,-21.337781,1.0385377,-12.516284,1215.1525
121.10404,-11.954795,92.42716,-16.580298,1.3587578,-13.378644,1203.823
110.69639,9.5761987,92.435331,-15.695281,-1.3735679,-12.939223,1235.4368
93.110821,4.0539704,92.472516,-14.312469,-0.37231767,-13.801309,1215.2548
145.26616,1.0963709,92.551504,-18.608179,-0.13550143,-11.995791,1278.3004
89.030334,0.45779544,92.558167,-13.958565,0.24783102,-14.515463,1191.4474
189.85939,12.517584,92.66147,-23.421452,-1.2898758,-11.964118,1224.3036
99.055593,1.8049221,92.730124,-14.862995,-0.28687886,-13.680169,1209.9783
101.05343,-1.0440966,92.763045,-14.050477,0.045241141,-12.745338,1276.1672
113.74126,-8.2216535,92.765971,-15.134833,0.91490893,-12.903315,1261.9803
93.425749,-11.254046,92.940082,-12.910637,1.0405864,-13.981729,1210.0486
119.9352,-14.000039,92.989204,-16.91411,1.699439,-13.501105,1192.356
103.7183,0.0016820315,93.04701,-14.666626,-0.12693855,-13.34509,1227.2477
227.52836,0.1046456,93.112305,-25.947154,13.319368,-20.533641,1292.1181
160.78461,7.1075344,93.147394,-21.166206,-0.75096385,-12.753876,1197.4023
106.11717,18.09937,93.170752,-15.591541,-2.2757576,-14.026132,1194.7855
162.62027,-6.5656995,93.263551,-20.758438,0.75443663,-12.54915,1222.7664
146.81486,15.489226,93.305333,-18.718862,-1.6153813,-12.046682,1277.2595
166.54621,-8.6091136,93.307545,-18.673548,1.5186644,-12.974612,1253.7641
184.74249,-11.293833,93.352299,-22.488472,1.5183604,-12.382215,1221.241
141.60663,-10.200936,93.513795,-17.008581,1.5456079,-13.111413,1251.4976
90.487863,-7.5795349,93.515338,-12.853209,0.73684265,-13.959484,1211.1364
167.41695,-2.5730395,93.516081,-21.359491,0.27348681,-12.55728,1214.7745
173.83065,-9.6588998,93.650591,-19.568983,1.5851763,-12.811984,1254.1103
83.99591,4.8721255,93.737213,-11.961439,-0.66057942,-13.168324,1271.2342
123.63607,1.8644415,93.889336,-16.377173,-0.18530058,-12.513413,1274.8636
146.99992,-10.643374,94.02002,-14.596088,1.4765553,-13.520534,1276.032
81.330172,13.644879,94.062044,-12.74262,-1.0683467,-14.832965,1206.7352
141.68836,-2.848847,94.103692,-18.517505,0.27524467,-12.865687,1230.4196
133.05858,0.67517664,94.155364,-17.776627,-0.19887243,-12.60794,1251.1866
115.92688,16.906978,94.177358,-16.294895,-2.2663183,-13.162084,1228.158
172.17649,-5.566587,94.213764,-21.575534,0.46819808,-12.396218,1228.0664
128.15652,-3.2904745,94.250805,-17.327621,0.44895558,-13.27744,1209.8767
110.495,11.348048,94.270733,-15.193717,-1.3680444,-12.867857,1261.5795
111.52229,-6.8575312,94.349827,-13.829429,0.71596598,-13.480041,1250.3628
79.587578,-2.430824,94.364564,-11.254107,0.044133368,-13.858848,1238.2117
180.57147,-8.3290977,94.557006,-21.85176,1.190062,-12.456041,1232.194
148.19023,-3.3432909,94.658674,-19.193859,0.22028493,-12.368639,1255.1177
71.171491,-7.4893032,94.717781,-12.690825,1.7241018,-14.300133,1213.0961
127.07902,-3.9180377,94.821243,-17.567225,0.47771232,-13.418056,1197.8609
167.63934,1.2765686,94.92903,-20.447456,-0.089315642,-11.788201,1285.3806
71.563314,-18.622081,94.944045,-10.883826,2.3384649,-13.462705,1262.0907
82.538477,0.94647457,95.174046,-11.800971,-0.14841224,-13.229164,1277.3913
113.16967,-6.5756724,95.194104,-15.614655,0.78539716,-13.503596,1224.2174
124.19602,3.4753164,95.210865,-16.89685,-0.51501664,-12.869281,1247.8983
108.62439,-1.3054881,95.242784,-14.426774,-0.12137735,-13.411324,1246.0618
119.30467,12.083491,95.275928,-16.986275,-1.2244767,-13.761733,1209.4171
159.25102,-3.076537,95.31178,-19.427295,0.4322046,-11.989239,1289.5452
139.31281,2.3738643,95.319761,-18.163206,-0.22925858,-12.696665,1250.2232
112.40971,9.7878104,95.341526,-15.208496,-1.2548403,-12.796462,1273.9851
146.15754,-0.86393695,95.409029,-18.93599,0.25403755,-12.89973,1231.4408
164.16495,-10.061312,95.434713,-16.458933,1.5471006,-13.21836,1285.9345
67.733102,-7.3363335,95.485253,-13.11007,2.7710747,-15.259141,1197.7477
71.409056,6.5474628,95.560854,-10.587933,-1.0312624,-13.754784,1252.7221
139.60832,-16.084849,95.786699,-18.248534,1.8994707,-13.216996,1222.4054
133.8426,4.7302929,95.815452,-17.629467,-0.49949997,-12.642777,1260.0892
119.93687,-14.228466,95.899266,-16.324165,1.6170836,-13.775619,1208.2382
134.68703,-4.3047774,95.929231,-17.196795,0.50408087,-12.716055,1269.191
131.8263,7.4937394,95.953937,-17.116512,-0.80618437,-12.486215,1279.2137
138.41365,-5.4636799,95.994912,-17.910706,0.54057222,-13.041825,1238.2083
156.98745,22.998647,96.006336,-20.725271,-2.6465383,-12.947843,1209.7243
185.84725,-1.3115335,96.013818,-22.840796,0.51985054,-12.575714,1216.6179
115.81718,-10.884315,96.07798,-12.207972,1.1180906,-13.810563,1269.5004
184.48884,-8.6721676,96.100606,-21.658791,1.3831974,-12.68827,1235.9848
143.70617,2.2299634,96.101738,-18.382965,-0.30305709,-12.344745,1275.2977
83.667883,-8.9346296,96.119211,-12.570904,1.1404853,-14.137335,1220.2411
172.86032,-5.3728776,96.187015,-21.463013,0.80044754,-12.719075,1223.4844
151.53991,-8.9679756,96.298012,-19.15688,0.86557291,-12.520215,1259.4187
185.83415,-7.6760217,96.382588,-22.288834,1.0111913,-12.501828,1233.1034
136.32872,0.56820163,96.450458,-18.259328,-0.15420459,-13.439086,1206.7238
82.849531,-12.706756,96.620049,-13.418763,1.8020039,-14.25562,1205.0248
135.99071,24.187998,96.740918,-17.334745,-2.6628305,-12.340689,1290.3893
76.654668,-15.550834,96.812335,-11.694158,1.9542429,-13.554747,1258.4111
99.919887,-7.1338866,96.8649,-14.382627,0.65553655,-14.007344,1194.2739
137.33467,5.9223967,96.868897,-18.46081,-0.79334161,-12.99578,1230.9301
183.88261,8.144743,96.892597,-22.814154,-0.97342008,-12.359532,1227.0171
108.65394,11.849101,96.934721,-14.725925,-1.3918525,-13.013897,1271.8863
152.92477,13.66668,96.99661,-20.410297,-1.7036905,-13.093989,1202.1719
123.5641,-8.8817112,97.165965,-17.024743,1.1311279,-13.697171,1206.479
108.22596,-13.723885,97.251159,-15.379265,1.6797785,-13.615262,1227.7863
171.92167,-17.877232,97.320436,-20.483358,2.4095942,-13.336413,1208.0178
68.29554,13.094707,97.370369,-11.23751,1.9142925,-15.599758,1231.8812
199.64206,-8.3327432,97.385395,-17.507197,2.0675753,-13.768183,1290.8033
116.20563,-1.918299,97.455748,-15.59945,0.1291442,-12.885524,1274.6278
173.39134,-10.239153,97.476675,-20.661531,1.1249056,-12.507481,1259.6923
115.97959,6.5646329,97.589986,-15.867876,-0.89728647,-13.22066,1247.6854
109.52958,-5.6036313,97.8217,-13.689945,0.47012299,-13.702075,1250.7658
99.482478,-8.7313504,97.973928,-11.954339,0.80612923,-13.962906,1257.8339
110.07413,3.0582346,97.97609,-14.783242,-0.4120013,-12.937825,1283.2083
163.57505,-9.7412856,98.128657,-19.079175,1.1791037,-12.687648,1276.9831
122.57181,-6.7486212,98.164694,-16.13,0.77897041,-13.616958,1231.8043
126.59017,3.5344069,98.183085,-17.564983,-0.57609056,-13.52389,1208.0435
127.5191,-1.6277077,98.213914,-17.028587,-0.065018786,-13.35453,1228.4341
114.78992,-6.4021244,98.251031,-14.359535,0.67337742,-13.442406,1268.7191
92.397275,8.9988178,98.291635,-14.654627,2.9774307,-16.807929,1202.798
117.58901,47.775856,98.437369,-8.3848179,18.866896,-28.867857,1202.1207
154.71267,1.164446,98.64693,-19.177567,-0.13673646,-12.38593,1279.1668
119.01762,-2.527448,98.685902,-15.405646,0.033125532,-13.601136,1241.773
201.74148,13.16685,98.743671,-24.106278,-1.3067931,-12.364753,1225.1701
178.21401,-7.7020724,98.76713,-21.951662,1.0813114,-12.963218,1216.0189
102.13323,2.5248868,98.818115,-13.932437,-0.28314646,-13.234482,1275.5569
118.68331,10.274001,99.017818,-16.252144,-1.4176554,-13.390459,1236.3032
129.52696,-12.638808,99.240931,-17.110918,1.3771555,-13.876265,1204.6894
108.20102,-1.0646198,99.242738,-14.539838,0.036714237,-13.173311,1277.0337
121.42205,-8.6814373,99.332982,-15.587121,0.92393313,-13.365016,1262.8468
156.31769,16.300583,99.425888,-19.292309,-1.6296407,-12.435466,1278.126
100.39364,4.2484453,99.485434,-14.819132,-0.40617125,-14.251066,1216.1213
171.53197,7.4849427,99.637095,-21.822655,-0.75836357,-13.204904,1198.2688
173.15211,-6.9467551,99.648375,-21.368169,0.76966427,-12.990352,1223.6329
196.13985,-12.065263,99.652646,-23.099976,1.5671115,-12.819468,1222.1074
106.61966,1.9541126,99.687905,-15.393179,-0.31043053,-14.151293,1210.8448
111.17803,0.068097244,99.842634,-15.171155,-0.13872961,-13.837561,1228.1142
128.53358,-14.858408,99.863584,-17.478837,1.733814,-13.996403,1193.2225
178.2552,-2.7101259,99.904645,-21.992887,0.27479092,-12.997074,1215.6409
175.966,-9.3904192,99.923408,-19.002784,1.6068623,-13.48934,1254.6305
96.131454,0.34221635,99.926035,-14.446481,0.21434151,-14.957802,1192.3139
99.982349,-11.772374,100.0679,-13.314554,1.0326261,-14.529416,1210.9151
183.71318,-10.472032,100.17954,-19.959261,1.6674062,-13.304138,1254.9768
150.19647,-10.992275,100.19854,-17.347307,1.6200426,-13.628466,1252.3641
131.95534,1.9562574,100.2501,-16.899528,-0.18180053,-12.92967,1275.73
114.04453,19.262471,100.29466,-16.118697,-2.3770761,-14.471196,1195.6519
90.088198,5.2057399,100.43455,-12.407755,-0.67371153,-13.620827,1272.1006
183.12182,-5.799147,100.51782,-22.205246,0.46178184,-12.820083,1228.9328
142.09081,0.77839748,100.56445,-18.352024,-0.21415507,-13.028331,1252.053
97.021747,-7.9484648,100.63043,-13.280829,0.73891241,-14.500969,1212.0029
151.08676,-2.9866839,100.65104,-19.075218,0.27611727,-13.323887,1231.2861
118.22094,12.038298,100.81342,-15.709889,-1.3927358,-13.302743,1262.446
124.21453,18.059504,100.87092,-16.855723,-2.3441188,-13.612024,1229.0244
191.64515,-8.9359403,100.894,-22.441923,1.2373154,-12.89226,1233.0605
178.0134,1.3194576,100.91465,-21.048632,-0.082094062,-12.154249,1286.2471
154.33081,-11.394952,100.91753,-14.723262,1.5295801,-14.070668,1276.8984
157.93717,-3.4507578,100.94388,-19.793633,0.20933166,-12.772123,1255.9841
136.9592,-3.5188899,101.01088,-17.882361,0.46503265,-13.762787,1210.7432
113.93581,47.293542,101.16853,-11.318328,20.920517,-29.369485,1206.5318
118.52842,-7.2167723,101.21795,-14.193415,0.72112563,-13.992593,1251.2292
169.10405,-3.2988215,101.40211,-19.984448,0.45715721,-12.372125,1290.4117
85.309821,-2.4460979,101.42721,-11.632319,0.016275059,-14.392443,1239.0781
87.807905,14.214709,101.56898,-13.170246,-1.2080327,-15.199275,1207.6017
136.00955,-4.1601933,101.65175,-18.154368,0.49109054,-13.903848,1198.7273
132.78525,3.7379092,101.75301,-17.459851,-0.53546839,-13.299214,1248.7648
148.53535,2.4879074,101.77521,-18.72653,-0.22673212,-13.125163,1251.0896
77.120085,-19.801779,101.7888,-11.344038,2.379799,-13.915996,1262.9572
120.14003,10.42458,101.8457,-15.712645,-1.2923014,-13.220101,1274.8516
88.549709,1.0218862,101.89965,-12.244189,-0.15323039,-13.673054,1278.2577
155.76721,-0.99612909,101.97177,-19.5018,0.27496054,-13.351414,1232.3072
77.632686,-8.3522195,101.9831,-13.152466,1.7270002,-14.762959,1213.9626
121.10237,-6.9726887,102.06815,-16.114953,0.80260885,-13.992809,1225.0838
115.94494,-1.2366072,102.07483,-14.852789,-0.15462452,-13.917818,1246.9282
172.45807,-10.853842,102.16702,-16.713787,1.6229184,-13.710329,1286.801
142.79901,4.9805196,102.24017,-18.196063,-0.50121046,-13.055987,1260.9556
127.93707,12.706763,102.26522,-17.543509,-1.2689168,-14.196251,1210.2836
140.51912,7.8987071,102.29803,-17.654568,-0.81347732,-12.890099,1280.0802
153.03933,2.38405,102.37284,-18.949473,-0.31331541,-12.739617,1276.1642
143.41015,-4.5602215,102.39578,-17.694713,0.51770777,-13.150363,1270.0575
197.43038,-1.5833756,102.40942,-23.490498,0.56797598,-13.007172,1217.4844
148.86303,-17.045509,102.51491,-18.768749,1.9428778,-13.696288,1223.2718
195.45159,-9.3807242,102.55887,-22.190603,1.4511671,-13.145249,1236.8513
76.807144,7.0744225,102.56002,-11.003971,-1.0770283,-14.241914,1253.5886
167.51755,24.338156,102.58084,-21.395411,-2.7113005,-13.350099,1210.5908
147.50176,-5.7346891,102.63087,-18.440803,0.54336379,-13.502206,1239.0748
183.74278,-5.7819437,102.6574,-22.065679,0.83592653,-13.16285,1224.3509
161.26046,-9.4016413,102.6618,-19.724752,0.86878711,-12.935084,1260.2852
197.13042,-8.190006,102.74054,-22.895346,1.0446856,-12.930258,1233.9699
239.76015,-5.2509665,102.89665,-22.951695,8.2270223,-19.031838,1292.9846
128.21888,-15.044463,102.91551,-16.802131,1.6466344,-14.289762,1209.1046
144.79221,25.530348,103.00872,-17.87111,-2.7060512,-12.730458,1291.2557
121.97408,-11.443026,103.11478,-12.418532,1.1163653,-14.336286,1270.3669
195.45756,8.6386583,103.1725,-23.485035,-1.0023559,-12.760143,1227.8836
74.396862,-8.685672,103.20591,-13.544173,2.6321662,-15.630095,1198.6142
145.58582,0.64774728,103.2652,-18.742888,-0.16286034,-13.745029,1207.4679
90.062327,-9.5094269,103.31485,-13.005646,1.1582501,-14.645617,1221.1075
146.71558,6.3256949,103.4745,-19.062658,-0.82002596,-13.42651,1231.7965
116.14084,12.550615,103.54955,-15.221587,-1.4139493,-13.445277,1272.7527
163.29412,14.531413,103.65184,-21.066915,-1.7554131,-13.526762,1203.0383
82.61997,-16.536914,103.70398,-12.166607,1.9896109,-14.012064,1259.2776
89.687798,-13.616548,103.8705,-13.933161,1.8363477,-14.74695,1205.8912
107.24813,-7.462106,104.0003,-14.930059,0.65768119,-14.533732,1195.1404
124.1365,-1.9809533,104.00227,-16.124056,0.12130792,-13.300406,1275.4943
182.28162,-19.103468,104.11354,-20.954973,2.4952698,-13.836153,1208.8843
132.21192,-9.4558243,104.13677,-17.565431,1.1652579,-14.186311,1207.3454
116.04266,-14.573016,104.17916,-15.885751,1.7164623,-14.097404,1228.6527
124.0479,7.0204859,104.31093,-16.405174,-0.92617119,-13.662965,1248.5518
208.37193,-9.4017341,104.42268,-17.433763,2.2005038,-14.284324,1291.5475
117.59038,3.267678,104.54909,-15.281755,-0.42581594,-13.354034,1284.0747
173.22859,-10.340699,104.58307,-19.533728,1.2184933,-13.130287,1277.8495
116.47443,-5.8370009,104.79829,-14.088262,0.46342965,-14.204327,1251.6322
164.4434,1.2330426,104.93746,-19.745021,-0.13759034,-12.776217,1280.0333
136.17459,-1.5896149,105.00636,-17.593085,-0.087404003,-13.814992,1229.3005
213.9649,13.823936,105.02634,-24.78658,-1.3211173,-12.766043,1226.0366
135.52358,3.8280864,105.06092,-18.168467,-0.59871497,-13.987203,1208.9099
105.53329,-9.1318505,105.08707,-12.24659,0.7954523,-14.490126,1258.7003
122.06678,-6.7399435,105.09135,-14.746699,0.67771189,-13.919008,1269.5855
130.75521,-7.1420421,105.09628,-16.602079,0.79465757,-14.109714,1232.6708
74.058081,12.322936,105.20317,-11.793108,1.2239004,-15.758536,1232.7476
189.34167,-8.2534764,105.36102,-22.557644,1.1243175,-13.412772,1216.8854
109.2203,2.6666076,105.54328,-14.415832,-0.28361132,-13.666039,1276.4233
126.83389,-2.5379165,105.61104,-15.857417,0.0085316631,-14.100018,1242.6395
166.10701,17.118415,105.74073,-19.864825,-1.6412404,-12.823813,1278.9925
126.94833,10.993855,105.82551,-16.807763,-1.4617438,-13.840054,1237.1697
115.59319,-1.0806524,105.93624,-15.028717,0.02725567,-13.600608,1277.9001
129.32707,-9.1452386,106.1313,-16.031663,0.93090922,-13.828532,1263.7133
207.84136,-12.860638,106.17211,-23.704987,1.6140622,-13.258705,1222.9739
183.98759,-7.3352097,106.25415,-21.972884,0.78398676,-13.432993,1224.4994
138.21452,-13.331747,106.30322,-17.63895,1.3943558,-14.372688,1205.5559
182.60664,7.8655531,106.35228,-22.475408,-0.76373386,-13.655822,1199.1352
189.40915,-2.8477419,106.51328,-22.622227,0.27557477,-13.437585,1216.5074
99.862081,7.8014581,106.64099,-15.188678,1.9170726,-16.652208,1203.6644
107.93027,4.4607306,106.72429,-15.327635,-0.44349154,-14.704991,1216.9878
185.54608,-10.216205,106.79736,-19.314902,1.696404,-14.006859,1255.497
140.53521,2.0460698,106.81903,-17.419595,-0.17728734,-13.346049,1276.5965
114.44862,2.1159337,106.88177,-15.922444,-0.33740116,-14.624468,1211.7113
118.88816,0.14046537,106.88478,-15.6681,-0.15083665,-14.33123,1228.9806
193.78801,-11.326262,106.95503,-20.338364,1.7493703,-13.798033,1255.8432
137.41344,-15.733564,106.98561,-18.040077,1.7664896,-14.491669,1194.0889
194.38113,-6.0280748,107.03397,-22.831338,0.45363733,-13.244635,1229.7993
188.68776,1.3585099,107.08326,-21.648575,-0.073974157,-12.520196,1287.1136
158.95022,-11.821226,107.14318,-17.664166,1.6959295,-14.150934,1253.2305
151.41032,0.88949495,107.18364,-18.925724,-0.23039718,-13.448402,1252.9195
96.403691,5.5456629,107.35785,-12.854223,-0.68581889,-14.072201,1272.9671
160.76264,-3.1249595,107.42777,-19.627378,0.27696187,-13.783178,1232.1525
167.9836,-3.5523399,107.43076,-20.391847,0.19671653,-13.175348,1256.8506
203.01222,-9.566389,107.44963,-23.025196,1.2844281,-13.330591,1233.927
106.73902,-12.286487,107.46935,-13.710902,1.0235769,-15.076214,1211.7816
103.47735,0.24359831,107.51776,-14.937519,0.1800023,-15.410688,1193.1804
126.20475,12.740534,107.57334,-16.225237,-1.4159539,-13.736781,1263.3125
122.23677,20.476855,107.64353,-16.651131,-2.480799,-14.925552,1196.5184
179.23506,-3.5339249,107.68395,-20.539194,0.48346623,-12.755233,1291.2782
132.76343,19.246705,107.74604,-17.342347,-2.3964527,-13.893862,1229.7686
146.03809,-3.7558274,108.0135,-18.432466,0.48299404,-14.24759,1211.6097
103.76703,-8.3184145,108.01644,-13.698655,0.74078864,-15.043185,1212.8694
161.71823,-12.172619,108.09222,-14.821159,1.580617,-14.629855,1277.7649
125.71396,-7.5787558,108.34256,-14.547114,0.72686633,-14.505965,1252.0957
158.03887,2.6004004,108.44494,-19.287107,-0.2230527,-13.553753,1251.9561
141.65565,4.0109097,108.50998,-18.021529,-0.55665366,-13.728538,1249.6313
128.12227,11.080167,108.56149,-16.21626,-1.330085,-13.64291,1275.718
91.211204,-2.4533072,108.66758,-12.024129,0.012211638,-14.718325,1239.8223
145.23287,-4.4092833,108.72496,-18.738419,0.50538085,-14.388843,1199.5938
165.65838,-1.139132,108.76065,-20.061966,0.29726267,-13.804302,1233.1737
162.6554,2.5433082,108.84133,-19.514536,-0.32374681,-13.134342,1277.0306
149.48067,8.3069874,108.84398,-18.191448,-0.81942132,-13.293657,1280.9466
94.782882,1.0997096,108.84689,-12.688673,-0.15807601,-14.115715,1279.1242
82.908134,-21.001294,108.85972,-11.808841,2.4176841,-14.367404,1263.8236
152.03856,5.2312866,108.87131,-18.76207,-0.50164582,-13.468443,1261.8221
209.33631,-1.8799955,109.02156,-24.131696,0.61896077,-13.441961,1218.3508
152.38071,-4.8224843,109.07986,-18.186565,0.53132939,-13.586225,1270.9239
180.87931,-11.684006,109.14444,-16.971965,1.6974108,-14.198729,1287.6675
123.47413,-1.1502401,109.16174,-15.260883,-0.19154935,-14.430988,1247.7947
129.28334,-7.3781786,109.18718,-16.607672,0.81921616,-14.483585,1225.9503
171.26399,-9.8364216,109.23326,-20.288657,0.86999645,-13.350882,1261.1516
206.6777,-10.123432,109.24634,-22.712171,1.5197085,-13.605071,1237.7177
94.502375,14.850071,109.26571,-13.609362,-1.3309617,-15.591421,1208.4681
208.72847,-8.7206219,109.31318,-23.49579,1.0776786,-13.360655,1234.8364
194.92468,-6.2089034,109.35033,-22.660571,0.87199001,-13.609362,1225.2174
178.38315,25.709649,109.35637,-22.067192,-2.7743092,-13.75194,1211.4572
153.86162,26.89346,109.47131,-18.406324,-2.7458082,-13.1198,1292.1222
136.84836,13.352665,109.473,-18.101808,-1.3148737,-14.635609,1211.15
84.322237,-9.2156508,109.48263,-13.603986,1.7260613,-15.23688,1214.8291
158.37544,-18.027368,109.48347,-19.279339,1.9841708,-14.178381,1224.1383
156.85341,-6.0069093,109.49734,-18.964785,0.54536494,-13.963859,1239.9412
207.36695,9.1472143,109.65286,-24.151834,-1.0319693,-13.161464,1228.75
82.412445,7.6250363,109.80286,-11.416579,-1.1260047,-14.729588,1254.455
136.73716,-15.874756,110.18944,-17.269239,1.6741583,-14.806296,1209.9711
155.10259,0.73086446,110.25867,-19.323477,-0.16915139,-14.228617,1208.3344
156.39712,6.7426052,110.29529,-19.66331,-0.84778274,-13.856518,1232.663
123.87544,13.262766,110.37986,-15.716724,-1.4343721,-13.87581,1273.6192
128.23473,-12.000212,110.41387,-12.623377,1.1118853,-14.859671,1271.2333
173.95892,15.417818,110.46385,-21.628601,-1.789369,-13.795304,1203.7825
132.32968,-2.039419,110.75601,-16.648613,0.11236713,-13.714424,1276.3607
96.672154,-10.092363,110.76527,-13.432298,1.172973,-15.156458,1221.974
88.820603,-17.539919,110.82474,-12.635084,2.0218863,-14.471361,1260.144
81.27624,-9.9734384,111.12153,-13.9722,2.5225102,-16.037485,1199.4806
192.87531,-20.372343,111.15668,-21.418767,2.5800067,-14.336414,1209.7508
132.38456,7.4908461,111.2528,-16.94128,-0.95530137,-14.104363,1249.4183
183.10749,-10.959675,111.25923,-19.980722,1.2572693,-13.574583,1278.716
125.3559,3.4841004,111.32997,-15.780329,-0.4399233,-13.769317,1284.9412
124.10966,-15.440011,111.34932,-16.380173,1.7511721,-14.583994,1229.5192
141.12833,-10.046858,111.35256,-18.099024,1.1987367,-14.677076,1208.2119
96.781335,-14.542199,111.36783,-14.439575,1.8653679,-15.24315,1206.7577
114.84964,-7.7918438,111.39813,-15.475683,0.6614491,-15.057138,1196.0069
174.45733,1.3019741,111.42319,-20.31034,-0.13807788,-13.166717,1280.8997
217.06382,-10.539882,111.75218,-17.292168,2.3481449,-15.059722,1292.4139
123.61657,-6.0670992,112.02608,-14.479116,0.45696015,-14.706872,1252.4987
145.11186,-1.5402168,112.02865,-18.15568,-0.11029848,-14.273946,1230.167
144.75848,4.1332284,112.17004,-18.771029,-0.62196366,-14.449032,1209.7764
129.53539,-7.0796105,112.17018,-15.126636,0.68071834,-14.39643,1270.452
200.77016,-8.82638,112.18041,-23.154797,1.1672663,-13.865293,1217.7518
176.18236,17.941328,112.24963,-20.436398,-1.6499286,-13.211717,1279.8589
139.1722,-7.5431803,112.27479,-17.064277,0.80976543,-14.6047,1233.5372
111.72646,-9.5262595,112.46463,-12.523509,0.78157044,-15.020722,1259.5668
116.54906,2.808367,112.484,-14.899226,-0.28330512,-14.096694,1277.2898
121.91479,38.615534,112.57436,-8.9343583,17.726228,-27.656952,1202.3755
250.48847,-8.5303941,112.61506,-20.467479,5.6311917,-19.680455,1293.6064
134.87278,-2.5356775,112.78662,-16.295911,-0.017843088,-14.603003,1243.506
123.22962,-1.0916931,112.84324,-15.516908,0.016724665,-14.02728,1278.7666
135.49093,11.735708,112.85759,-17.362542,-1.5056117,-14.287963,1238.0361
219.84365,-13.678936,112.91173,-24.30302,1.6587287,-13.700162,1223.8404
195.12403,-7.7305437,113.08166,-22.57193,0.79714487,-13.877353,1225.3658
80.073873,11.832255,113.14932,-12.260348,0.7647019,-16.039691,1233.6141
137.45237,-9.611923,113.16182,-16.468263,0.93539359,-14.293825,1264.5797
194.00671,8.2482893,113.29291,-23.1242,-0.76682528,-14.10671,1200.0017
149.37453,2.1333734,113.59618,-17.937282,-0.17176691,-13.762567,1277.463
147.1656,-14.032846,113.61336,-18.165136,1.4096888,-14.867572,1206.4224
205.95244,-6.2524604,113.76261,-23.453201,0.44358962,-13.670099,1230.6658
