{
  "categories": [
    {
      "title": "Games",
      "slug": "games",
      "imgName": "games",
      "bigImgName": "games-big",
      "position": "50% 70%"
    },
    {
      "title": "IT",
      "slug": "it",
      "imgName": "it",
      "bigImgName": "it-big",
      "position": "50% 30%"
    },
    {
      "title": "Anime",
      "slug": "anime",
      "imgName": "anime",
      "bigImgName": "anime-big",
      "position": "50% 30%"
    },
    {
      "title": "Life",
      "slug": "life",
      "imgName": "life",
      "bigImgName": "life-big",
      "position": "50% 30%"
    },
    {
      "title": "Music",
      "slug": "music",
      "imgName": "music",
      "bigImgName": "music-big",
      "position": "50% 50%"
    },
    {
      "title": "Travel",
      "slug": "travel",
      "imgName": "travel",
      "bigImgName": "travel-big",
      "position": "50% 40%"
    },
    {
      "title": "Sport",
      "slug": "sport",
      "imgName": "sport",
      "bigImgName": "sport-big",
      "position": "50% 30%"
    },
    {
      "title": "Culture",
      "slug": "culture",
      "imgName": "culture",
      "bigImgName": "culture-big",
      "position": "50% 30%"
    }
  ]
}
