<svg width="24" height="24" viewBox="0 0 24 24" fill="none" xmlns="http://www.w3.org/2000/svg">
<path d="M0 4C0 1.79086 1.79086 0 4 0H20C22.2091 0 24 1.79086 24 4V20C24 22.2091 22.2091 24 20 24H4C1.79086 24 0 22.2091 0 20V4Z" fill="#E66E4B"/>
<path d="M17.3576 4.7998H18.0149C18.8522 4.7998 19.1325 5.06653 19.1325 5.89305V11.9981C18.5408 13.2955 17.6344 14.5929 16.4407 15.7421C15.0741 17.0329 13.5068 17.9747 11.9672 18.5213C10.4553 19.058 8.74958 19.0152 7.37258 18.2183C5.70495 17.2502 4.86768 15.5215 4.86768 13.032V12.953C5.35205 11.2078 6.45573 9.36046 8.09914 7.79305C8.56275 7.3518 9.05058 6.95336 9.5488 6.59772V12.8839C9.5488 14.3591 10.4172 15.0967 12.1852 15.0967C12.8979 15.0967 13.5795 15.0374 14.2334 14.8892C14.3891 14.83 14.4513 14.7114 14.4513 14.5632V7.56584C14.4513 6.03793 15.7522 4.7998 17.3576 4.7998Z" fill="white"/>
<path d="M7.27232 7.04937C7.96819 6.39723 8.70602 5.82742 9.46484 5.34655C9.33895 4.94473 9.02424 4.7998 8.4018 4.7998H7.7374C6.11486 4.7998 4.80005 6.03822 4.80005 7.56647V10.1355C5.42598 9.06179 6.25474 8.01111 7.27232 7.04937Z" fill="white"/>
<path d="M17.2841 16.6292C16.1164 17.727 14.8275 18.5913 13.5212 19.1994C15.1566 19.058 16.6535 18.7327 17.9874 18.22C18.9818 17.8354 19.2001 17.4838 19.2001 16.5109V14.3779C18.6631 15.1601 18.0255 15.9193 17.2841 16.6292Z" fill="white"/>
</svg>
