<svg width="24" height="24" viewBox="0 0 24 24" fill="none" xmlns="http://www.w3.org/2000/svg">
<path fill-rule="evenodd" clip-rule="evenodd" d="M17.1333 22.9999C20.3733 22.9999 22.9999 20.3733 22.9999 17.1333C22.9999 13.8932 20.3733 11.2666 17.1333 11.2666C13.8932 11.2666 11.2666 13.8932 11.2666 17.1333C11.2666 20.3733 13.8932 22.9999 17.1333 22.9999Z" stroke="#E66E4B" stroke-width="1.5" stroke-linecap="round" stroke-linejoin="round"/>
<path d="M17.1338 14.2V20.0666" stroke="#E66E4B" stroke-width="1.5" stroke-linecap="round" stroke-linejoin="round"/>
<path d="M17.1336 20.0667L14.9336 17.8667" stroke="#E66E4B" stroke-width="1.5" stroke-linecap="round" stroke-linejoin="round"/>
<path d="M17.1338 20.0667L19.3338 17.8667" stroke="#E66E4B" stroke-width="1.5" stroke-linecap="round" stroke-linejoin="round"/>
<path d="M3.93359 6.8667H14.2003" stroke="#E66E4B" stroke-width="1.5" stroke-linecap="round" stroke-linejoin="round"/>
<path d="M3.93359 11.2666H9.80026" stroke="#E66E4B" stroke-width="1.5" stroke-linecap="round" stroke-linejoin="round"/>
<path d="M3.93359 15.6667H7.60026" stroke="#E66E4B" stroke-width="1.5" stroke-linecap="round" stroke-linejoin="round"/>
<path d="M7.6 20.0667H2.46667C1.65665 20.0667 1 19.41 1 18.6V2.46667C1 1.65665 1.65665 1 2.46667 1H12.8595C13.2482 1.00008 13.621 1.15447 13.8959 1.42924L16.7041 4.23742C16.9789 4.51237 17.1333 4.88515 17.1333 5.27387V7.6" stroke="#E66E4B" stroke-width="1.5" stroke-linecap="round" stroke-linejoin="round"/>
</svg>
