<svg width="8" height="13" viewBox="0 0 8 13" fill="none" xmlns="http://www.w3.org/2000/svg">
<path d="M1.17781 7.15901L1.17788 7.15908L6.31685 12.2838L6.31689 12.2839C6.55368 12.5199 6.93701 12.5194 7.17334 12.2827L7.17338 12.2827C7.40965 12.0458 7.40899 11.6622 7.17219 11.4261L2.46336 6.73026L7.17236 2.03447H7.17238C7.40913 1.79827 7.40979 1.41487 7.17357 1.17807L7.17351 1.17797C7.05516 1.05937 6.89965 0.999973 6.74461 0.999973C6.59001 0.999973 6.43508 1.05897 6.31691 1.17677L6.31687 1.17687L1.17802 6.30131C1.17801 6.30132 1.178 6.30133 1.17798 6.30135C1.0638 6.41497 0.999853 6.56945 0.999853 6.73026C0.999853 6.89129 1.06408 7.04547 1.17781 7.15901Z" fill="#222222" stroke="#222222" stroke-width="0.35"/>
</svg>
