<svg width="16" height="16" viewBox="0 0 16 16" fill="none" xmlns="http://www.w3.org/2000/svg">
<path d="M9.39987 10.7997H8.93321C8.41774 10.7997 7.99987 10.3819 7.99987 9.86641V7.53307C7.99987 7.27534 7.79094 7.06641 7.53321 7.06641H7.06654" stroke="#222222" stroke-width="1.5" stroke-linecap="round" stroke-linejoin="round"/>
<path d="M7.7666 4.73242C7.63774 4.73242 7.53327 4.83689 7.53327 4.96576C7.53327 5.09462 7.63774 5.19909 7.7666 5.19909C7.89547 5.19909 7.99994 5.09462 7.99994 4.96576C7.99994 4.83689 7.89547 4.73242 7.7666 4.73242V4.73242" stroke="#222222" stroke-width="1.5" stroke-linecap="round" stroke-linejoin="round"/>
<path fill-rule="evenodd" clip-rule="evenodd" d="M8 15C11.866 15 15 11.866 15 8C15 4.13401 11.866 1 8 1C4.13401 1 1 4.13401 1 8C1 11.866 4.13401 15 8 15Z" stroke="#222222" stroke-width="1.5" stroke-linecap="round" stroke-linejoin="round"/>
</svg>
