<svg width="24" height="24" viewBox="0 0 24 24" fill="none" xmlns="http://www.w3.org/2000/svg">
<path fill-rule="evenodd" clip-rule="evenodd" d="M21 3H3L0.75 21H18.75L21 3V3Z" stroke="#E66E4B" stroke-width="1.5" stroke-linecap="round" stroke-linejoin="round"/>
<path d="M21 3L23.25 21" stroke="#E66E4B" stroke-width="1.5" stroke-linecap="round" stroke-linejoin="round"/>
<path d="M9 3L6.75 21" stroke="#E66E4B" stroke-width="1.5" stroke-linecap="round" stroke-linejoin="round"/>
<path d="M15 3L12.75 21" stroke="#E66E4B" stroke-width="1.5" stroke-linecap="round" stroke-linejoin="round"/>
<path d="M2.43652 7.5H20.4365" stroke="#E66E4B" stroke-width="1.5" stroke-linecap="round" stroke-linejoin="round"/>
<path d="M1.31152 16.5H19.3115" stroke="#E66E4B" stroke-width="1.5" stroke-linecap="round" stroke-linejoin="round"/>
<path d="M1.875 12H19.875" stroke="#E66E4B" stroke-width="1.5" stroke-linecap="round" stroke-linejoin="round"/>
</svg>
