<svg width="24" height="24" viewBox="0 0 24 24" fill="none" xmlns="http://www.w3.org/2000/svg">
<path fill-rule="evenodd" clip-rule="evenodd" d="M19.2458 4.75401C18.7566 4.26683 18.0929 3.99539 17.4025 4.00006C16.712 4.00473 16.0521 4.28514 15.5695 4.7789L5.25863 15.0897L4 19.9998L8.91009 18.7405L19.2209 8.42964C19.7148 7.94724 19.9953 7.28739 20 6.59702C20.0047 5.90664 19.7331 5.24305 19.2458 4.75401Z" stroke="#E66E4B" stroke-width="1.5" stroke-linecap="round" stroke-linejoin="round"/>
<path d="M15.2754 5.07373L18.9261 8.72448" stroke="#E66E4B" stroke-width="1.5" stroke-linecap="round" stroke-linejoin="round"/>
<path d="M5.25977 15.0894L8.91407 18.7373" stroke="#E66E4B" stroke-width="1.5" stroke-linecap="round" stroke-linejoin="round"/>
</svg>
