<svg width="24" height="24" viewBox="0 0 24 24" fill="none" xmlns="http://www.w3.org/2000/svg">
<path d="M12.0003 16.75C12.2129 16.75 12.391 16.6781 12.5346 16.5344C12.6782 16.3906 12.75 16.2125 12.75 16V11.75C12.75 11.5375 12.6781 11.3594 12.5343 11.2156C12.3905 11.0719 12.2123 11 11.9997 11C11.7871 11 11.609 11.0719 11.4654 11.2156C11.3218 11.3594 11.25 11.5375 11.25 11.75V16C11.25 16.2125 11.3219 16.3906 11.4657 16.5344C11.6095 16.6781 11.7877 16.75 12.0003 16.75ZM12 9.28845C12.2288 9.28845 12.4207 9.21105 12.5755 9.05625C12.7303 8.90145 12.8077 8.70963 12.8077 8.48078C12.8077 8.25194 12.7303 8.06012 12.5755 7.9053C12.4207 7.7505 12.2288 7.6731 12 7.6731C11.7711 7.6731 11.5793 7.7505 11.4245 7.9053C11.2697 8.06012 11.1923 8.25194 11.1923 8.48078C11.1923 8.70963 11.2697 8.90145 11.4245 9.05625C11.5793 9.21105 11.7711 9.28845 12 9.28845ZM12.0017 21.5C10.6877 21.5 9.45271 21.2506 8.29657 20.752C7.14042 20.2533 6.13474 19.5765 5.27952 18.7217C4.42429 17.8669 3.74723 16.8616 3.24835 15.706C2.74946 14.5504 2.50002 13.3156 2.50002 12.0017C2.50002 10.6877 2.74936 9.45268 3.24802 8.29655C3.74669 7.1404 4.42344 6.13472 5.27827 5.2795C6.13312 4.42427 7.13836 3.74721 8.294 3.24833C9.44962 2.74944 10.6844 2.5 11.9983 2.5C13.3123 2.5 14.5473 2.74933 15.7034 3.248C16.8596 3.74667 17.8653 4.42342 18.7205 5.27825C19.5757 6.1331 20.2528 7.13834 20.7516 8.29398C21.2505 9.44959 21.5 10.6844 21.5 11.9983C21.5 13.3122 21.2506 14.5473 20.752 15.7034C20.2533 16.8596 19.5766 17.8652 18.7217 18.7205C17.8669 19.5757 16.8616 20.2527 15.706 20.7516C14.5504 21.2505 13.3156 21.5 12.0017 21.5ZM12 20C14.2333 20 16.125 19.225 17.675 17.675C19.225 16.125 20 14.2333 20 12C20 9.76664 19.225 7.87498 17.675 6.32498C16.125 4.77498 14.2333 3.99997 12 3.99997C9.76666 3.99997 7.875 4.77498 6.325 6.32498C4.775 7.87498 4 9.76664 4 12C4 14.2333 4.775 16.125 6.325 17.675C7.875 19.225 9.76666 20 12 20Z" fill="white"/>
</svg>
