VirtualBox VM 5.1.18 r114002 win.amd64 (Mar 15 2017 16:16:14) release log
00:00:07.015456 Log opened 2017-07-10T16:11:14.330285300Z
00:00:07.015463 Build Type: release
00:00:07.015480 OS Product: Windows 10
00:00:07.015485 OS Release: 10.0.15063
00:00:07.015487 OS Service Pack: 
00:00:07.254576 DMI Product Name: Inspiron N5110
00:00:07.267406 DMI Product Version: Not Specified
00:00:07.267434 Host RAM: 6050MB (5.9GB) total, 3645MB (3.5GB) available
00:00:07.267444 Executable: C:\Program Files\Oracle\VirtualBox\VirtualBox.exe
00:00:07.267447 Process ID: 2300
00:00:07.267449 Package type: WINDOWS_64BITS_GENERIC
00:00:07.270473 Installed Extension Packs:
00:00:07.270568   None installed!
00:00:07.272361 Console: Machine state changed to 'Starting'
00:00:07.273430 Qt version: 5.6.2
00:00:07.283876 GUI: UIMediumEnumerator: Medium-enumeration finished!
00:00:07.554900 SUP: Loaded VMMR0.r0 (C:\Program Files\Oracle\VirtualBox\VMMR0.r0) at 0xfffff803f27c0000 - ModuleInit at fffff803f27e3590 and ModuleTerm at fffff803f27e3a80 using the native ring-0 loader
00:00:07.554967 SUP: VMMR0EntryEx located at fffff803f27e6490 and VMMR0EntryFast at fffff803f27e41b0
00:00:07.554987 SUP: windbg> .reload /f C:\Program Files\Oracle\VirtualBox\VMMR0.r0=0xfffff803f27c0000
00:00:07.559153 Guest OS type: 'Linux26'
00:00:07.572800 File system of 'C:\Users\caev0\Documents\Asistencia\MV\MarshmallowTest\tools\VM\Snapshots' (snapshots) is unknown
00:00:07.572837 File system of 'C:\Users\caev0\Documents\Asistencia\MV\MarshmallowTest\tools\VM\Marshmallow.vdi' is ntfs
00:00:07.616081 Shared clipboard service loaded
00:00:07.616113 Shared clipboard mode: Off
00:00:07.645488 Drag and drop service loaded
00:00:07.645515 Drag and drop mode: Off
00:00:07.703565 Guest Control service loaded
00:00:07.708880 ************************* CFGM dump *************************
00:00:07.708887 [/] (level 0)
00:00:07.708895   CSAMEnabled       <integer> = 0x0000000000000001 (1)
00:00:07.708902   CpuExecutionCap   <integer> = 0x0000000000000064 (100)
00:00:07.708906   EnablePAE         <integer> = 0x0000000000000000 (0)
00:00:07.708910   HMEnabled         <integer> = 0x0000000000000001 (1)
00:00:07.708914   MemBalloonSize    <integer> = 0x0000000000000000 (0)
00:00:07.708917   Name              <string>  = "Marsmallow" (cb=11)
00:00:07.708921   NumCPUs           <integer> = 0x0000000000000001 (1)
00:00:07.708925   PATMEnabled       <integer> = 0x0000000000000001 (1)
00:00:07.708928   PageFusionAllowed <integer> = 0x0000000000000000 (0)
00:00:07.708931   RamHoleSize       <integer> = 0x0000000020000000 (536 870 912, 512 MB)
00:00:07.708937   RamSize           <integer> = 0x0000000020000000 (536 870 912, 512 MB)
00:00:07.708943   RawR0Enabled      <integer> = 0x0000000000000001 (1)
00:00:07.708946   RawR3Enabled      <integer> = 0x0000000000000001 (1)
00:00:07.708949   TimerMillies      <integer> = 0x000000000000000a (10)
00:00:07.708952   UUID              <bytes>   = "fe 13 a6 33 ad c5 fc 4a 99 16 1c e3 79 ac 17 cd" (cb=16)
00:00:07.708963 
00:00:07.708964 [/CPUM/] (level 1)
00:00:07.708969   GuestCpuName       <string>  = "host" (cb=5)
00:00:07.708972   PortableCpuIdLevel <integer> = 0x0000000000000000 (0)
00:00:07.708975 
00:00:07.708976 [/DBGC/] (level 1)
00:00:07.708980   GlobalInitScript <string>  = "C:\Users\caev0\.VirtualBox/dbgc-init" (cb=37)
00:00:07.708983   HistoryFile      <string>  = "C:\Users\caev0\.VirtualBox/dbgc-history" (cb=40)
00:00:07.708986   LocalInitScript  <string>  = "C:\Users\caev0\Documents\Asistencia\MV\MarshmallowTest\tools\VM/dbgc-init" (cb=74)
00:00:07.708990 
00:00:07.708991 [/DBGF/] (level 1)
00:00:07.708994   Path <string>  = "C:\Users\caev0\Documents\Asistencia\MV\MarshmallowTest\tools\VM/debug/;C:\Users\caev0\Documents\Asistencia\MV\MarshmallowTest\tools\VM/;C:\Users\caev0\" (cb=152)
00:00:07.708998 
00:00:07.708999 [/Devices/] (level 1)
00:00:07.709002 
00:00:07.709003 [/Devices/8237A/] (level 2)
00:00:07.709006 
00:00:07.709008 [/Devices/8237A/0/] (level 3)
00:00:07.709012   Trusted <integer> = 0x0000000000000001 (1)
00:00:07.709015 
00:00:07.709016 [/Devices/GIMDev/] (level 2)
00:00:07.709019 
00:00:07.709020 [/Devices/GIMDev/0/] (level 3)
00:00:07.709024   Trusted <integer> = 0x0000000000000001 (1)
00:00:07.709026 
00:00:07.709027 [/Devices/VMMDev/] (level 2)
00:00:07.709030 
00:00:07.709031 [/Devices/VMMDev/0/] (level 3)
00:00:07.709036   PCIBusNo      <integer> = 0x0000000000000000 (0)
00:00:07.709039   PCIDeviceNo   <integer> = 0x0000000000000004 (4)
00:00:07.709042   PCIFunctionNo <integer> = 0x0000000000000000 (0)
00:00:07.709045   Trusted       <integer> = 0x0000000000000001 (1)
00:00:07.709048 
00:00:07.709049 [/Devices/VMMDev/0/Config/] (level 4)
00:00:07.709053   GuestCoreDumpDir <string>  = "C:\Users\caev0\Documents\Asistencia\MV\MarshmallowTest\tools\VM\Snapshots" (cb=74)
00:00:07.709056 
00:00:07.709057 [/Devices/VMMDev/0/LUN#0/] (level 4)
00:00:07.709061   Driver <string>  = "HGCM" (cb=5)
00:00:07.709064 
00:00:07.709065 [/Devices/VMMDev/0/LUN#0/Config/] (level 5)
00:00:07.709069   Object <integer> = 0x00000000045cc880 (73 189 504)
00:00:07.709074 
00:00:07.709076 [/Devices/VMMDev/0/LUN#999/] (level 4)
00:00:07.709080   Driver <string>  = "MainStatus" (cb=11)
00:00:07.709082 
00:00:07.709083 [/Devices/VMMDev/0/LUN#999/Config/] (level 5)
00:00:07.709088   First   <integer> = 0x0000000000000000 (0)
00:00:07.709091   Last    <integer> = 0x0000000000000000 (0)
00:00:07.709093   papLeds <integer> = 0x00000000043c47c8 (71 059 400)
00:00:07.709098 
00:00:07.709099 [/Devices/acpi/] (level 2)
00:00:07.709102 
00:00:07.709103 [/Devices/acpi/0/] (level 3)
00:00:07.709107   PCIBusNo      <integer> = 0x0000000000000000 (0)
00:00:07.709111   PCIDeviceNo   <integer> = 0x0000000000000007 (7)
00:00:07.709114   PCIFunctionNo <integer> = 0x0000000000000000 (0)
00:00:07.709117   Trusted       <integer> = 0x0000000000000001 (1)
00:00:07.709120 
00:00:07.709121 [/Devices/acpi/0/Config/] (level 4)
00:00:07.709127   CpuHotPlug          <integer> = 0x0000000000000000 (0)
00:00:07.709131   FdcEnabled          <integer> = 0x0000000000000000 (0)
00:00:07.709134   HostBusPciAddress   <integer> = 0x0000000000000000 (0)
00:00:07.709137   HpetEnabled         <integer> = 0x0000000000000000 (0)
00:00:07.709140   IOAPIC              <integer> = 0x0000000000000000 (0)
00:00:07.709143   IocPciAddress       <integer> = 0x0000000000010000 (65 536)
00:00:07.709147   NumCPUs             <integer> = 0x0000000000000001 (1)
00:00:07.709151   Parallel0IoPortBase <integer> = 0x0000000000000000 (0)
00:00:07.709154   Parallel0Irq        <integer> = 0x0000000000000000 (0)
00:00:07.709157   Parallel1IoPortBase <integer> = 0x0000000000000000 (0)
00:00:07.709160   Parallel1Irq        <integer> = 0x0000000000000000 (0)
00:00:07.709163   Serial0IoPortBase   <integer> = 0x0000000000000000 (0)
00:00:07.709166   Serial0Irq          <integer> = 0x0000000000000000 (0)
00:00:07.709169   Serial1IoPortBase   <integer> = 0x0000000000000000 (0)
00:00:07.709172   Serial1Irq          <integer> = 0x0000000000000000 (0)
00:00:07.709175   ShowCpu             <integer> = 0x0000000000000000 (0)
00:00:07.709178   ShowRtc             <integer> = 0x0000000000000000 (0)
00:00:07.709181   SmcEnabled          <integer> = 0x0000000000000000 (0)
00:00:07.709184 
00:00:07.709185 [/Devices/acpi/0/LUN#0/] (level 4)
00:00:07.709189   Driver <string>  = "ACPIHost" (cb=9)
00:00:07.709192 
00:00:07.709193 [/Devices/acpi/0/LUN#0/Config/] (level 5)
00:00:07.709198 
00:00:07.709199 [/Devices/ahci/] (level 2)
00:00:07.709203 
00:00:07.709204 [/Devices/ahci/0/] (level 3)
00:00:07.709208   PCIBusNo      <integer> = 0x0000000000000000 (0)
00:00:07.709211   PCIDeviceNo   <integer> = 0x000000000000000d (13)
00:00:07.709214   PCIFunctionNo <integer> = 0x0000000000000000 (0)
00:00:07.709217   Trusted       <integer> = 0x0000000000000001 (1)
00:00:07.709219 
00:00:07.709220 [/Devices/ahci/0/Config/] (level 4)
00:00:07.709224   Bootable  <integer> = 0x0000000000000001 (1)
00:00:07.709227   PortCount <integer> = 0x0000000000000001 (1)
00:00:07.709230 
00:00:07.709231 [/Devices/ahci/0/Config/Port0/] (level 5)
00:00:07.709235   Hotpluggable        <integer> = 0x0000000000000000 (0)
00:00:07.709238   NonRotationalMedium <integer> = 0x0000000000000000 (0)
00:00:07.709241 
00:00:07.709242 [/Devices/ahci/0/LUN#0/] (level 4)
00:00:07.709246   Driver <string>  = "VD" (cb=3)
00:00:07.709248 
00:00:07.709250 [/Devices/ahci/0/LUN#0/Config/] (level 5)
00:00:07.709254   BlockCache <integer> = 0x0000000000000001 (1)
00:00:07.709257   Format     <string>  = "VDI" (cb=4)
00:00:07.709259   Mountable  <integer> = 0x0000000000000000 (0)
00:00:07.709266   Path       <string>  = "C:\Users\caev0\Documents\Asistencia\MV\MarshmallowTest\tools\VM\Marshmallow.vdi" (cb=80)
00:00:07.709269   Type       <string>  = "HardDisk" (cb=9)
00:00:07.709272   UseNewIo   <integer> = 0x0000000000000001 (1)
00:00:07.709275 
00:00:07.709276 [/Devices/ahci/0/LUN#999/] (level 4)
00:00:07.709280   Driver <string>  = "MainStatus" (cb=11)
00:00:07.709282 
00:00:07.709283 [/Devices/ahci/0/LUN#999/Config/] (level 5)
00:00:07.709288   DeviceInstance        <string>  = "ahci/0" (cb=7)
00:00:07.709291   First                 <integer> = 0x0000000000000000 (0)
00:00:07.709294   Last                  <integer> = 0x0000000000000000 (0)
00:00:07.709298   pConsole              <integer> = 0x00000000043c3fc0 (71 057 344)
00:00:07.709302   papLeds               <integer> = 0x00000000043c43c8 (71 058 376)
00:00:07.709307   pmapMediumAttachments <integer> = 0x00000000043c47e8 (71 059 432)
00:00:07.709311 
00:00:07.709312 [/Devices/apic/] (level 2)
00:00:07.709316 
00:00:07.709317 [/Devices/apic/0/] (level 3)
00:00:07.709321   Trusted <integer> = 0x0000000000000001 (1)
00:00:07.709324 
00:00:07.709325 [/Devices/apic/0/Config/] (level 4)
00:00:07.709329   IOAPIC  <integer> = 0x0000000000000000 (0)
00:00:07.709332   Mode    <integer> = 0x0000000000000003 (3)
00:00:07.709334   NumCPUs <integer> = 0x0000000000000001 (1)
00:00:07.709337 
00:00:07.709338 [/Devices/e1000/] (level 2)
00:00:07.709342 
00:00:07.709343 [/Devices/e1000/0/] (level 3)
00:00:07.709346   PCIBusNo      <integer> = 0x0000000000000000 (0)
00:00:07.709349   PCIDeviceNo   <integer> = 0x0000000000000003 (3)
00:00:07.709352   PCIFunctionNo <integer> = 0x0000000000000000 (0)
00:00:07.709355   Trusted       <integer> = 0x0000000000000001 (1)
00:00:07.709357 
00:00:07.709358 [/Devices/e1000/0/Config/] (level 4)
00:00:07.709362   AdapterType    <integer> = 0x0000000000000000 (0)
00:00:07.709365   CableConnected <integer> = 0x0000000000000001 (1)
00:00:07.709368   LineSpeed      <integer> = 0x0000000000000000 (0)
00:00:07.709371   MAC            <bytes>   = "08 00 27 8e 5b 11" (cb=6)
00:00:07.709376 
00:00:07.709377 [/Devices/e1000/0/LUN#0/] (level 4)
00:00:07.709382   Driver <string>  = "NAT" (cb=4)
00:00:07.709384 
00:00:07.709385 [/Devices/e1000/0/LUN#0/Config/] (level 5)
00:00:07.709391   AliasMode       <integer> = 0x0000000000000000 (0)
00:00:07.709394   BootFile        <string>  = "Marsmallow.pxe" (cb=15)
00:00:07.709397   DNSProxy        <integer> = 0x0000000000000000 (0)
00:00:07.709400   Network         <string>  = "10.0.2.0/24" (cb=12)
00:00:07.709403   PassDomain      <integer> = 0x0000000000000001 (1)
00:00:07.709406   TFTPPrefix      <string>  = "C:\Users\caev0\.VirtualBox\TFTP" (cb=32)
00:00:07.709409   UseHostResolver <integer> = 0x0000000000000000 (0)
00:00:07.709412 
00:00:07.709413 [/Devices/e1000/0/LUN#999/] (level 4)
00:00:07.709417   Driver <string>  = "MainStatus" (cb=11)
00:00:07.709419 
00:00:07.709420 [/Devices/e1000/0/LUN#999/Config/] (level 5)
00:00:07.709425   First   <integer> = 0x0000000000000000 (0)
00:00:07.709427   Last    <integer> = 0x0000000000000000 (0)
00:00:07.709430   papLeds <integer> = 0x00000000043c46a8 (71 059 112)
00:00:07.709434 
00:00:07.709435 [/Devices/i8254/] (level 2)
00:00:07.709438 
00:00:07.709440 [/Devices/i8254/0/] (level 3)
00:00:07.709443 
00:00:07.709444 [/Devices/i8254/0/Config/] (level 4)
00:00:07.709448 
00:00:07.709449 [/Devices/i8259/] (level 2)
00:00:07.709452 
00:00:07.709453 [/Devices/i8259/0/] (level 3)
00:00:07.709457   Trusted <integer> = 0x0000000000000001 (1)
00:00:07.709460 
00:00:07.709461 [/Devices/i8259/0/Config/] (level 4)
00:00:07.709465 
00:00:07.709466 [/Devices/ichac97/] (level 2)
00:00:07.709469 
00:00:07.709470 [/Devices/ichac97/0/] (level 3)
00:00:07.709474   PCIBusNo      <integer> = 0x0000000000000000 (0)
00:00:07.709477   PCIDeviceNo   <integer> = 0x0000000000000005 (5)
00:00:07.709479   PCIFunctionNo <integer> = 0x0000000000000000 (0)
00:00:07.709482   Trusted       <integer> = 0x0000000000000001 (1)
00:00:07.709485 
00:00:07.709486 [/Devices/ichac97/0/AudioConfig/] (level 4)
00:00:07.709490 
00:00:07.709491 [/Devices/ichac97/0/Config/] (level 4)
00:00:07.709495   Codec <string>  = "AD1980" (cb=7)
00:00:07.709497 
00:00:07.709499 [/Devices/ichac97/0/LUN#0/] (level 4)
00:00:07.709502   Driver <string>  = "AUDIO" (cb=6)
00:00:07.709505 
00:00:07.709506 [/Devices/ichac97/0/LUN#0/AttachedDriver/] (level 5)
00:00:07.709510   Driver <string>  = "DSoundAudio" (cb=12)
00:00:07.709513 
00:00:07.709514 [/Devices/ichac97/0/LUN#0/AttachedDriver/Config/] (level 6)
00:00:07.709519   StreamName <string>  = "Marsmallow" (cb=11)
00:00:07.709521 
00:00:07.709522 [/Devices/ichac97/0/LUN#0/Config/] (level 5)
00:00:07.709527 
00:00:07.709528 [/Devices/ichac97/0/LUN#1/] (level 4)
00:00:07.709531   Driver <string>  = "AUDIO" (cb=6)
00:00:07.709534 
00:00:07.709535 [/Devices/ichac97/0/LUN#1/AttachedDriver/] (level 5)
00:00:07.709539   Driver <string>  = "AudioVRDE" (cb=10)
00:00:07.709541 
00:00:07.709542 [/Devices/ichac97/0/LUN#1/AttachedDriver/Config/] (level 6)
00:00:07.709547   AudioDriver      <string>  = "AudioVRDE" (cb=10)
00:00:07.709550   Object           <integer> = 0x00000000024b5b40 (38 492 992)
00:00:07.709555   ObjectVRDPServer <integer> = 0x00000000043c67d0 (71 067 600)
00:00:07.709559   StreamName       <string>  = "Marsmallow" (cb=11)
00:00:07.709561 
00:00:07.709562 [/Devices/mc146818/] (level 2)
00:00:07.709566 
00:00:07.709567 [/Devices/mc146818/0/] (level 3)
00:00:07.709571 
00:00:07.709572 [/Devices/mc146818/0/Config/] (level 4)
00:00:07.709576   UseUTC <integer> = 0x0000000000000001 (1)
00:00:07.709578 
00:00:07.709579 [/Devices/parallel/] (level 2)
00:00:07.709582 
00:00:07.709583 [/Devices/pcarch/] (level 2)
00:00:07.709587 
00:00:07.709588 [/Devices/pcarch/0/] (level 3)
00:00:07.709591   Trusted <integer> = 0x0000000000000001 (1)
00:00:07.709594 
00:00:07.709595 [/Devices/pcarch/0/Config/] (level 4)
00:00:07.709599 
00:00:07.709600 [/Devices/pcbios/] (level 2)
00:00:07.709603 
00:00:07.709604 [/Devices/pcbios/0/] (level 3)
00:00:07.709608   Trusted <integer> = 0x0000000000000001 (1)
00:00:07.709610 
00:00:07.709611 [/Devices/pcbios/0/Config/] (level 4)
00:00:07.709617   APIC               <integer> = 0x0000000000000001 (1)
00:00:07.709620   BootDevice0        <string>  = "FLOPPY" (cb=7)
00:00:07.709623   BootDevice1        <string>  = "DVD" (cb=4)
00:00:07.709626   BootDevice2        <string>  = "IDE" (cb=4)
00:00:07.709629   BootDevice3        <string>  = "NONE" (cb=5)
00:00:07.709632   FloppyDevice       <string>  = "i82078" (cb=7)
00:00:07.709634   HardDiskDevice     <string>  = "piix3ide" (cb=9)
00:00:07.709637   IOAPIC             <integer> = 0x0000000000000000 (0)
00:00:07.709640   McfgBase           <integer> = 0x0000000000000000 (0)
00:00:07.709644   McfgLength         <integer> = 0x0000000000000000 (0)
00:00:07.709647   NumCPUs            <integer> = 0x0000000000000001 (1)
00:00:07.709650   PXEDebug           <integer> = 0x0000000000000000 (0)
00:00:07.709653   SataHardDiskDevice <string>  = "ahci" (cb=5)
00:00:07.709655   SataLUN1           <integer> = 0x0000000000000000 (0)
00:00:07.709658   UUID               <bytes>   = "fe 13 a6 33 ad c5 fc 4a 99 16 1c e3 79 ac 17 cd" (cb=16)
00:00:07.709667 
00:00:07.709668 [/Devices/pcbios/0/Config/NetBoot/] (level 5)
00:00:07.709673 
00:00:07.709674 [/Devices/pcbios/0/Config/NetBoot/0/] (level 6)
00:00:07.709679   NIC           <integer> = 0x0000000000000000 (0)
00:00:07.709682   PCIBusNo      <integer> = 0x0000000000000000 (0)
00:00:07.709685   PCIDeviceNo   <integer> = 0x0000000000000003 (3)
00:00:07.709687   PCIFunctionNo <integer> = 0x0000000000000000 (0)
00:00:07.709690 
00:00:07.709691 [/Devices/pci/] (level 2)
00:00:07.709694 
00:00:07.709695 [/Devices/pci/0/] (level 3)
00:00:07.709699   Trusted <integer> = 0x0000000000000001 (1)
00:00:07.709701 
00:00:07.709703 [/Devices/pci/0/Config/] (level 4)
00:00:07.709706   IOAPIC <integer> = 0x0000000000000000 (0)
00:00:07.709709 
00:00:07.709710 [/Devices/pckbd/] (level 2)
00:00:07.709713 
00:00:07.709714 [/Devices/pckbd/0/] (level 3)
00:00:07.709718   Trusted <integer> = 0x0000000000000001 (1)
00:00:07.709721 
00:00:07.709722 [/Devices/pckbd/0/Config/] (level 4)
00:00:07.709726 
00:00:07.709727 [/Devices/pckbd/0/LUN#0/] (level 4)
00:00:07.709730   Driver <string>  = "KeyboardQueue" (cb=14)
00:00:07.709733 
00:00:07.709734 [/Devices/pckbd/0/LUN#0/AttachedDriver/] (level 5)
00:00:07.709739   Driver <string>  = "MainKeyboard" (cb=13)
00:00:07.709741 
00:00:07.709742 [/Devices/pckbd/0/LUN#0/AttachedDriver/Config/] (level 6)
00:00:07.709747   Object <integer> = 0x00000000024a21a0 (38 412 704)
00:00:07.709751 
00:00:07.709752 [/Devices/pckbd/0/LUN#0/Config/] (level 5)
00:00:07.709756   QueueSize <integer> = 0x0000000000000040 (64)
00:00:07.709762 
00:00:07.709763 [/Devices/pckbd/0/LUN#1/] (level 4)
00:00:07.709767   Driver <string>  = "MouseQueue" (cb=11)
00:00:07.709769 
00:00:07.709770 [/Devices/pckbd/0/LUN#1/AttachedDriver/] (level 5)
00:00:07.709775   Driver <string>  = "MainMouse" (cb=10)
00:00:07.709777 
00:00:07.709778 [/Devices/pckbd/0/LUN#1/AttachedDriver/Config/] (level 6)
00:00:07.709783   Object <integer> = 0x000000000251bbf0 (38 910 960)
00:00:07.709787 
00:00:07.709788 [/Devices/pckbd/0/LUN#1/Config/] (level 5)
00:00:07.709793   QueueSize <integer> = 0x0000000000000080 (128)
00:00:07.709796 
00:00:07.709797 [/Devices/pcnet/] (level 2)
00:00:07.709800 
00:00:07.709801 [/Devices/piix3ide/] (level 2)
00:00:07.709805 
00:00:07.709806 [/Devices/piix3ide/0/] (level 3)
00:00:07.709810   PCIBusNo      <integer> = 0x0000000000000000 (0)
00:00:07.709813   PCIDeviceNo   <integer> = 0x0000000000000001 (1)
00:00:07.709815   PCIFunctionNo <integer> = 0x0000000000000001 (1)
00:00:07.709818   Trusted       <integer> = 0x0000000000000001 (1)
00:00:07.709821 
00:00:07.709822 [/Devices/piix3ide/0/Config/] (level 4)
00:00:07.709826   Type <string>  = "PIIX4" (cb=6)
00:00:07.709829 
00:00:07.709830 [/Devices/piix3ide/0/Config/SecondaryMaster/] (level 5)
00:00:07.709834   NonRotationalMedium <integer> = 0x0000000000000000 (0)
00:00:07.709837 
00:00:07.709838 [/Devices/piix3ide/0/LUN#2/] (level 4)
00:00:07.709843   Driver <string>  = "VD" (cb=3)
00:00:07.709845 
00:00:07.709846 [/Devices/piix3ide/0/LUN#2/Config/] (level 5)
00:00:07.709851   EmptyDrive <integer> = 0x0000000000000001 (1)
00:00:07.709854   Mountable  <integer> = 0x0000000000000001 (1)
00:00:07.709857   Type       <string>  = "DVD" (cb=4)
00:00:07.709860 
00:00:07.709861 [/Devices/piix3ide/0/LUN#999/] (level 4)
00:00:07.709865   Driver <string>  = "MainStatus" (cb=11)
00:00:07.709867 
00:00:07.709868 [/Devices/piix3ide/0/LUN#999/Config/] (level 5)
00:00:07.709873   DeviceInstance        <string>  = "piix3ide/0" (cb=11)
00:00:07.709876   First                 <integer> = 0x0000000000000000 (0)
00:00:07.709879   Last                  <integer> = 0x0000000000000003 (3)
00:00:07.709882   pConsole              <integer> = 0x00000000043c3fc0 (71 057 344)
00:00:07.709887   papLeds               <integer> = 0x00000000043c43a8 (71 058 344)
00:00:07.709891   pmapMediumAttachments <integer> = 0x00000000043c47e8 (71 059 432)
00:00:07.709895 
00:00:07.709896 [/Devices/serial/] (level 2)
00:00:07.709899 
00:00:07.709900 [/Devices/usb-ohci/] (level 2)
00:00:07.709904 
00:00:07.709905 [/Devices/usb-ohci/0/] (level 3)
00:00:07.709908   PCIBusNo      <integer> = 0x0000000000000000 (0)
00:00:07.709911   PCIDeviceNo   <integer> = 0x0000000000000006 (6)
00:00:07.709914   PCIFunctionNo <integer> = 0x0000000000000000 (0)
00:00:07.709917   Trusted       <integer> = 0x0000000000000001 (1)
00:00:07.709920 
00:00:07.709921 [/Devices/usb-ohci/0/Config/] (level 4)
00:00:07.709925 
00:00:07.709926 [/Devices/usb-ohci/0/LUN#0/] (level 4)
00:00:07.709930   Driver <string>  = "VUSBRootHub" (cb=12)
00:00:07.709933 
00:00:07.709934 [/Devices/usb-ohci/0/LUN#0/Config/] (level 5)
00:00:07.709938 
00:00:07.709939 [/Devices/usb-ohci/0/LUN#999/] (level 4)
00:00:07.709943   Driver <string>  = "MainStatus" (cb=11)
00:00:07.709945 
00:00:07.709946 [/Devices/usb-ohci/0/LUN#999/Config/] (level 5)
00:00:07.709951   First   <integer> = 0x0000000000000000 (0)
00:00:07.709953   Last    <integer> = 0x0000000000000000 (0)
00:00:07.709956   papLeds <integer> = 0x00000000043c47d0 (71 059 408)
00:00:07.709960 
00:00:07.709961 [/Devices/vga/] (level 2)
00:00:07.709964 
00:00:07.709965 [/Devices/vga/0/] (level 3)
00:00:07.709969   PCIBusNo      <integer> = 0x0000000000000000 (0)
00:00:07.709971   PCIDeviceNo   <integer> = 0x0000000000000002 (2)
00:00:07.709974   PCIFunctionNo <integer> = 0x0000000000000000 (0)
00:00:07.709977   Trusted       <integer> = 0x0000000000000001 (1)
00:00:07.709980 
00:00:07.709981 [/Devices/vga/0/Config/] (level 4)
00:00:07.709985   CustomVideoModes <integer> = 0x0000000000000000 (0)
00:00:07.709988   FadeIn           <integer> = 0x0000000000000001 (1)
00:00:07.709991   FadeOut          <integer> = 0x0000000000000001 (1)
00:00:07.709994   HeightReduction  <integer> = 0x0000000000000000 (0)
00:00:07.709996   LogoFile         <string>  = "" (cb=1)
00:00:07.709999   LogoTime         <integer> = 0x0000000000000000 (0)
00:00:07.710002   MonitorCount     <integer> = 0x0000000000000001 (1)
00:00:07.710005   ShowBootMenu     <integer> = 0x0000000000000002 (2)
00:00:07.710008   VRamSize         <integer> = 0x0000000001000000 (16 777 216, 16 MB)
00:00:07.710013 
00:00:07.710014 [/Devices/vga/0/LUN#0/] (level 4)
00:00:07.710018   Driver <string>  = "MainDisplay" (cb=12)
00:00:07.710020 
00:00:07.710021 [/Devices/vga/0/LUN#0/Config/] (level 5)
00:00:07.710025   Object <integer> = 0x000000000251bfe0 (38 911 968)
00:00:07.710029 
00:00:07.710030 [/Devices/vga/0/LUN#999/] (level 4)
00:00:07.710034   Driver <string>  = "MainStatus" (cb=11)
00:00:07.710036 
00:00:07.710037 [/Devices/vga/0/LUN#999/Config/] (level 5)
00:00:07.710042   First   <integer> = 0x0000000000000000 (0)
00:00:07.710044   Last    <integer> = 0x0000000000000000 (0)
00:00:07.710047   papLeds <integer> = 0x00000000043c47e0 (71 059 424)
00:00:07.710050 
00:00:07.710052 [/Devices/virtio-net/] (level 2)
00:00:07.710055 
00:00:07.710056 [/EM/] (level 1)
00:00:07.710059   TripleFaultReset <integer> = 0x0000000000000000 (0)
00:00:07.710062 
00:00:07.710063 [/GIM/] (level 1)
00:00:07.710066   Provider <string>  = "KVM" (cb=4)
00:00:07.710068 
00:00:07.710069 [/HM/] (level 1)
00:00:07.710072   64bitEnabled       <integer> = 0x0000000000000000 (0)
00:00:07.710075   EnableLargePages   <integer> = 0x0000000000000001 (1)
00:00:07.710078   EnableNestedPaging <integer> = 0x0000000000000001 (1)
00:00:07.710081   EnableUX           <integer> = 0x0000000000000001 (1)
00:00:07.710084   EnableVPID         <integer> = 0x0000000000000001 (1)
00:00:07.710087   Exclusive          <integer> = 0x0000000000000000 (0)
00:00:07.710090   HMForced           <integer> = 0x0000000000000000 (0)
00:00:07.710093 
00:00:07.710094 [/MM/] (level 1)
00:00:07.710097   CanUseLargerHeap <integer> = 0x0000000000000000 (0)
00:00:07.710099 
00:00:07.710100 [/PDM/] (level 1)
00:00:07.710103 
00:00:07.710104 [/PDM/AsyncCompletion/] (level 2)
00:00:07.710107 
00:00:07.710108 [/PDM/AsyncCompletion/File/] (level 3)
00:00:07.710112 
00:00:07.710113 [/PDM/AsyncCompletion/File/BwGroups/] (level 4)
00:00:07.710117 
00:00:07.710118 [/PDM/BlkCache/] (level 2)
00:00:07.710121   CacheSize <integer> = 0x0000000000500000 (5 242 880, 5 MB)
00:00:07.710126 
00:00:07.710128 [/PDM/Devices/] (level 2)
00:00:07.710130 
00:00:07.710131 [/PDM/Drivers/] (level 2)
00:00:07.710134 
00:00:07.710135 [/PDM/Drivers/VBoxC/] (level 3)
00:00:07.710139   Path <string>  = "VBoxC" (cb=6)
00:00:07.710141 
00:00:07.710142 [/PDM/NetworkShaper/] (level 2)
00:00:07.710146 
00:00:07.710147 [/PDM/NetworkShaper/BwGroups/] (level 3)
00:00:07.710151 
00:00:07.710152 [/TM/] (level 1)
00:00:07.710154   UTCOffset <integer> = 0x0000000000000000 (0)
00:00:07.710157 
00:00:07.710158 [/USB/] (level 1)
00:00:07.710161 
00:00:07.710162 [/USB/HidMouse/] (level 2)
00:00:07.710165 
00:00:07.710166 [/USB/HidMouse/0/] (level 3)
00:00:07.710169 
00:00:07.710170 [/USB/HidMouse/0/Config/] (level 4)
00:00:07.710174   Mode <string>  = "absolute" (cb=9)
00:00:07.710176 
00:00:07.710177 [/USB/HidMouse/0/LUN#0/] (level 4)
00:00:07.710181   Driver <string>  = "MouseQueue" (cb=11)
00:00:07.710184 
00:00:07.710185 [/USB/HidMouse/0/LUN#0/AttachedDriver/] (level 5)
00:00:07.710189   Driver <string>  = "MainMouse" (cb=10)
00:00:07.710191 
00:00:07.710192 [/USB/HidMouse/0/LUN#0/AttachedDriver/Config/] (level 6)
00:00:07.710197   Object <integer> = 0x000000000251bbf0 (38 910 960)
00:00:07.710201 
00:00:07.710202 [/USB/HidMouse/0/LUN#0/Config/] (level 5)
00:00:07.710206   QueueSize <integer> = 0x0000000000000080 (128)
00:00:07.710209 
00:00:07.710211 [/USB/USBProxy/] (level 2)
00:00:07.710214 
00:00:07.710215 [/USB/USBProxy/GlobalConfig/] (level 3)
00:00:07.710218 
00:00:07.710220 ********************* End of CFGM dump **********************
00:00:07.710237 VM: fHMEnabled=true  (configured) fRecompileUser=false fRecompileSupervisor=false
00:00:07.710242 VM: fRawRing1Enabled=false CSAM=true  PATM=true 
00:00:07.710560 HM: HMR3Init: VT-x w/ nested paging and unrestricted guest execution hw support
00:00:07.710688 MM: cbHyperHeap=0x100000 (1048576)
00:00:07.713458 CPUM: fXStateHostMask=0x7; initial: 0x7; host XCR0=0x7
00:00:07.716020 CPUM: Matched host CPU INTEL 0x6/0x2a/0x7 Intel_Core7_SandyBridge with CPU DB entry 'Intel Core i7-2635QM' (INTEL 0x6/0x2a/0x7 Intel_Core7_SandyBridge)
00:00:07.716235 CPUM: VCPU  0: Cached APIC base MSR = 0x0
00:00:07.718813 PGM: HCPhysInterPD=00000000c9fe1000 HCPhysInterPaePDPT=00000000c9fda000 HCPhysInterPaePML4=00000000c9fd8000
00:00:07.718849 PGM: apInterPTs={00000000c9fe0000,00000000c9fdb000} apInterPaePTs={000000006110c000,000000008750d000} apInterPaePDs={000000008ab0e000,000000011d80f000,000000008af10000,000000019ec11000} pInterPaePDPT64=00000000c9fd9000
00:00:07.718875 PGM: Host paging mode: AMD64+PGE+NX
00:00:07.718899 PGM: PGMPool: cMaxPages=288 (u64MaxPages=288)
00:00:07.718915 PGM: pgmR3PoolInit: cMaxPages=0x120 cMaxUsers=0x240 cMaxPhysExts=0x240 fCacheEnable=true 
00:00:07.744070 TM: GIP - u32Mode=3 (Invariant) u32UpdateHz=93 u32UpdateIntervalNS=10752500 enmUseTscDelta=2 (Pratically Zero) fGetGipCpu=0xb cCpus=8
00:00:07.744153 TM: GIP - u64CpuHz=2 195 012 481 (0x82d53b81)  SUPGetCpuHzFromGip => 2 195 012 481
00:00:07.744189 TM: GIP - CPU: iCpuSet=0x0 idCpu=0x0 idApic=0x0 iGipCpu=0x0 i64TSCDelta=0 enmState=3 u64CpuHz=2195012481(*) cErrors=0
00:00:07.744221 TM: GIP - CPU: iCpuSet=0x1 idCpu=0x1 idApic=0x1 iGipCpu=0x4 i64TSCDelta=0 enmState=3 u64CpuHz=2195012178(*) cErrors=0
00:00:07.744248 TM: GIP - CPU: iCpuSet=0x2 idCpu=0x2 idApic=0x2 iGipCpu=0x1 i64TSCDelta=0 enmState=3 u64CpuHz=2195034710(*) cErrors=0
00:00:07.744273 TM: GIP - CPU: iCpuSet=0x3 idCpu=0x3 idApic=0x3 iGipCpu=0x3 i64TSCDelta=0 enmState=3 u64CpuHz=2195011297(*) cErrors=0
00:00:07.744295 TM: GIP - CPU: iCpuSet=0x4 idCpu=0x4 idApic=0x4 iGipCpu=0x7 i64TSCDelta=0 enmState=3 u64CpuHz=2195012305(*) cErrors=0
00:00:07.744318 TM: GIP - CPU: iCpuSet=0x5 idCpu=0x5 idApic=0x5 iGipCpu=0x5 i64TSCDelta=0 enmState=3 u64CpuHz=2195012239(*) cErrors=0
00:00:07.744342 TM: GIP - CPU: iCpuSet=0x6 idCpu=0x6 idApic=0x6 iGipCpu=0x6 i64TSCDelta=0 enmState=3 u64CpuHz=2195012380(*) cErrors=0
00:00:07.744540 TM: GIP - CPU: iCpuSet=0x7 idCpu=0x7 idApic=0x7 iGipCpu=0x2 i64TSCDelta=0 enmState=3 u64CpuHz=2195008314(*) cErrors=0
00:00:07.744770 TM: cTSCTicksPerSecond=2 195 012 481 (0x82d53b81) enmTSCMode=3 (Dynamic)
00:00:07.744780 TM: TSCTiedToExecution=false TSCNotTiedToHalt=false
00:00:07.746552 VMM: CoreCode: R3=000000000bf60000 R0=ffff8c80ff9d3000 RC=a0351000 Phys=00000000c9f97000 cb=0x1000
00:00:07.747494 IEM: TargetCpu=CURRENT, Microarch=Intel_Core7_SandyBridge
00:00:07.747788 GIM: Using provider 'KVM' (Implementation version: 0)
00:00:07.747844 CPUM: SetGuestCpuIdFeature: Enabled Hypervisor Present bit
00:00:07.748100 AIOMgr: Default manager type is 'Async'
00:00:07.748126 AIOMgr: Default file backend is 'NonBuffered'
00:00:07.748671 BlkCache: Cache successfully initialized. Cache size is 5242880 bytes
00:00:07.748706 BlkCache: Cache commit interval is 10000 ms
00:00:07.748727 BlkCache: Cache commit threshold is 2621440 bytes
00:00:09.323323 PcBios: [SMP] BIOS with 1 CPUs
00:00:09.323401 PcBios: Using the 386+ BIOS image.
00:00:09.327438 PcBios: fCheckShutdownStatusForSoftReset=true   fClearShutdownStatusOnHardReset=true 
00:00:09.368016 SUP: Loaded VBoxDDR0.r0 (C:\Program Files\Oracle\VirtualBox\VBoxDDR0.r0) at 0xfffff803f28e0000 - ModuleInit at 0000000000000000 and ModuleTerm at 0000000000000000 using the native ring-0 loader
00:00:09.368067 SUP: windbg> .reload /f C:\Program Files\Oracle\VirtualBox\VBoxDDR0.r0=0xfffff803f28e0000
00:00:09.370084 CPUM: SetGuestCpuIdFeature: Enabled xAPIC
00:00:09.370114 CPUM: SetGuestCpuIdFeature: Enabled x2APIC
00:00:09.371099 PIT: mode=3 count=0x10000 (65536) - 18.20 Hz (ch=0)
00:00:09.404561 Shared Folders service loaded
00:00:09.417555 VGA: Using the 386+ BIOS image.
00:00:09.421735 DrvVD: Flushes will be ignored
00:00:09.421773 DrvVD: Async flushes will be passed to the disk
00:00:09.422577 VD: VDInit finished
00:00:09.427150 AIOMgr: Endpoint for file 'C:\Users\caev0\Documents\Asistencia\MV\MarshmallowTest\tools\VM\Marshmallow.vdi' (flags 000c0723) created successfully
00:00:09.475269 VD: Opening the disk took 53452923 ns
00:00:09.475435 AHCI: LUN#0: disk, PCHS=16383/16/63, total number of sectors 209715200
00:00:09.475472 AHCI: LUN#0: using async I/O
00:00:09.476210 AHCI#0: Reset the HBA
00:00:09.476992 PIIX3 ATA: LUN#0: no unit
00:00:09.477025 PIIX3 ATA: LUN#1: no unit
00:00:09.477186 DrvVD: Flushes will be ignored
00:00:09.477209 DrvVD: Async flushes will be passed to the disk
00:00:09.477578 PIIX3 ATA: LUN#2: CD/DVD, total number of sectors 0, passthrough disabled
00:00:09.477619 PIIX3 ATA: LUN#3: no unit
00:00:09.477722 PIIX3 ATA: Ctl#0: finished processing RESET
00:00:09.477801 PIIX3 ATA: Ctl#1: finished processing RESET
00:00:09.478014 E1000#0 Chip=82540EM LinkUpDelay=5000ms EthernetCRC=on GSO=enabled Itr=enabled ItrRx=enabled R0=enabled GC=enabled
00:00:09.527267 NAT: Guest address guess set to 10.0.2.15 by initialization
00:00:09.541633 NAT: DNS#0: 157.253.79.100
00:00:09.541687 NAT: DNS#1: 157.253.52.21
00:00:09.543477 Audio: Initializing DirectSound audio driver
00:00:09.543546 Audio: Using VBox 5.0.x audio code!
00:00:09.944686 DSound: Output: GUID: {B06CD78B-B229-4ABC-BFC1-FF3A16DFBB46} [Altavoces (Dispositivo de High Definition Audio)] (Module: {0.0.0.00000000}.{b06cd78b-b229-4abc-bfc1-ff3a16dfbb46})
00:00:10.263042 DSound: Input: GUID: {C6749182-0461-4401-829B-E95133E84425} [Micrófono (Dispositivo de High Definition Audio)] (Module: {0.0.1.00000000}.{c6749182-0461-4401-829b-e95133e84425})
00:00:10.263109 DSound: Found 1 host playback devices
00:00:10.263129 DSound: Found 1 host capturing devices
00:00:10.265025 Audio: Host audio backend supports 1 output streams and 1 input streams at once
00:00:10.265114 Audio: Initializing VRDE driver
00:00:10.265137 Audio: Using VBox 5.0.x audio code!
00:00:10.265164 Audio: Host audio backend supports 1 output streams and 2 input streams at once
00:00:10.265210 AC97: Reset
00:00:10.266800 DSound: Guest "Line In" is using host device with GUID: {Default device}
00:00:10.302850 Audio: Skipping to create input stream "[LUN#0] ac97.mc", as the host audio backend reached its maximum of concurrent audio input streams
00:00:10.324143 VUSB: Attached 'HidMouse' to port 1
00:00:10.324330 PGM: The CPU physical address width is 36 bits
00:00:10.324356 PGM: PGMR3InitFinalize: 4 MB PSE mask 0000000fffffffff
00:00:10.324947 TM: TMR3InitFinalize: fTSCModeSwitchAllowed=true 
00:00:10.405997 VMM: Thread-context hooks unavailable
00:00:10.411193 HM: Using VT-x implementation 2.0
00:00:10.411196 HM: Host CR4                        = 0x406f8
00:00:10.411201 HM: Host EFER                       = 0xd01
00:00:10.411204 HM: MSR_IA32_SMM_MONITOR_CTL        = 0x0
00:00:10.411207 HM: MSR_IA32_FEATURE_CONTROL        = 0x5
00:00:10.411209 HM: MSR_IA32_VMX_BASIC_INFO         = 0xda040000000010
00:00:10.411213 HM:   VMCS id                         = 0x10
00:00:10.411215 HM:   VMCS size                       = 1024 bytes
00:00:10.411218 HM:   VMCS physical address limit     = None
00:00:10.411220 HM:   VMCS memory type                = 0x6
00:00:10.411222 HM:   Dual-monitor treatment support  = true 
00:00:10.411225 HM:   OUTS & INS instruction-info     = true 
00:00:10.411227 HM: Max resume loops                = 1024
00:00:10.411229 HM: MSR_IA32_VMX_PINBASED_CTLS      = 0x7f00000016
00:00:10.411232 HM:   EXT_INT_EXIT
00:00:10.411234 HM:   NMI_EXIT
00:00:10.411235 HM:   VIRTUAL_NMI
00:00:10.411237 HM:   PREEMPT_TIMER
00:00:10.411238 HM:   POSTED_INTR (must be cleared)
00:00:10.411240 HM: MSR_IA32_VMX_PROCBASED_CTLS     = 0xfff9fffe0401e172
00:00:10.411244 HM:   INT_WINDOW_EXIT
00:00:10.411245 HM:   USE_TSC_OFFSETTING
00:00:10.411247 HM:   HLT_EXIT
00:00:10.411248 HM:   INVLPG_EXIT
00:00:10.411249 HM:   MWAIT_EXIT
00:00:10.411251 HM:   RDPMC_EXIT
00:00:10.411252 HM:   RDTSC_EXIT
00:00:10.411253 HM:   CR3_LOAD_EXIT (must be set)
00:00:10.411255 HM:   CR3_STORE_EXIT (must be set)
00:00:10.411257 HM:   CR8_LOAD_EXIT
00:00:10.411258 HM:   CR8_STORE_EXIT
00:00:10.411259 HM:   USE_TPR_SHADOW
00:00:10.411261 HM:   NMI_WINDOW_EXIT
00:00:10.411262 HM:   MOV_DR_EXIT
00:00:10.411264 HM:   UNCOND_IO_EXIT
00:00:10.411265 HM:   USE_IO_BITMAPS
00:00:10.411266 HM:   MONITOR_TRAP_FLAG
00:00:10.411268 HM:   USE_MSR_BITMAPS
00:00:10.411269 HM:   MONITOR_EXIT
00:00:10.411271 HM:   PAUSE_EXIT
00:00:10.411275 HM:   USE_SECONDARY_EXEC_CTRL
00:00:10.411277 HM: MSR_IA32_VMX_PROCBASED_CTLS2    = 0xff00000000
00:00:10.411280 HM:   VIRT_APIC
00:00:10.411282 HM:   EPT
00:00:10.411283 HM:   DESCRIPTOR_TABLE_EXIT
00:00:10.411285 HM:   RDTSCP
00:00:10.411286 HM:   VIRT_X2APIC
00:00:10.411288 HM:   VPID
00:00:10.411292 HM:   WBINVD_EXIT
00:00:10.411294 HM:   UNRESTRICTED_GUEST
00:00:10.411296 HM:   APIC_REG_VIRT (must be cleared)
00:00:10.411297 HM:   VIRT_INTR_DELIVERY (must be cleared)
00:00:10.411299 HM:   PAUSE_LOOP_EXIT (must be cleared)
00:00:10.411300 HM:   RDRAND_EXIT (must be cleared)
00:00:10.411302 HM:   INVPCID (must be cleared)
00:00:10.411303 HM:   VMFUNC (must be cleared)
00:00:10.411305 HM:   VMCS_SHADOWING (must be cleared)
00:00:10.411306 HM:   ENCLS_EXIT (must be cleared)
00:00:10.411308 HM:   RDSEED_EXIT (must be cleared)
00:00:10.411309 HM:   PML (must be cleared)
00:00:10.411311 HM:   EPT_VE (must be cleared)
00:00:10.411312 HM:   CONCEAL_FROM_PT (must be cleared)
00:00:10.411314 HM:   XSAVES_XRSTORS (must be cleared)
00:00:10.411315 HM:   TSC_SCALING (must be cleared)
00:00:10.411317 HM: MSR_IA32_VMX_ENTRY_CTLS         = 0xffff000011ff
00:00:10.411320 HM:   LOAD_DEBUG (must be set)
00:00:10.411322 HM:   IA32E_MODE_GUEST
00:00:10.411323 HM:   ENTRY_SMM
00:00:10.411324 HM:   DEACTIVATE_DUALMON
00:00:10.411326 HM:   LOAD_GUEST_PERF_MSR
00:00:10.411327 HM:   LOAD_GUEST_PAT_MSR
00:00:10.411329 HM:   LOAD_GUEST_EFER_MSR
00:00:10.411330 HM: MSR_IA32_VMX_EXIT_CTLS          = 0x7fffff00036dff
00:00:10.411334 HM:   SAVE_DEBUG (must be set)
00:00:10.411335 HM:   HOST_ADDR_SPACE_SIZE
00:00:10.411337 HM:   LOAD_PERF_MSR
00:00:10.411338 HM:   ACK_EXT_INT
00:00:10.411340 HM:   SAVE_GUEST_PAT_MSR
00:00:10.411341 HM:   LOAD_HOST_PAT_MSR
00:00:10.411343 HM:   SAVE_GUEST_EFER_MSR
00:00:10.411344 HM:   LOAD_HOST_EFER_MSR
00:00:10.411346 HM:   SAVE_VMX_PREEMPT_TIMER
00:00:10.411347 HM: MSR_IA32_VMX_EPT_VPID_CAP       = 0xf0106114141
00:00:10.411350 HM:   RWX_X_ONLY
00:00:10.411352 HM:   PAGE_WALK_LENGTH_4
00:00:10.411353 HM:   EMT_UC
00:00:10.411355 HM:   EMT_WB
00:00:10.411356 HM:   PDE_2M
00:00:10.411357 HM:   INVEPT
00:00:10.411359 HM:   INVEPT_SINGLE_CONTEXT
00:00:10.411360 HM:   INVEPT_ALL_CONTEXTS
00:00:10.411361 HM:   INVVPID
00:00:10.411363 HM:   INVVPID_INDIV_ADDR
00:00:10.411364 HM:   INVVPID_SINGLE_CONTEXT
00:00:10.411366 HM:   INVVPID_ALL_CONTEXTS
00:00:10.411367 HM:   INVVPID_SINGLE_CONTEXT_RETAIN_GLOBALS
00:00:10.411369 HM: MSR_IA32_VMX_MISC               = 0x100401e5
00:00:10.411372 HM:   PREEMPT_TSC_BIT                 = 0x5
00:00:10.411374 HM:   STORE_EFERLMA_VMEXIT            = true 
00:00:10.411376 HM:   ACTIVITY_STATES                 = 0x7
00:00:10.411378 HM:   CR3_TARGET                      = 0x4
00:00:10.411380 HM:   MAX_MSR                         = 512
00:00:10.411381 HM:   RDMSR_SMBASE_MSR_SMM            = false
00:00:10.411384 HM:   SMM_MONITOR_CTL_B2              = true 
00:00:10.411386 HM:   VMWRITE_VMEXIT_INFO             = false
00:00:10.411388 HM:   MSEG_ID                         = 0x0
00:00:10.411390 HM: MSR_IA32_VMX_CR0_FIXED0         = 0x80000021
00:00:10.411392 HM: MSR_IA32_VMX_CR0_FIXED1         = 0xffffffff
00:00:10.411395 HM: MSR_IA32_VMX_CR4_FIXED0         = 0x2000
00:00:10.411397 HM: MSR_IA32_VMX_CR4_FIXED1         = 0x627ff
00:00:10.411400 HM: MSR_IA32_VMX_VMCS_ENUM          = 0x2a
00:00:10.411402 HM:   HIGHEST_INDEX                   = 0x15
00:00:10.411404 HM: APIC-access page physaddr       = 0x00000000c9f96000
00:00:10.411407 HM: VCPU  0: MSR bitmap physaddr    = 0x00000000c9f92000
00:00:10.411411 HM: VCPU  0: VMCS physaddr          = 0x00000000c9f95000
00:00:10.411415 HM: Guest support: 32-bit only
00:00:10.411432 HM: Supports VMCS EFER fields       = true 
00:00:10.411435 HM: Enabled VMX
00:00:10.411441 CPUM: SetGuestCpuIdFeature: Enabled SYSENTER/EXIT
00:00:10.411443 HM: Enabled nested paging
00:00:10.411445 HM:   EPT flush type                = VMXFLUSHEPT_SINGLE_CONTEXT
00:00:10.411446 HM: Enabled unrestricted guest execution
00:00:10.411448 HM: Enabled large page support
00:00:10.411449 HM: Enabled VPID
00:00:10.411451 HM:   VPID flush type               = VMXFLUSHVPID_SINGLE_CONTEXT
00:00:10.411453 HM: Enabled VMX-preemption timer (cPreemptTimerShift=5)
00:00:10.411455 HM: VT-x/AMD-V init method: LOCAL
00:00:10.411464 CPUM: VCPU  0: Cached APIC base MSR = 0xfee00900
00:00:10.411501 VMM: fUsePeriodicPreemptionTimers=false
00:00:10.411663 CPUM: Logical host processors: 8 present, 8 max, 8 online, online mask: 00000000000000ff
00:00:10.411670 CPUM: Physical host cores: 4
00:00:10.411672 ************************* CPUID dump ************************
00:00:10.411687          Raw Standard CPUID Leaves
00:00:10.411688      Leaf/sub-leaf  eax      ebx      ecx      edx
00:00:10.411694 Gst: 00000000/0000  0000000d 756e6547 6c65746e 49656e69
00:00:10.411700 Hst:                0000000d 756e6547 6c65746e 49656e69
00:00:10.411709 Gst: 00000001/0000  000206a7 00000800 96b8220b 078bfbbf
00:00:10.411714 Hst:                000206a7 07100800 1fbae3bf bfebfbff
00:00:10.411718 Gst: 00000002/0000  76035a01 00f0b2ff 00000000 00ca0000
00:00:10.411722 Hst:                76035a01 00f0b2ff 00000000 00ca0000
00:00:10.411726 Gst: 00000003/0000  00000000 00000000 00000000 00000000
00:00:10.411729 Hst:                00000000 00000000 00000000 00000000
00:00:10.411733 Gst: 00000004/0000  00000121 01c0003f 0000003f 00000000
00:00:10.411737 Hst:                1c004121 01c0003f 0000003f 00000000
00:00:10.411741 Gst: 00000004/0001  00000122 01c0003f 0000003f 00000000
00:00:10.411744 Hst:                1c004122 01c0003f 0000003f 00000000
00:00:10.411748 Gst: 00000004/0002  00000143 01c0003f 000001ff 00000000
00:00:10.411752 Hst:                1c004143 01c0003f 000001ff 00000000
00:00:10.411756 Gst: 00000004/0003  00000163 02c0003f 00001fff 00000006
00:00:10.411760 Hst:                1c03c163 02c0003f 00001fff 00000006
00:00:10.411764 Gst: 00000004/0004  00000000 00000000 00000000 00000000
00:00:10.411767 Hst:                00000000 00000000 00000000 00000000
00:00:10.411770 Gst: 00000005/0000  00000040 00000040 00000000 00000000
00:00:10.411773 Hst:                00000040 00000040 00000003 00021120
00:00:10.411776 Gst: 00000006/0000  00000000 00000000 00000000 00000000
00:00:10.411779 Hst:                00000077 00000002 00000009 00000000
00:00:10.411782 Gst: 00000007/0000  00000000 00000000 00000000 00000000
00:00:10.411785 Hst:                00000000 00000000 00000000 00000000
00:00:10.411788 Gst: 00000008/0000  00000000 00000000 00000000 00000000
00:00:10.411791 Hst:                00000000 00000000 00000000 00000000
00:00:10.411794 Gst: 00000009/0000  00000000 00000000 00000000 00000000
00:00:10.411797 Hst:                00000000 00000000 00000000 00000000
00:00:10.411799 Gst: 0000000a/0000  00000000 00000000 00000000 00000000
00:00:10.411802 Hst:                07300403 00000000 00000000 00000603
00:00:10.411806 Gst: 0000000b/0000  00000000 00000001 00000100 00000000
00:00:10.411809 Hst:                00000001 00000002 00000100 00000007
00:00:10.411812 Gst: 0000000b/0001  00000001 00000001 00000201 00000000
00:00:10.411815 Hst:                00000004 00000008 00000201 00000007
00:00:10.411818 Gst: 0000000b/0002  00000000 00000000 00000002 00000000
00:00:10.411821 Hst:                00000000 00000000 00000002 00000007
00:00:10.411823 Gst: 0000000c/0000  00000000 00000000 00000000 00000000
00:00:10.411826 Hst:                00000000 00000000 00000000 00000000
00:00:10.411829 Gst: 0000000d/0000  00000007 00000340 00000340 00000000
00:00:10.411832 Hst:                00000007 00000340 00000340 00000000
00:00:10.411835 Gst: 0000000d/0001  00000000 00000000 00000000 00000000
00:00:10.411838 Hst:                00000001 00000000 00000000 00000000
00:00:10.411841 Gst: 0000000d/0002  00000100 00000240 00000000 00000000
00:00:10.411844 Hst:                00000100 00000240 00000000 00000000
00:00:10.411847 Gst: 0000000d/0003  00000000 00000000 00000000 00000000
00:00:10.411850 Hst:                00000000 00000000 00000000 00000000
00:00:10.411903                                Name: GenuineIntel
00:00:10.411907                            Supports: 0x00000000-0x0000000d
00:00:10.411918                              Family:  6 	Extended: 0 	Effective: 6
00:00:10.411923                               Model: 10 	Extended: 2 	Effective: 42
00:00:10.411928                            Stepping: 7
00:00:10.411931                                Type: 0 (primary)
00:00:10.411934                             APIC ID: 0x00
00:00:10.411938                        Logical CPUs: 0
00:00:10.411940                        CLFLUSH Size: 8
00:00:10.411943                            Brand ID: 0x00
00:00:10.411946 Features
00:00:10.411948   Mnemonic - Description                                  = guest (host)
00:00:10.411951   FPU - x87 FPU on Chip                                   = 1 (1)
00:00:10.411957   VME - Virtual 8086 Mode Enhancements                    = 1 (1)
00:00:10.411961   DE - Debugging extensions                               = 1 (1)
00:00:10.411965   PSE - Page Size Extension                               = 1 (1)
00:00:10.411970   TSC - Time Stamp Counter                                = 1 (1)
00:00:10.411974   MSR - Model Specific Registers                          = 1 (1)
00:00:10.411978   PAE - Physical Address Extension                        = 0 (1)
00:00:10.411982   MCE - Machine Check Exception                           = 1 (1)
00:00:10.411986   CX8 - CMPXCHG8B instruction                             = 1 (1)
00:00:10.411990   APIC - APIC On-Chip                                     = 1 (1)
00:00:10.411994   SEP - SYSENTER and SYSEXIT Present                      = 1 (1)
00:00:10.411998   MTRR - Memory Type Range Registers                      = 1 (1)
00:00:10.412002   PGE - PTE Global Bit                                    = 1 (1)
00:00:10.412006   MCA - Machine Check Architecture                        = 1 (1)
00:00:10.412010   CMOV - Conditional Move instructions                    = 1 (1)
00:00:10.412014   PAT - Page Attribute Table                              = 1 (1)
00:00:10.412018   PSE-36 - 36-bit Page Size Extension                     = 1 (1)
00:00:10.412022   PSN - Processor Serial Number                           = 0 (0)
00:00:10.412026   CLFSH - CLFLUSH instruction                             = 1 (1)
00:00:10.412030   DS - Debug Store                                        = 0 (1)
00:00:10.412035   ACPI - Thermal Mon. & Soft. Clock Ctrl.                 = 0 (1)
00:00:10.412038   MMX - Intel MMX Technology                              = 1 (1)
00:00:10.412042   FXSR - FXSAVE and FXRSTOR instructions                  = 1 (1)
00:00:10.412046   SSE - SSE support                                       = 1 (1)
00:00:10.412050   SSE2 - SSE2 support                                     = 1 (1)
00:00:10.412054   SS - Self Snoop                                         = 0 (1)
00:00:10.412059   HTT - Hyper-Threading Technology                        = 0 (1)
00:00:10.412063   TM - Therm. Monitor                                     = 0 (1)
00:00:10.412067   PBE - Pending Break Enabled                             = 0 (1)
00:00:10.412071   SSE3 - SSE3 support                                     = 1 (1)
00:00:10.412075   PCLMUL - PCLMULQDQ support (for AES-GCM)                = 1 (1)
00:00:10.412079   DTES64 - DS Area 64-bit Layout                          = 0 (1)
00:00:10.412083   MONITOR - MONITOR/MWAIT instructions                    = 1 (1)
00:00:10.412087   CPL-DS - CPL Qualified Debug Store                      = 0 (1)
00:00:10.412091   VMX - Virtual Machine Extensions                        = 0 (1)
00:00:10.412094   SMX - Safer Mode Extensions                             = 0 (0)
00:00:10.412098   EST - Enhanced SpeedStep Technology                     = 0 (1)
00:00:10.412102   TM2 - Terminal Monitor 2                                = 0 (1)
00:00:10.412106   SSSE3 - Supplemental Streaming SIMD Extensions 3        = 1 (1)
00:00:10.412109   CNTX-ID - L1 Context ID                                 = 0 (0)
00:00:10.412114   SDBG - Silicon Debug interface                          = 0 (0)
00:00:10.412118   FMA - Fused Multiply Add extensions                     = 0 (0)
00:00:10.412121   CX16 - CMPXCHG16B instruction                           = 1 (1)
00:00:10.412125   TPRUPDATE - xTPR Update Control                         = 0 (1)
00:00:10.412129   PDCM - Perf/Debug Capability MSR                        = 0 (1)
00:00:10.412133   PCID - Process Context Identifiers                      = 0 (1)
00:00:10.412137   DCA - Direct Cache Access                               = 0 (0)
00:00:10.412141   SSE4_1 - SSE4_1 support                                 = 1 (1)
00:00:10.412145   SSE4_2 - SSE4_2 support                                 = 1 (1)
00:00:10.412149   X2APIC - x2APIC support                                 = 1 (1)
00:00:10.412154   MOVBE - MOVBE instruction                               = 0 (0)
00:00:10.412158   POPCNT - POPCNT instruction                             = 1 (1)
00:00:10.412162   TSCDEADL - Time Stamp Counter Deadline                  = 0 (1)
00:00:10.412165   AES - AES instructions                                  = 1 (1)
00:00:10.412169   XSAVE - XSAVE instruction                               = 1 (1)
00:00:10.412174   OSXSAVE - OSXSAVE instruction                           = 0 (1)
00:00:10.412177   AVX - AVX support                                       = 1 (1)
00:00:10.412182   F16C - 16-bit floating point conversion instructions    = 0 (0)
00:00:10.412185   RDRAND - RDRAND instruction                             = 0 (0)
00:00:10.412189   HVP - Hypervisor Present (we're a guest)                = 1 (0)
00:00:10.412193 Structured Extended Feature Flags Enumeration (leaf 7):
00:00:10.412195   Mnemonic - Description                                  = guest (host)
00:00:10.412200   FSGSBASE - RDFSBASE/RDGSBASE/WRFSBASE/WRGSBASE instr.   = 0 (0)
00:00:10.412203   TSCADJUST - Supports MSR_IA32_TSC_ADJUST                = 0 (0)
00:00:10.412207   SGX - Supports Software Guard Extensions                = 0 (0)
00:00:10.412211   BMI1 - Advanced Bit Manipulation extension 1            = 0 (0)
00:00:10.412214   HLE - Hardware Lock Elision                             = 0 (0)
00:00:10.412218   AVX2 - Advanced Vector Extensions 2                     = 0 (0)
00:00:10.412222   FDP_EXCPTN_ONLY - FPU DP only updated on exceptions     = 0 (0)
00:00:10.412225   SMEP - Supervisor Mode Execution Prevention             = 0 (0)
00:00:10.412229   BMI2 - Advanced Bit Manipulation extension 2            = 0 (0)
00:00:10.412232   ERMS - Enhanced REP MOVSB/STOSB instructions            = 0 (0)
00:00:10.412236   INVPCID - INVPCID instruction                           = 0 (0)
00:00:10.412240   RTM - Restricted Transactional Memory                   = 0 (0)
00:00:10.412243   PQM - Platform Quality of Service Monitoring            = 0 (0)
00:00:10.412247   DEPFPU_CS_DS - Deprecates FPU CS, FPU DS values if set  = 0 (0)
00:00:10.412250   MPE - Intel Memory Protection Extensions                = 0 (0)
00:00:10.412253   PQE - Platform Quality of Service Enforcement           = 0 (0)
00:00:10.412256   AVX512F - AVX512 Foundation instructions                = 0 (0)
00:00:10.412260   RDSEED - RDSEED instruction                             = 0 (0)
00:00:10.412264   ADX - ADCX/ADOX instructions                            = 0 (0)
00:00:10.412268   SMAP - Supervisor Mode Access Prevention                = 0 (0)
00:00:10.412271   CLFLUSHOPT - CLFLUSHOPT (Cache Line Flush) instruction  = 0 (0)
00:00:10.412274   INTEL_PT - Intel Processor Trace                        = 0 (0)
00:00:10.412278   AVX512PF - AVX512 Prefetch instructions                 = 0 (0)
00:00:10.412282   AVX512ER - AVX512 Exponential & Reciprocal instructions = 0 (0)
00:00:10.412285   AVX512CD - AVX512 Conflict Detection instructions       = 0 (0)
00:00:10.412288   SHA - Secure Hash Algorithm extensions                  = 0 (0)
00:00:10.412292   PREFETCHWT1 - PREFETCHWT1 instruction                   = 0 (0)
00:00:10.412296   PKU - Protection Key for Usermode pages                 = 0 (0)
00:00:10.412299   OSPKU - CR4.PKU mirror                                  = 0 (0)
00:00:10.412304 Processor Extended State Enumeration (leaf 0xd):
00:00:10.412306    XSAVE area cur/max size by XCR0, guest: 0x340/0x340
00:00:10.412310     XSAVE area cur/max size by XCR0, host: 0x340/0x340
00:00:10.412313                    Valid XCR0 bits, guest: 0x00000000`00000007 ( x87 SSE YMM_Hi128 )
00:00:10.412320                     Valid XCR0 bits, host: 0x00000000`00000007 ( x87 SSE YMM_Hi128 )
00:00:10.412327                     XSAVE features, guest:
00:00:10.412330                      XSAVE features, host: XSAVEOPT
00:00:10.412333       XSAVE area cur size XCR0|XSS, guest: 0x0
00:00:10.412336        XSAVE area cur size XCR0|XSS, host: 0x0
00:00:10.412338                Valid IA32_XSS bits, guest: 0x00000000`00000000
00:00:10.412341                 Valid IA32_XSS bits, host: 0x00000000`00000000
00:00:10.412345   State #2, guest: off=0x0240, cb=0x0100 IA32_XSS-bit -- YMM_Hi128
00:00:10.412351   State #2, host:  off=0x0240, cb=0x0100 IA32_XSS-bit -- YMM_Hi128
00:00:10.412381          Raw Hypervisor CPUID Leaves
00:00:10.412383      Leaf/sub-leaf  eax      ebx      ecx      edx
00:00:10.412385 Gst: 40000000/0000  40000001 4b4d564b 564b4d56 0000004d
00:00:10.412390 Hst:                00000007 00000340 00000340 00000000
00:00:10.412394 Gst: 40000001/0000  01000089 00000000 00000000 00000000
00:00:10.412397 Hst:                00000007 00000340 00000340 00000000
00:00:10.412401          Raw Extended CPUID Leaves
00:00:10.412402      Leaf/sub-leaf  eax      ebx      ecx      edx
00:00:10.412404 Gst: 80000000/0000  80000008 00000000 00000000 00000000
00:00:10.412408 Hst:                80000008 00000000 00000000 00000000
00:00:10.412411 Gst: 80000001/0000  00000000 00000000 00000001 08000000
00:00:10.412415 Hst:                00000000 00000000 00000001 28100800
00:00:10.412419 Gst: 80000002/0000  20202020 6e492020 286c6574 43202952
00:00:10.412424 Hst:                20202020 6e492020 286c6574 43202952
00:00:10.412429 Gst: 80000003/0000  2865726f 20294d54 322d3769 51303736
00:00:10.412433 Hst:                2865726f 20294d54 322d3769 51303736
00:00:10.412438 Gst: 80000004/0000  5043204d 20402055 30322e32 007a4847
00:00:10.412442 Hst:                5043204d 20402055 30322e32 007a4847
00:00:10.412446 Gst: 80000005/0000  00000000 00000000 00000000 00000000
00:00:10.412449 Hst:                00000000 00000000 00000000 00000000
00:00:10.412452 Gst: 80000006/0000  00000000 00000000 01006040 00000000
00:00:10.412456 Hst:                00000000 00000000 01006040 00000000
00:00:10.412459 Gst: 80000007/0000  00000000 00000000 00000000 00000100
00:00:10.412462 Hst:                00000000 00000000 00000000 00000100
00:00:10.412465 Gst: 80000008/0000  00003024 00000000 00000000 00000000
00:00:10.412469 Hst:                00003024 00000000 00000000 00000000
00:00:10.412472 Ext Name:                        
00:00:10.412474 Ext Supports:                    0x80000000-0x80000008
00:00:10.412477 Family:                          0  	Extended: 0 	Effective: 0
00:00:10.412479 Model:                           0  	Extended: 0 	Effective: 0
00:00:10.412482 Stepping:                        0
00:00:10.412483 Brand ID:                        0x000
00:00:10.412489 Ext Features
00:00:10.412491   Mnemonic - Description                                  = guest (host)
00:00:10.412492   FPU - x87 FPU on Chip                                   = 0 (0)
00:00:10.412497   VME - Virtual 8086 Mode Enhancements                    = 0 (0)
00:00:10.412501   DE - Debugging extensions                               = 0 (0)
00:00:10.412505   PSE - Page Size Extension                               = 0 (0)
00:00:10.412509   TSC - Time Stamp Counter                                = 0 (0)
00:00:10.412513   MSR - K86 Model Specific Registers                      = 0 (0)
00:00:10.412517   PAE - Physical Address Extension                        = 0 (0)
00:00:10.412520   MCE - Machine Check Exception                           = 0 (0)
00:00:10.412524   CX8 - CMPXCHG8B instruction                             = 0 (0)
00:00:10.412528   APIC - APIC On-Chip                                     = 0 (0)
00:00:10.412533   SEP - SYSCALL/SYSRET                                    = 0 (1)
00:00:10.412537   MTRR - Memory Type Range Registers                      = 0 (0)
00:00:10.412541   PGE - PTE Global Bit                                    = 0 (0)
00:00:10.412545   MCA - Machine Check Architecture                        = 0 (0)
00:00:10.412549   CMOV - Conditional Move instructions                    = 0 (0)
00:00:10.412552   PAT - Page Attribute Table                              = 0 (0)
00:00:10.412556   PSE-36 - 36-bit Page Size Extension                     = 0 (0)
00:00:10.412560   NX - No-Execute/Execute-Disable                         = 0 (1)
00:00:10.412564   AXMMX - AMD Extensions to MMX instructions              = 0 (0)
00:00:10.412567   MMX - Intel MMX Technology                              = 0 (0)
00:00:10.412571   FXSR - FXSAVE and FXRSTOR Instructions                  = 0 (0)
00:00:10.412575   FFXSR - AMD fast FXSAVE and FXRSTOR instructions        = 0 (0)
00:00:10.412578   Page1GB - 1 GB large page                               = 0 (0)
00:00:10.412582   RDTSCP - RDTSCP instruction                             = 1 (1)
00:00:10.412586   LM - AMD64 Long Mode                                    = 0 (1)
00:00:10.412590   3DNOWEXT - AMD Extensions to 3DNow                      = 0 (0)
00:00:10.412594   3DNOW - AMD 3DNow                                       = 0 (0)
00:00:10.412599   LahfSahf - LAHF/SAHF support in 64-bit mode             = 1 (1)
00:00:10.412602   CmpLegacy - Core multi-processing legacy mode           = 0 (0)
00:00:10.412606   SVM - AMD VM extensions                                 = 0 (0)
00:00:10.412610   EXTAPIC - AMD Extended APIC registers                   = 0 (0)
00:00:10.412613   CR8L - AMD LOCK MOV CR0 means MOV CR8                   = 0 (0)
00:00:10.412617   ABM - AMD Advanced Bit Manipulation                     = 0 (0)
00:00:10.412621   SSE4A - SSE4A instructions                              = 0 (0)
00:00:10.412625   MISALIGNSSE - AMD Misaligned SSE mode                   = 0 (0)
00:00:10.412629   3DNOWPRF - AMD PREFETCH and PREFETCHW instructions      = 0 (0)
00:00:10.412632   OSVW - AMD OS Visible Workaround                        = 0 (0)
00:00:10.412636   IBS - Instruct Based Sampling                           = 0 (0)
00:00:10.412639   XOP - Extended Operation support                        = 0 (0)
00:00:10.412643   SKINIT - SKINIT, STGI, and DEV support                  = 0 (0)
00:00:10.412647   WDT - AMD Watchdog Timer support                        = 0 (0)
00:00:10.412651   LWP - Lightweight Profiling support                     = 0 (0)
00:00:10.412654   FMA4 - Four operand FMA instruction support             = 0 (0)
00:00:10.412658   NodeId - NodeId in MSR C001_100C                        = 0 (0)
00:00:10.412662   TBM - Trailing Bit Manipulation instructions            = 0 (0)
00:00:10.412665   TOPOEXT - Topology Extensions                           = 0 (0)
00:00:10.412670 Full Name:                       "      Intel(R) Core(TM) i7-2670QM CPU @ 2.20GHz"
00:00:10.412672 TLB 2/4M Instr/Uni:              res0     0 entries
00:00:10.412675 TLB 2/4M Data:                   res0     0 entries
00:00:10.412677 TLB 4K Instr/Uni:                res0     0 entries
00:00:10.412682 TLB 4K Data:                     res0     0 entries
00:00:10.412684 L1 Instr Cache Line Size:        0 bytes
00:00:10.412686 L1 Instr Cache Lines Per Tag:    0
00:00:10.412687 L1 Instr Cache Associativity:    res0  
00:00:10.412689 L1 Instr Cache Size:             0 KB
00:00:10.412691 L1 Data Cache Line Size:         0 bytes
00:00:10.412692 L1 Data Cache Lines Per Tag:     0
00:00:10.412694 L1 Data Cache Associativity:     res0  
00:00:10.412695 L1 Data Cache Size:              0 KB
00:00:10.412698 L2 TLB 2/4M Instr/Uni:           off       0 entries
00:00:10.412700 L2 TLB 2/4M Data:                off       0 entries
00:00:10.412702 L2 TLB 4K Instr/Uni:             off       0 entries
00:00:10.412704 L2 TLB 4K Data:                  off       0 entries
00:00:10.412706 L2 Cache Line Size:              0 bytes
00:00:10.412708 L2 Cache Lines Per Tag:          0
00:00:10.412709 L2 Cache Associativity:          off   
00:00:10.412711 L2 Cache Size:                   0 KB
00:00:10.412713 APM Features:                    TscInvariant
00:00:10.412716 Host Invariant-TSC support:      true 
00:00:10.412719 Physical Address Width:          36 bits
00:00:10.412721 Virtual Address Width:           48 bits
00:00:10.412722 Guest Physical Address Width:    0 bits
00:00:10.412724 Physical Core Count:             1
00:00:10.412727 
00:00:10.412729 ******************** End of CPUID dump **********************
00:00:10.491008 PcBios: SATA LUN#0 LCHS=1024/255/63
00:00:10.491064 APIC: fPostedIntrsEnabled=false fVirtApicRegsEnabled=false fSupportsTscDeadline=false
00:00:10.491094 VMEmt: Halt method global1 (5)
00:00:10.491123 VMEmt: HaltedGlobal1 config: cNsSpinBlockThresholdCfg=50000
00:00:10.491143 Changing the VM state from 'CREATING' to 'CREATED'
00:00:10.493773 Changing the VM state from 'CREATED' to 'POWERING_ON'
00:00:10.493837 AIOMgr: Endpoints without assigned bandwidth groups:
00:00:10.493852 AIOMgr:     C:\Users\caev0\Documents\Asistencia\MV\MarshmallowTest\tools\VM\Marshmallow.vdi
00:00:10.494199 Changing the VM state from 'POWERING_ON' to 'RUNNING'
00:00:10.494224 Console: Machine state changed to 'Running'
00:00:10.500668 VMMDev: Guest Log: BIOS: VirtualBox 5.1.18
00:00:10.506305 PIT: mode=2 count=0x10000 (65536) - 18.20 Hz (ch=0)
00:00:10.524869 Display::handleDisplayResize: uScreenId=0 pvVRAM=0000000000000000 w=720 h=400 bpp=0 cbLine=0x0 flags=0x1
00:00:10.525095 GUI: UIFrameBufferPrivate::NotifyChange: Screen=0, Origin=0x0, Size=720x400, Sending to async-handler
00:00:10.525188 GUI: UIMachineViewNormal::resendSizeHint: Restoring guest size-hint for screen 0 to 800x600
00:00:10.526998 VMMDev: SetVideoModeHint: Got a video mode hint (800x600x0)@(0x0),(1;0) at 0
00:00:10.527137 GUI: UIMachineView::sltHandleNotifyChange: Screen=0, Size=720x400
00:00:10.527162 GUI: UIFrameBufferPrivate::handleNotifyChange: Size=720x400
00:00:10.527179 GUI: UIFrameBufferPrivate::performResize: Size=720x400, Directly using source bitmap content
00:00:10.551052 PIIX3 ATA: Ctl#1: RESET, DevSel=0 AIOIf=0 CmdIf0=0x00 (-1 usec ago) CmdIf1=0x00 (-1 usec ago)
00:00:10.551193 PIIX3 ATA: Ctl#1: finished processing RESET
00:00:10.562884 GUI: 2D video acceleration is disabled
00:00:10.562955 GUI: HID LEDs sync is enabled
00:00:10.565054 GUI: UIMachineLogicNormal::sltCheckForRequestedVisualStateType: Requested-state=0, Machine-state=5
00:00:10.586184 AHCI#0: Reset the HBA
00:00:10.586417 AHCI#0: Port 0 reset
00:00:10.588637 VMMDev: Guest Log: BIOS: AHCI 0-P#0: PCHS=16383/16/63 LCHS=1024/255/63 0x000000000c800000 sectors
00:00:10.591285 PIT: mode=2 count=0x48d3 (18643) - 64.00 Hz (ch=0)
00:00:10.614229 Display::handleDisplayResize: uScreenId=0 pvVRAM=000000000d430000 w=640 h=480 bpp=32 cbLine=0xA00 flags=0x1
00:00:10.614385 GUI: UIFrameBufferPrivate::NotifyChange: Screen=0, Origin=0x0, Size=640x480, Sending to async-handler
00:00:10.614714 GUI: UIMachineView::sltHandleNotifyChange: Screen=0, Size=640x480
00:00:10.614762 GUI: UIFrameBufferPrivate::handleNotifyChange: Size=640x480
00:00:10.615241 GUI: UIFrameBufferPrivate::performResize: Size=640x480, Directly using source bitmap content
00:00:13.067181 Display::handleDisplayResize: uScreenId=0 pvVRAM=0000000000000000 w=720 h=400 bpp=0 cbLine=0x0 flags=0x1
00:00:13.067431 GUI: UIFrameBufferPrivate::NotifyChange: Screen=0, Origin=0x0, Size=720x400, Sending to async-handler
00:00:13.067609 GUI: UIMachineView::sltHandleNotifyChange: Screen=0, Size=720x400
00:00:13.067670 GUI: UIFrameBufferPrivate::handleNotifyChange: Size=720x400
00:00:13.067742 GUI: UIFrameBufferPrivate::performResize: Size=720x400, Directly using source bitmap content
00:00:13.097588 PIT: mode=2 count=0x10000 (65536) - 18.20 Hz (ch=0)
00:00:13.098799 VMMDev: Guest Log: BIOS: Boot : bseqnr=1, bootseq=0231
00:00:13.099602 VMMDev: Guest Log: BIOS: Boot from Floppy 0 failed
00:00:13.100433 VMMDev: Guest Log: BIOS: Boot : bseqnr=2, bootseq=0023
00:00:13.102093 VMMDev: Guest Log: BIOS: CDROM boot failure code : 0003
00:00:13.102825 VMMDev: Guest Log: BIOS: Boot from CD-ROM failed
00:00:13.103672 VMMDev: Guest Log: BIOS: Boot : bseqnr=3, bootseq=0002
00:00:13.105273 VMMDev: Guest Log: BIOS: Booting from Hard Disk...
00:00:13.172406 VMMDev: Guest Log: int13_harddisk_ext: function 41, unmapped device for ELDL=81
00:00:13.173741 VMMDev: Guest Log: int13_harddisk: function 08, unmapped device for ELDL=81
00:00:23.063787 Changing the VM state from 'RUNNING' to 'SUSPENDING'
00:00:23.065649 AIOMgr: Async flushes not supported
00:00:23.099147 AIOMgr: Endpoint for file 'C:\Users\caev0\Documents\Asistencia\MV\MarshmallowTest\tools\VM\Marshmallow.vdi' (flags 000c0781) created successfully
00:00:23.229561 PDMR3Suspend: 165 695 831 ns run time
00:00:23.229623 Changing the VM state from 'SUSPENDING' to 'SUSPENDED'
00:00:23.229662 Console: Machine state changed to 'Paused'
00:00:24.381472 GUI: Request for close-action to power VM off.
00:00:24.381528 GUI: Passing request to power VM off from machine-logic to UI session.
00:00:24.381546 GUI: Powering VM down on UI session power off request...
00:00:24.382369 Console: Machine state changed to 'Stopping'
00:00:24.382890 Console::powerDown(): A request to power off the VM has been issued (mMachineState=Stopping, InUninit=0)
00:00:24.382954 Display::handleDisplayResize: uScreenId=0 pvVRAM=0000000000000000 w=720 h=400 bpp=32 cbLine=0x0 flags=0x1
00:00:24.383017 GUI: UIFrameBufferPrivate::NotifyChange: Screen=0, Origin=0x0, Size=720x400, Sending to async-handler
00:00:24.383586 Changing the VM state from 'SUSPENDED' to 'POWERING_OFF'
00:00:24.383645 ****************** Guest state at power off for VCpu 0 ******************
00:00:24.383679 Guest CPUM (VCPU 0) state: 
00:00:24.383705 eax=00000000 ebx=00000022 ecx=000679a2 edx=ffffffff esi=000437e1 edi=000434c4
00:00:24.383716 eip=0000e858 esp=00001fda ebp=00001ff0 iopl=0         nv up ei pl nz na po nc
00:00:24.383725 cs={f000 base=00000000000f0000 limit=0000ffff flags=0000009f} dr0=00000000 dr1=00000000
00:00:24.383738 ds={0040 base=0000000000000400 limit=0000ffff flags=00000093} dr2=00000000 dr3=00000000
00:00:24.383748 es={0000 base=0000000000000000 limit=0000ffff flags=00000093} dr4=00000000 dr5=00000000
00:00:24.383757 fs={0000 base=0000000000000000 limit=0000ffff flags=00000093} dr6=ffff0ff0 dr7=00000400
00:00:24.383766 gs={0000 base=0000000000000000 limit=0000ffff flags=00000093} cr0=00000010 cr2=00000000
00:00:24.383775 ss={0000 base=0000000000000000 limit=0000ffff flags=00000093} cr3=00000000 cr4=00000000
00:00:24.383783 gdtr=0000000000009050:0027  idtr=0000000000000000:ffff  eflags=00000246
00:00:24.383791 ldtr={0000 base=00000000 limit=0000ffff flags=00000082}
00:00:24.383797 tr  ={0000 base=00000000 limit=0000ffff flags=0000008b}
00:00:24.383802 SysEnter={cs=0000 eip=00000000 esp=00000000}
00:00:24.383807 xcr=0000000000000001 xcr1=0000000000000000 xss=0000000000000000 (fXStateMask=0000000000000000)
00:00:24.383816 FCW=037f FSW=0000 FTW=0000 FOP=0000 MXCSR=00001f80 MXCSR_MASK=0000ffff
00:00:24.383824 FPUIP=00000000 CS=0000 Rsrvd1=0000  FPUDP=00000000 DS=0000 Rsvrd2=0000
00:00:24.383831 ST(0)=FPR0={0000'00000000'00000000} t0 +0.0000000000000000000000 * 2 ^ -16383 (*)
00:00:24.383845 ST(1)=FPR1={0000'00000000'00000000} t0 +0.0000000000000000000000 * 2 ^ -16383 (*)
00:00:24.383856 ST(2)=FPR2={0000'00000000'00000000} t0 +0.0000000000000000000000 * 2 ^ -16383 (*)
00:00:24.383866 ST(3)=FPR3={0000'00000000'00000000} t0 +0.0000000000000000000000 * 2 ^ -16383 (*)
00:00:24.383876 ST(4)=FPR4={0000'00000000'00000000} t0 +0.0000000000000000000000 * 2 ^ -16383 (*)
00:00:24.383886 ST(5)=FPR5={0000'00000000'00000000} t0 +0.0000000000000000000000 * 2 ^ -16383 (*)
00:00:24.383896 ST(6)=FPR6={0000'00000000'00000000} t0 +0.0000000000000000000000 * 2 ^ -16383 (*)
00:00:24.383906 ST(7)=FPR7={0000'00000000'00000000} t0 +0.0000000000000000000000 * 2 ^ -16383 (*)
00:00:24.383916 XMM0 =00000000'00000000'00000000'00000000  XMM1 =00000000'00000000'00000000'00000000
00:00:24.383929 XMM2 =00000000'00000000'00000000'00000000  XMM3 =00000000'00000000'00000000'00000000
00:00:24.383941 XMM4 =00000000'00000000'00000000'00000000  XMM5 =00000000'00000000'00000000'00000000
00:00:24.383953 XMM6 =00000000'00000000'00000000'00000000  XMM7 =00000000'00000000'00000000'00000000
00:00:24.383965 XMM8 =00000000'00000000'00000000'00000000  XMM9 =00000000'00000000'00000000'00000000
00:00:24.383977 XMM10=00000000'00000000'00000000'00000000  XMM11=00000000'00000000'00000000'00000000
00:00:24.383990 XMM12=00000000'00000000'00000000'00000000  XMM13=00000000'00000000'00000000'00000000
00:00:24.384002 XMM14=00000000'00000000'00000000'00000000  XMM15=00000000'00000000'00000000'00000000
00:00:24.384014 EFER         =0000000000000000
00:00:24.384018 PAT          =0007040600070406
00:00:24.384022 STAR         =0000000000000000
00:00:24.384025 CSTAR        =0000000000000000
00:00:24.384028 LSTAR        =0000000000000000
00:00:24.384031 SFMASK       =0000000000000000
00:00:24.384033 KERNELGSBASE =0000000000000000
00:00:24.384041 ***
00:00:24.384056 Guest paging mode (VCPU #0):  Real (changed 56173 times), A20 enabled (changed 2 times)
00:00:24.384066 Shadow paging mode (VCPU #0): EPT
00:00:24.384070 Host paging mode:              AMD64+G+NX
00:00:24.384074 ***
00:00:24.384082 Active Timers (pVM=0000000009bb0000)
00:00:24.384086 pTimerR3         offNext  offPrev  offSched Clock               Time             Expire HzHint State                     Description
00:00:24.384101 000000000a1f49d0 00012760 00000000 00000000 Real           395848537          395847218      0 2-ACTIVE                  VGA Refresh Timer
00:00:24.384119 000000000a207130 ffffff80 fffed8a0 00000000 Real           395848537          395847234      0 2-ACTIVE                  EMT Yielder
00:00:24.384135 000000000a2070b0 00000000 00000080 00000000 Real           395848537          395847498      0 2-ACTIVE                  CPU Load Timer
00:00:24.384150 000000000a203500 00000000 00000000 00000000 Virt         12735625267        12569295683      0 2-ACTIVE                  DevIchAc97
00:00:24.384166 000000000a1ec230 000005e0 00000000 00000000 VrSy         12568538616        12594937608     18 2-ACTIVE                  i8254 Programmable Interval Timer
00:00:24.384185 000000000a1ec810 0001a3a0 fffffa20 00000000 VrSy         12568538616        12990000000      0 2-ACTIVE                  MC146818 RTC/CMOS - Second
00:00:24.384200 000000000a206bb0 00000000 fffe5c60 00000000 VrSy         12568538616       599932015941      0 2-ACTIVE                  ACPI PM Timer
00:00:24.384217 ***
00:00:24.384225 ************** End of Guest state at power off ***************
00:00:24.393201 PDMR3PowerOff: 8 932 044 ns run time
00:00:24.393293 Changing the VM state from 'POWERING_OFF' to 'OFF'
00:00:24.400562 Changing the VM state from 'OFF' to 'DESTROYING'
00:00:24.400670 ************************* Statistics *************************
00:00:24.401015 /CPUM/MSR-Totals/Reads                  0 times
00:00:24.401043 /CPUM/MSR-Totals/ReadsRaisingGP         0 times
00:00:24.401058 /CPUM/MSR-Totals/ReadsUnknown           0 times
00:00:24.401071 /CPUM/MSR-Totals/Writes                 0 times
00:00:24.401084 /CPUM/MSR-Totals/WritesRaisingGP        0 times
00:00:24.401097 /CPUM/MSR-Totals/WritesToIgnoredBits        0 times
00:00:24.401109 /CPUM/MSR-Totals/WritesUnknown          0 times
00:00:24.401122 /Devices/E1k0/ReceiveBytes              0 bytes
00:00:24.401134 /Devices/E1k0/TransmitBytes             0 bytes
00:00:24.401146 /Devices/IDE0/ATA0/Unit0/AtapiDMA        0 times
00:00:24.401158 /Devices/IDE0/ATA0/Unit0/AtapiPIO        0 times
00:00:24.401169 /Devices/IDE0/ATA0/Unit0/DMA            0 times
00:00:24.401180 /Devices/IDE0/ATA0/Unit0/PIO            0 times
00:00:24.401192 /Devices/IDE0/ATA0/Unit0/ReadBytes        0 bytes
00:00:24.401203 /Devices/IDE0/ATA0/Unit0/WrittenBytes        0 bytes
00:00:24.401215 /Devices/IDE0/ATA0/Unit1/AtapiDMA        0 times
00:00:24.401227 /Devices/IDE0/ATA0/Unit1/AtapiPIO        0 times
00:00:24.401238 /Devices/IDE0/ATA0/Unit1/DMA            0 times
00:00:24.401250 /Devices/IDE0/ATA0/Unit1/PIO            0 times
00:00:24.401261 /Devices/IDE0/ATA0/Unit1/ReadBytes        0 bytes
00:00:24.401273 /Devices/IDE0/ATA0/Unit1/WrittenBytes        0 bytes
00:00:24.401284 /Devices/IDE0/ATA1/Unit0/AtapiDMA        0 times
00:00:24.401298 /Devices/IDE0/ATA1/Unit0/AtapiPIO        0 times
00:00:24.401323 /Devices/IDE0/ATA1/Unit0/DMA            0 times
00:00:24.401350 /Devices/IDE0/ATA1/Unit0/PIO            0 times
00:00:24.401362 /Devices/IDE0/ATA1/Unit0/ReadBytes        0 bytes
00:00:24.401374 /Devices/IDE0/ATA1/Unit0/WrittenBytes        0 bytes
00:00:24.401385 /Devices/IDE0/ATA1/Unit1/AtapiDMA        0 times
00:00:24.401397 /Devices/IDE0/ATA1/Unit1/AtapiPIO        0 times
00:00:24.401408 /Devices/IDE0/ATA1/Unit1/DMA            0 times
00:00:24.401420 /Devices/IDE0/ATA1/Unit1/PIO            0 times
00:00:24.401431 /Devices/IDE0/ATA1/Unit1/ReadBytes        0 bytes
00:00:24.401443 /Devices/IDE0/ATA1/Unit1/WrittenBytes        0 bytes
00:00:24.401455 /Devices/SATA0/Port0/DMA               47 times
00:00:24.401468 /Devices/SATA0/Port0/ReadBytes    1434624 bytes
00:00:24.401491 /Devices/VMMDev/BalloonChunks           0 count
00:00:24.401505 /FT/Checkpoint/Network                  0 times
00:00:24.401517 /FT/Checkpoint/Storage                  0 times
00:00:24.401540 /FT/Received/Mem                        0 bytes
00:00:24.401559 /FT/Received/State                      0 bytes
00:00:24.401572 /FT/Sent/Mem                            0 bytes
00:00:24.401585 /FT/Sent/State                          0 bytes
00:00:24.401598 /FT/Sync/DeltaMem                       0 times
00:00:24.401610 /FT/Sync/DeltaVM                        0 times
00:00:24.401624 /FT/Sync/Full                           0 times
00:00:24.401638 /GMM/VM/Allocated/cBasePages          545 pages
00:00:24.401651 /GMM/VM/Allocated/cFixedPages           0 pages
00:00:24.401663 /GMM/VM/Allocated/cShadowPages          0 pages
00:00:24.401674 /GMM/VM/Reserved/cBasePages        131230 pages
00:00:24.401687 /GMM/VM/Reserved/cFixedPages         5124 pages
00:00:24.401699 /GMM/VM/Reserved/cShadowPages           1 pages
00:00:24.401711 /GMM/VM/cBalloonedPages                 0 pages
00:00:24.401723 /GMM/VM/cMaxBalloonedPages              0 pages
00:00:24.401735 /GMM/VM/cPrivatePages                 545 pages
00:00:24.401747 /GMM/VM/cReqActuallyBalloonedPages        0 pages
00:00:24.401759 /GMM/VM/cReqBalloonedPages              0 pages
00:00:24.401771 /GMM/VM/cReqDeflatePages                0 pages
00:00:24.401782 /GMM/VM/cShareableModules               0 count
00:00:24.401794 /GMM/VM/cSharedPages                    0 pages
00:00:24.401806 /GMM/VM/enmPolicy                       1 
00:00:24.401819 /GMM/VM/enmPriority                     2 
00:00:24.401830 /GMM/VM/fBallooningEnabled       false    
00:00:24.401842 /GMM/VM/fMayAllocate             true     
00:00:24.401854 /GMM/VM/fSharedPagingEnabled     false    
00:00:24.401865 /GMM/cAllocatedPages                  545 pages
00:00:24.401877 /GMM/cBalloonedPages                    0 pages
00:00:24.401889 /GMM/cChunks                            2 count
00:00:24.401901 /GMM/cDuplicatePages                    0 pages
00:00:24.401913 /GMM/cFreedChunks                       0 count
00:00:24.401926 /GMM/cLeftBehindSharedPages             0 pages
00:00:24.401937 /GMM/cMaxPages                   4294967295 pages
00:00:24.401950 /GMM/cOverCommittedPages                0 pages
00:00:24.401962 /GMM/cReservedPages                136355 pages
00:00:24.401974 /GMM/cShareableModules                  0 count
00:00:24.401986 /GMM/cSharedPages                       0 pages
00:00:24.401998 /GVMM/EMTs                              1 calls
00:00:24.402010 /GVMM/HostCPUs                          8 calls
00:00:24.402022 /GVMM/HostCpus/0                        0 
00:00:24.402034 /GVMM/HostCpus/0/CurTimerHz             0 Hz
00:00:24.402046 /GVMM/HostCpus/0/DesiredHz              0 Hz
00:00:24.402058 /GVMM/HostCpus/0/PPTChanges             0 times
00:00:24.402069 /GVMM/HostCpus/0/PPTStarts              0 times
00:00:24.402080 /GVMM/HostCpus/0/idxCpuSet              0 
00:00:24.402092 /GVMM/HostCpus/1                        1 
00:00:24.402104 /GVMM/HostCpus/1/CurTimerHz             0 Hz
00:00:24.402115 /GVMM/HostCpus/1/DesiredHz              0 Hz
00:00:24.402127 /GVMM/HostCpus/1/PPTChanges             0 times
00:00:24.402138 /GVMM/HostCpus/1/PPTStarts              0 times
00:00:24.402150 /GVMM/HostCpus/1/idxCpuSet              1 
00:00:24.402161 /GVMM/HostCpus/2                        2 
00:00:24.402173 /GVMM/HostCpus/2/CurTimerHz             0 Hz
00:00:24.402184 /GVMM/HostCpus/2/DesiredHz              0 Hz
00:00:24.402196 /GVMM/HostCpus/2/PPTChanges             0 times
00:00:24.402207 /GVMM/HostCpus/2/PPTStarts              0 times
00:00:24.402218 /GVMM/HostCpus/2/idxCpuSet              2 
00:00:24.402229 /GVMM/HostCpus/3                        3 
00:00:24.402241 /GVMM/HostCpus/3/CurTimerHz             0 Hz
00:00:24.402252 /GVMM/HostCpus/3/DesiredHz              0 Hz
00:00:24.402263 /GVMM/HostCpus/3/PPTChanges             0 times
00:00:24.402278 /GVMM/HostCpus/3/PPTStarts              0 times
00:00:24.402300 /GVMM/HostCpus/3/idxCpuSet              3 
00:00:24.402312 /GVMM/HostCpus/4                        4 
00:00:24.402329 /GVMM/HostCpus/4/CurTimerHz             0 Hz
00:00:24.402344 /GVMM/HostCpus/4/DesiredHz              0 Hz
00:00:24.402356 /GVMM/HostCpus/4/PPTChanges             0 times
00:00:24.402368 /GVMM/HostCpus/4/PPTStarts              0 times
00:00:24.402380 /GVMM/HostCpus/4/idxCpuSet              4 
00:00:24.402391 /GVMM/HostCpus/5                        5 
00:00:24.402403 /GVMM/HostCpus/5/CurTimerHz             0 Hz
00:00:24.402415 /GVMM/HostCpus/5/DesiredHz              0 Hz
00:00:24.402426 /GVMM/HostCpus/5/PPTChanges             0 times
00:00:24.402438 /GVMM/HostCpus/5/PPTStarts              0 times
00:00:24.402449 /GVMM/HostCpus/5/idxCpuSet              5 
00:00:24.402461 /GVMM/HostCpus/6                        6 
00:00:24.402473 /GVMM/HostCpus/6/CurTimerHz             0 Hz
00:00:24.402484 /GVMM/HostCpus/6/DesiredHz              0 Hz
00:00:24.402496 /GVMM/HostCpus/6/PPTChanges             0 times
00:00:24.402508 /GVMM/HostCpus/6/PPTStarts              0 times
00:00:24.402519 /GVMM/HostCpus/6/idxCpuSet              6 
00:00:24.402530 /GVMM/HostCpus/7                        7 
00:00:24.402542 /GVMM/HostCpus/7/CurTimerHz             0 Hz
00:00:24.402554 /GVMM/HostCpus/7/DesiredHz              0 Hz
00:00:24.402565 /GVMM/HostCpus/7/PPTChanges             0 times
00:00:24.402577 /GVMM/HostCpus/7/PPTStarts              0 times
00:00:24.402588 /GVMM/HostCpus/7/idxCpuSet              7 
00:00:24.402600 /GVMM/Sum/HaltBlocking                699 calls
00:00:24.402612 /GVMM/Sum/HaltCalls                  5375 calls
00:00:24.402625 /GVMM/Sum/HaltNotBlocking            4676 calls
00:00:24.402637 /GVMM/Sum/HaltTimeouts                476 calls
00:00:24.402649 /GVMM/Sum/HaltWakeUps                   0 calls
00:00:24.402660 /GVMM/Sum/PokeCalls                   371 calls
00:00:24.402672 /GVMM/Sum/PokeNotBusy                  49 calls
00:00:24.402684 /GVMM/Sum/PollCalls                     6 calls
00:00:24.402696 /GVMM/Sum/PollHalts                     0 calls
00:00:24.402708 /GVMM/Sum/PollWakeUps                   0 calls
00:00:24.402720 /GVMM/Sum/WakeUpCalls                 245 calls
00:00:24.402732 /GVMM/Sum/WakeUpNotHalted             171 calls
00:00:24.402744 /GVMM/Sum/WakeUpWakeUps                 0 calls
00:00:24.402757 /GVMM/VM/HaltBlocking                 699 calls
00:00:24.402769 /GVMM/VM/HaltCalls                   5375 calls
00:00:24.402781 /GVMM/VM/HaltNotBlocking             4676 calls
00:00:24.402794 /GVMM/VM/HaltTimeouts                 476 calls
00:00:24.402806 /GVMM/VM/HaltWakeUps                    0 calls
00:00:24.402818 /GVMM/VM/PokeCalls                    371 calls
00:00:24.402829 /GVMM/VM/PokeNotBusy                   49 calls
00:00:24.402841 /GVMM/VM/PollCalls                      6 calls
00:00:24.402853 /GVMM/VM/PollHalts                      0 calls
00:00:24.402865 /GVMM/VM/PollWakeUps                    0 calls
00:00:24.402877 /GVMM/VM/WakeUpCalls                  245 calls
00:00:24.402889 /GVMM/VM/WakeUpNotHalted              171 calls
00:00:24.402901 /GVMM/VM/WakeUpWakeUps                  0 calls
00:00:24.402913 /GVMM/VMs                               1 calls
00:00:24.402926 /HM/CPU0/Exit/HostNmiInGC               0 times
00:00:24.402938 /HM/CPU0/Switch/Preempting              0 times
00:00:24.402950 /IEM/CPU0/CodeTlb-Misses                0 count
00:00:24.402962 /IEM/CPU0/CodeTlb-PhysRev        ffffffffffff9c00 
00:00:24.402976 /IEM/CPU0/CodeTlb-Revision       fffff38000000000 
00:00:24.402989 /IEM/CPU0/CodeTlb-SlowReads             0 
00:00:24.403000 /IEM/CPU0/DataTlb-Misses                0 count
00:00:24.403012 /IEM/CPU0/DataTlb-PhysRev        ffffffffffff9c00 
00:00:24.403025 /IEM/CPU0/DataTlb-Revision       fffff38000000000 
00:00:24.403038 /IEM/CPU0/cInstructions             25930 count
00:00:24.403050 /IEM/CPU0/cLongJumps                    0 bytes
00:00:24.403062 /IEM/CPU0/cPendingCommit                0 bytes
00:00:24.403074 /IEM/CPU0/cPotentialExits           68372 count
00:00:24.403088 /IEM/CPU0/cRetAspectNotImplemented        0 count
00:00:24.403103 /IEM/CPU0/cRetErrStatuses               0 count
00:00:24.403118 /IEM/CPU0/cRetInfStatuses               0 count
00:00:24.403130 /IEM/CPU0/cRetInstrNotImplemented        0 count
00:00:24.403142 /IEM/CPU0/cbWritten                128300 bytes
00:00:24.403155 /MM/HyperHeap/cbFree               844048 bytes
00:00:24.403167 /MM/HyperHeap/cbHeap              1048256 bytes
00:00:24.403179 /PDM/BlkCache/cbCached                  0 bytes
00:00:24.403191 /PDM/BlkCache/cbCachedFru               0 bytes
00:00:24.403202 /PDM/BlkCache/cbCachedMruIn             0 bytes
00:00:24.403214 /PDM/BlkCache/cbCachedMruOut            0 bytes
00:00:24.403225 /PDM/BlkCache/cbMax               5242880 bytes
00:00:24.403238 /PDM/CritSects/8237A#0Auto/ContentionR3        0 times
00:00:24.403254 /PDM/CritSects/8237A#0Auto/ContentionRZLock        0 times
00:00:24.403276 /PDM/CritSects/8237A#0Auto/ContentionRZUnlock        0 times
00:00:24.403289 /PDM/CritSects/AHCI#0/ContentionR3        0 times
00:00:24.403301 /PDM/CritSects/AHCI#0/ContentionRZLock        0 times
00:00:24.403313 /PDM/CritSects/AHCI#0/ContentionRZUnlock        0 times
00:00:24.403324 /PDM/CritSects/ATA#0-Ctl/ContentionR3        0 times
00:00:24.403336 /PDM/CritSects/ATA#0-Ctl/ContentionRZLock        0 times
00:00:24.403347 /PDM/CritSects/ATA#0-Ctl/ContentionRZUnlock        0 times
00:00:24.403359 /PDM/CritSects/ATA#0-Req/ContentionR3        0 times
00:00:24.403371 /PDM/CritSects/ATA#0-Req/ContentionRZLock        0 times
00:00:24.403382 /PDM/CritSects/ATA#0-Req/ContentionRZUnlock        0 times
00:00:24.403393 /PDM/CritSects/ATA#1-Ctl/ContentionR3        0 times
00:00:24.403405 /PDM/CritSects/ATA#1-Ctl/ContentionRZLock        3 times
00:00:24.403416 /PDM/CritSects/ATA#1-Ctl/ContentionRZUnlock        0 times
00:00:24.403428 /PDM/CritSects/ATA#1-Req/ContentionR3        0 times
00:00:24.403439 /PDM/CritSects/ATA#1-Req/ContentionRZLock        0 times
00:00:24.403451 /PDM/CritSects/ATA#1-Req/ContentionRZUnlock        0 times
00:00:24.403462 /PDM/CritSects/E1000#0/ContentionR3        0 times
00:00:24.403474 /PDM/CritSects/E1000#0/ContentionRZLock        0 times
00:00:24.403485 /PDM/CritSects/E1000#0/ContentionRZUnlock        0 times
00:00:24.403497 /PDM/CritSects/E1000#0RX/ContentionR3        0 times
00:00:24.403508 /PDM/CritSects/E1000#0RX/ContentionRZLock        0 times
00:00:24.403519 /PDM/CritSects/E1000#0RX/ContentionRZUnlock        0 times
00:00:24.403530 /PDM/CritSects/E1000#0TX/ContentionR3        0 times
00:00:24.403542 /PDM/CritSects/E1000#0TX/ContentionRZLock        0 times
00:00:24.403553 /PDM/CritSects/E1000#0TX/ContentionRZUnlock        0 times
00:00:24.403564 /PDM/CritSects/EM-REM/ContentionR3        0 times
00:00:24.403576 /PDM/CritSects/EM-REM/ContentionRZLock        0 times
00:00:24.403587 /PDM/CritSects/EM-REM/ContentionRZUnlock        0 times
00:00:24.403599 /PDM/CritSects/FTM/ContentionR3         0 times
00:00:24.403611 /PDM/CritSects/FTM/ContentionRZLock        0 times
00:00:24.403623 /PDM/CritSects/FTM/ContentionRZUnlock        0 times
00:00:24.403635 /PDM/CritSects/GIMDev#0Auto/ContentionR3        0 times
00:00:24.403647 /PDM/CritSects/GIMDev#0Auto/ContentionRZLock        0 times
00:00:24.403658 /PDM/CritSects/GIMDev#0Auto/ContentionRZUnlock        0 times
00:00:24.403670 /PDM/CritSects/MM-HYPER/ContentionR3        0 times
00:00:24.403681 /PDM/CritSects/MM-HYPER/ContentionRZLock        0 times
00:00:24.403693 /PDM/CritSects/MM-HYPER/ContentionRZUnlock        0 times
00:00:24.403704 /PDM/CritSects/NOP/ContentionR3         0 times
00:00:24.403715 /PDM/CritSects/NOP/ContentionRZLock        0 times
00:00:24.403727 /PDM/CritSects/NOP/ContentionRZUnlock        0 times
00:00:24.403738 /PDM/CritSects/OHCI#0Irq/ContentionR3        0 times
00:00:24.403749 /PDM/CritSects/OHCI#0Irq/ContentionRZLock        0 times
00:00:24.403761 /PDM/CritSects/OHCI#0Irq/ContentionRZUnlock        0 times
00:00:24.403772 /PDM/CritSects/PDM/ContentionR3         0 times
00:00:24.403784 /PDM/CritSects/PDM/ContentionRZLock        0 times
00:00:24.403799 /PDM/CritSects/PDM/ContentionRZUnlock        0 times
00:00:24.403814 /PDM/CritSects/PGM/ContentionR3         0 times
00:00:24.403826 /PDM/CritSects/PGM/ContentionRZLock        0 times
00:00:24.403837 /PDM/CritSects/PGM/ContentionRZUnlock        0 times
00:00:24.403850 /PDM/CritSects/REM-Register/ContentionR3        0 times
00:00:24.403862 /PDM/CritSects/REM-Register/ContentionRZLock        0 times
00:00:24.403874 /PDM/CritSects/REM-Register/ContentionRZUnlock        0 times
00:00:24.403886 /PDM/CritSects/TM Timer Lock/ContentionR3        0 times
00:00:24.403898 /PDM/CritSects/TM Timer Lock/ContentionRZLock        0 times
00:00:24.403910 /PDM/CritSects/TM Timer Lock/ContentionRZUnlock        0 times
00:00:24.403929 /PDM/CritSects/TM VirtualSync Lock/ContentionR3        0 times
00:00:24.403950 /PDM/CritSects/TM VirtualSync Lock/ContentionRZLock        0 times
00:00:24.403970 /PDM/CritSects/TM VirtualSync Lock/ContentionRZUnlock        0 times
00:00:24.403990 /PDM/CritSects/VGA#0/ContentionR3        0 times
00:00:24.404025 /PDM/CritSects/VGA#0/ContentionRZLock        0 times
00:00:24.404048 /PDM/CritSects/VGA#0/ContentionRZUnlock        0 times
00:00:24.404068 /PDM/CritSects/VGA#0_IRQ/ContentionR3        0 times
00:00:24.404087 /PDM/CritSects/VGA#0_IRQ/ContentionRZLock        0 times
00:00:24.404107 /PDM/CritSects/VGA#0_IRQ/ContentionRZUnlock        0 times
00:00:24.404128 /PDM/CritSects/VMMDev#0/ContentionR3        0 times
00:00:24.404142 /PDM/CritSects/VMMDev#0/ContentionRZLock        0 times
00:00:24.404153 /PDM/CritSects/VMMDev#0/ContentionRZUnlock        0 times
00:00:24.404165 /PDM/CritSects/acpi#0/ContentionR3        0 times
00:00:24.404176 /PDM/CritSects/acpi#0/ContentionRZLock        0 times
00:00:24.404187 /PDM/CritSects/acpi#0/ContentionRZUnlock        0 times
00:00:24.404199 /PDM/CritSects/ichac97#0Auto/ContentionR3        0 times
00:00:24.404210 /PDM/CritSects/ichac97#0Auto/ContentionRZLock        0 times
00:00:24.404222 /PDM/CritSects/ichac97#0Auto/ContentionRZUnlock        0 times
00:00:24.404242 /PDM/CritSects/mc146818#0Auto/ContentionR3        0 times
00:00:24.404257 /PDM/CritSects/mc146818#0Auto/ContentionRZLock        0 times
00:00:24.404269 /PDM/CritSects/mc146818#0Auto/ContentionRZUnlock        0 times
00:00:24.404281 /PDM/CritSects/pcarch#0Auto/ContentionR3        0 times
00:00:24.404293 /PDM/CritSects/pcarch#0Auto/ContentionRZLock        0 times
00:00:24.404304 /PDM/CritSects/pcarch#0Auto/ContentionRZUnlock        0 times
00:00:24.404316 /PDM/CritSects/pcbios#0Auto/ContentionR3        0 times
00:00:24.404328 /PDM/CritSects/pcbios#0Auto/ContentionRZLock        0 times
00:00:24.404339 /PDM/CritSects/pcbios#0Auto/ContentionRZUnlock        0 times
00:00:24.404350 /PDM/CritSects/pckbd#0Auto/ContentionR3        0 times
00:00:24.404362 /PDM/CritSects/pckbd#0Auto/ContentionRZLock        0 times
00:00:24.404373 /PDM/CritSects/pckbd#0Auto/ContentionRZUnlock        0 times
00:00:24.404385 /PDM/CritSects/pit#0/ContentionR3        0 times
00:00:24.404396 /PDM/CritSects/pit#0/ContentionRZLock        0 times
00:00:24.404408 /PDM/CritSects/pit#0/ContentionRZUnlock        0 times
00:00:24.404419 /PDM/CritSects/usb-ohci#0Auto/ContentionR3        0 times
00:00:24.404431 /PDM/CritSects/usb-ohci#0Auto/ContentionRZLock        0 times
00:00:24.404442 /PDM/CritSects/usb-ohci#0Auto/ContentionRZUnlock        0 times
00:00:24.404454 /PDM/CritSectsRw/IOM Lock/ContentionR3EnterExcl        0 times
00:00:24.404466 /PDM/CritSectsRw/IOM Lock/ContentionR3EnterShared        0 times
00:00:24.404478 /PDM/CritSectsRw/IOM Lock/ContentionRZEnterExcl        0 times
00:00:24.404489 /PDM/CritSectsRw/IOM Lock/ContentionRZEnterShared        0 times
00:00:24.404501 /PDM/CritSectsRw/IOM Lock/ContentionRZLeaveExcl        0 times
00:00:24.404512 /PDM/CritSectsRw/IOM Lock/ContentionRZLeaveShared        0 times
00:00:24.404524 /PDM/CritSectsRw/IOM Lock/R3EnterExcl      204 times
00:00:24.404536 /PDM/CritSectsRw/IOM Lock/R3EnterShared     1963 times
00:00:24.404555 /PDM/CritSectsRw/IOM Lock/RZEnterExcl        0 times
00:00:24.404572 /PDM/CritSectsRw/IOM Lock/RZEnterShared   230376 times
00:00:24.404585 /PDM/Queue/AHCI-Xmit/AllocFailures        0 times
00:00:24.404597 /PDM/Queue/AHCI-Xmit/Flush              0 calls
00:00:24.404609 /PDM/Queue/AHCI-Xmit/FlushLeftovers        0 times
00:00:24.404621 /PDM/Queue/AHCI-Xmit/Insert             0 calls
00:00:24.404633 /PDM/Queue/AHCI-Xmit/cItems            60 count
00:00:24.404644 /PDM/Queue/AHCI-Xmit/cbItem            32 bytes
00:00:24.404657 /PDM/Queue/DevHlp/AllocFailures         0 times
00:00:24.404668 /PDM/Queue/DevHlp/Flush                 0 calls
00:00:24.404680 /PDM/Queue/DevHlp/FlushLeftovers        0 times
00:00:24.404691 /PDM/Queue/DevHlp/Insert                0 calls
00:00:24.404703 /PDM/Queue/DevHlp/cItems                8 count
00:00:24.404715 /PDM/Queue/DevHlp/cbItem               64 bytes
00:00:24.404727 /PDM/Queue/E1000-Rcv/AllocFailures        0 times
00:00:24.404738 /PDM/Queue/E1000-Rcv/Flush              0 calls
00:00:24.404749 /PDM/Queue/E1000-Rcv/FlushLeftovers        0 times
00:00:24.404761 /PDM/Queue/E1000-Rcv/Insert             0 calls
00:00:24.404773 /PDM/Queue/E1000-Rcv/cItems             1 count
00:00:24.404784 /PDM/Queue/E1000-Rcv/cbItem            24 bytes
00:00:24.404797 /PDM/Queue/E1000-Xmit/AllocFailures        0 times
00:00:24.404808 /PDM/Queue/E1000-Xmit/Flush             0 calls
00:00:24.404820 /PDM/Queue/E1000-Xmit/FlushLeftovers        0 times
00:00:24.404836 /PDM/Queue/E1000-Xmit/Insert            0 calls
00:00:24.404856 /PDM/Queue/E1000-Xmit/cItems            1 count
00:00:24.404875 /PDM/Queue/E1000-Xmit/cbItem           24 bytes
00:00:24.404894 /PDM/Queue/Keyboard/AllocFailures        0 times
00:00:24.404912 /PDM/Queue/Keyboard/Flush               0 calls
00:00:24.404932 /PDM/Queue/Keyboard/FlushLeftovers        0 times
00:00:24.404953 /PDM/Queue/Keyboard/Insert              4 calls
00:00:24.404967 /PDM/Queue/Keyboard/cItems             64 count
00:00:24.404980 /PDM/Queue/Keyboard/cbItem             32 bytes
00:00:24.404992 /PDM/Queue/Mouse/AllocFailures          0 times
00:00:24.405003 /PDM/Queue/Mouse/Flush                  0 calls
00:00:24.405015 /PDM/Queue/Mouse/FlushLeftovers         0 times
00:00:24.405026 /PDM/Queue/Mouse/Insert                 0 calls
00:00:24.405038 /PDM/Queue/Mouse/cItems               128 count
00:00:24.405050 /PDM/Queue/Mouse/cbItem                48 bytes
00:00:24.405063 /PDM/Queue/Mouse_1/AllocFailures        0 times
00:00:24.405074 /PDM/Queue/Mouse_1/Flush                0 calls
00:00:24.405086 /PDM/Queue/Mouse_1/FlushLeftovers        0 times
00:00:24.405097 /PDM/Queue/Mouse_1/Insert               0 calls
00:00:24.405109 /PDM/Queue/Mouse_1/cItems             128 count
00:00:24.405121 /PDM/Queue/Mouse_1/cbItem              48 bytes
00:00:24.405133 /PGM/CPU0/cA20Changes                   2 times
00:00:24.405146 /PGM/CPU0/cGuestModeChanges         56173 times
00:00:24.405159 /PGM/ChunkR3Map/Mapped                  2 count
00:00:24.405171 /PGM/ChunkR3Map/Unmapped                0 count
00:00:24.405183 /PGM/ChunkR3Map/c                       2 count
00:00:24.405195 /PGM/ChunkR3Map/cMax             4294967295 count
00:00:24.405216 /PGM/LargePage/Recheck                  0 times
00:00:24.405243 /PGM/LargePage/Refused                  1 times
00:00:24.405264 /PGM/LargePage/Reused                   0 times
00:00:24.405288 /PGM/Page/cAllPages                136262 count
00:00:24.405310 /PGM/Page/cBalloonedPages               0 count
00:00:24.405329 /PGM/Page/cHandyPages                  32 count
00:00:24.405353 /PGM/Page/cLargePages                   0 count
00:00:24.405368 /PGM/Page/cLargePagesDisabled           0 count
00:00:24.405381 /PGM/Page/cMonitoredPages               0 count
00:00:24.405393 /PGM/Page/cPrivatePages              5637 count
00:00:24.405923 /PGM/Page/cPureMmioPages               36 count
00:00:24.406081 GUI: UIMachineView::sltHandleNotifyChange: Screen=0, Size=720x400
00:00:24.406179 /PGM/Page/cReadLockedPages              0 count
00:00:24.406243 /PGM/Page/cReusedSharedPages            0 count
00:00:24.406269 /PGM/Page/cSharedPages                  0 count
00:00:24.406293 /PGM/Page/cWriteLockedPages             0 count
00:00:24.406312 /PGM/Page/cWrittenToPages               0 count
00:00:24.406332 /PGM/Page/cZeroPages               130589 count
00:00:24.406355 /PGM/ShMod/Check                        0 ticks/call (           0 ticks,       0 times, max         0, min      -1)
00:00:24.406384 /PGM/cRelocations                       0 times
00:00:24.406408 /PROF/CPU0/EM/Capped                    0 ticks/call (           0 ticks,       0 times, max         0, min      -1)
00:00:24.406433 /PROF/CPU0/EM/ForcedActions          2695 times
00:00:24.406456 /PROF/CPU0/EM/Halted                  215 times
00:00:24.406479 /PROF/CPU0/EM/RAWTotal                  0 times
00:00:24.406500 /PROF/CPU0/EM/REMTotal                  0 times
00:00:24.406527 /PROF/CPU0/EM/Total              27954843279 ticks/call ( 27954843279 ticks,       1 times, max 27954843279, min 27954843279)
00:00:24.406563 /PROF/CPU0/VM/Halt/Block           418223 ns/call (  2244607805 ticks,    5367 times, max   6055526, min       1)
00:00:24.406595 /PROF/CPU0/VM/Halt/BlockInsomnia        0 ns/call (           0 ticks,       0 times, max         0, min      -1)
00:00:24.406622 /PROF/CPU0/VM/Halt/BlockOnTime          0 ns/call (           0 ticks,       0 times, max         0, min      -1)
00:00:24.406647 /PROF/CPU0/VM/Halt/BlockOverslept        0 ns/call (           0 ticks,       0 times, max         0, min      -1)
00:00:24.406669 /PROF/CPU0/VM/Halt/Timers            2721 ns/call (    25747115 ticks,    9462 times, max    383818, min       2)
00:00:24.406688 /PROF/CPU0/VM/Halt/Yield             8089 ns/call (       48538 ticks,       6 times, max     11049, min    5873)
00:00:24.406706 /Public/Net/E1k0/BytesReceived          0 bytes
00:00:24.406718 /Public/Net/E1k0/BytesTransmitted        0 bytes
00:00:24.406731 /REM/TbFlushCount                       0 times
00:00:24.406746 /REM/TbPhysInvldCount                   0 times
00:00:24.406759 /REM/TlbFlushCount                      1 times
00:00:24.406772 /SELM/LoadHidSel/GstReadErrors          0 times
00:00:24.406785 /SELM/LoadHidSel/NoGoodGuest            0 times
00:00:24.406798 /TM/CPU/00/cNsExecuting          7893419784 ns
00:00:24.406811 /TM/CPU/00/cNsHalted             2277292761 ns
00:00:24.406824 /TM/CPU/00/cNsOther              2564918606 ns
00:00:24.406837 /TM/CPU/00/cNsTotal              12735631151 ns
00:00:24.406850 /TM/CPU/00/cPeriodsExecuting       235282 count
00:00:24.406863 /TM/CPU/00/cPeriodsHalted             215 count
00:00:24.406875 /TM/CPU/00/pctExecuting                94 %
00:00:24.406888 /TM/CPU/00/pctHalted                    0 %
00:00:24.406900 /TM/CPU/00/pctOther                     5 %
00:00:24.406912 /TM/CPU/pctExecuting                   94 %
00:00:24.406932 /TM/CPU/pctHalted                       0 %
00:00:24.406953 /TM/CPU/pctOther                        5 %
00:00:24.406974 /TM/MaxHzHint                           0 Hz
00:00:24.406989 /TM/R0/1nsSteps                       996 times
00:00:24.407003 /TM/R3/1nsSteps                       957 times
00:00:24.407024 /TM/TSC/offCPU0                         0 ticks
00:00:24.407047 /TM/VirtualSync/CurrentOffset      267053 ns
00:00:24.407068 /VUSB/0/cUrbsInPool                     0 count
00:00:24.407086 ********************* End of statistics **********************
00:00:24.407377 VUSB: Detached 'HidMouse' from port 1
00:00:24.414142 NAT: Zone(nm:mbuf_cluster, used:0)
00:00:24.415751 NAT: Zone(nm:mbuf_packet, used:0)
00:00:24.415783 NAT: Zone(nm:mbuf, used:0)
00:00:24.416085 NAT: Zone(nm:mbuf_jumbo_pagesize, used:0)
00:00:24.417817 NAT: Zone(nm:mbuf_jumbo_9k, used:0)
00:00:24.418688 NAT: Zone(nm:mbuf_jumbo_16k, used:0)
00:00:24.419258 NAT: Zone(nm:mbuf_ext_refcnt, used:0)
00:00:24.421980 GIM: KVM: Resetting MSRs
00:00:24.424017 Changing the VM state from 'DESTROYING' to 'TERMINATED'
00:00:24.429796 Console: Machine state changed to 'PoweredOff'
00:00:24.746642 GUI: Passing request to close Runtime UI from machine-logic to UI session.
