VirtualBox VM 5.1.18 r114002 win.amd64 (Mar 15 2017 16:16:14) release log
00:00:09.108937 Log opened 2017-03-27T01:52:59.752097200Z
00:00:09.108942 Build Type: release
00:00:09.108954 OS Product: Windows 10
00:00:09.108959 OS Release: 10.0.14393
00:00:09.108961 OS Service Pack: 
00:00:09.653218 DMI Product Name: Inspiron N5110
00:00:09.665418 DMI Product Version: Not Specified
00:00:09.665441 Host RAM: 6050MB (5.9GB) total, 2083MB (2.0GB) available
00:00:09.665452 Executable: C:\Program Files\Oracle\VirtualBox\VirtualBox.exe
00:00:09.665454 Process ID: 5196
00:00:09.665457 Package type: WINDOWS_64BITS_GENERIC
00:00:09.668502 Installed Extension Packs:
00:00:09.668624   None installed!
00:00:09.670595 Console: Machine state changed to 'Starting'
00:00:09.671689 Qt version: 5.6.2
00:00:09.677328 Console: Machine state changed to 'PoweredOff'
00:00:09.680967 GUI: UIMediumEnumerator: Medium-enumeration finished!
00:00:09.739887 Power up failed (vrc=VINF_SUCCESS, rc=E_FAIL (0X80004005))
00:00:10.038222 GUI: UIMachineViewNormal::resendSizeHint: Restoring guest size-hint for screen 0 to 800x600
00:00:10.038341 ERROR [COM]: aRC=E_ACCESSDENIED (0x80070005) aIID={02326f63-bcb3-4481-96e0-30d1c2ee97f6} aComponent={DisplayWrap} aText={The console is not powered up}, preserve=false aResultDetail=0
00:00:10.039018 GUI: Aborting startup due to power up progress issue detected...
