VirtualBox VM 4.3.40 r110317 win.amd64 (Aug 22 2016 13:43:30) release log
00:00:00.582338 Log opened 2017-06-29T22:30:12.141878100Z
00:00:00.582339 Build Type: release
00:00:00.582341 OS Product: Windows 7
00:00:00.582342 OS Release: 6.1.7601
00:00:00.582342 OS Service Pack: 1
00:00:00.608075 DMI Product Name: Precision T1700
00:00:00.609756 DMI Product Version: 01
00:00:00.609759 Host RAM: 32676MB total, 27271MB available
00:00:00.609760 Executable: C:\Program Files\Oracle\VirtualBox\VirtualBox.exe
00:00:00.609761 Process ID: 17376
00:00:00.609761 Package type: WINDOWS_64BITS_GENERIC
00:00:00.612228 Installed Extension Packs:
00:00:00.612248   None installed!
00:00:00.614768 UIMediumEnumerator: Medium-enumeration finished!
00:00:00.666472 SUP: Loaded VMMR0.r0 (C:\Program Files\Oracle\VirtualBox\VMMR0.r0) at 0xfffff880248a0000 - ModuleInit at fffff880248bdb20 and ModuleTerm at fffff880248bde30 using the native ring-0 loader
00:00:00.666490 SUP: VMMR0EntryEx located at fffff880248bff50, VMMR0EntryFast at fffff880248be1a0 and VMMR0EntryInt at fffff880248be190
00:00:00.666495 SUP: windbg> .reload /f C:\Program Files\Oracle\VirtualBox\VMMR0.r0=0xfffff880248a0000
00:00:00.669041 Guest OS type: 'Linux26'
00:00:00.679729 File system of 'G:\MaquinasVirtualesChimpFarm\KitKat720x1280x16\tools\VM\Snapshots' (snapshots) is unknown
00:00:00.679737 File system of 'G:\MaquinasVirtualesChimpFarm\KitKat720x1280x16\tools\VM\Android.vdi' is ntfs
00:00:00.703685 Shared clipboard mode: Off
00:00:00.710158 Drag'n'drop mode: Off
00:00:00.724058 ************************* CFGM dump *************************
00:00:00.724060 [/] (level 0)
00:00:00.724062   CSAMEnabled       <integer> = 0x0000000000000001 (1)
00:00:00.724064   CpuExecutionCap   <integer> = 0x0000000000000064 (100)
00:00:00.724065   EnablePAE         <integer> = 0x0000000000000000 (0)
00:00:00.724065   HMEnabled         <integer> = 0x0000000000000001 (1)
00:00:00.724066   MemBalloonSize    <integer> = 0x0000000000000000 (0)
00:00:00.724067   Name              <string>  = "KitKat" (cb=7)
00:00:00.724067   NumCPUs           <integer> = 0x0000000000000001 (1)
00:00:00.724068   PATMEnabled       <integer> = 0x0000000000000001 (1)
00:00:00.724069   PageFusionAllowed <integer> = 0x0000000000000000 (0)
00:00:00.724069   RamHoleSize       <integer> = 0x0000000020000000 (536 870 912, 512 MB)
00:00:00.724070   RamSize           <integer> = 0x0000000040000000 (1 073 741 824, 1 024 MB)
00:00:00.724072   RawR0Enabled      <integer> = 0x0000000000000001 (1)
00:00:00.724072   RawR3Enabled      <integer> = 0x0000000000000001 (1)
00:00:00.724073   TimerMillies      <integer> = 0x000000000000000a (10)
00:00:00.724073   UUID              <bytes>   = "ae 04 99 d2 cb 7a 79 46 b0 77 13 f7 bb 9b 3d 51" (cb=16)
00:00:00.724077 
00:00:00.724077 [/CPUM/] (level 1)
00:00:00.724078   SyntheticCpu <integer> = 0x0000000000000000 (0)
00:00:00.724079 
00:00:00.724079 [/DBGF/] (level 1)
00:00:00.724079   Path <string>  = "G:\MaquinasVirtualesChimpFarm\KitKat720x1280x16\tools\VM/debug/;G:\MaquinasVirtualesChimpFarm\KitKat720x1280x16\tools\VM/;C:\Users\ca.escobar2434/" (cb=147)
00:00:00.724080 
00:00:00.724080 [/Devices/] (level 1)
00:00:00.724081 
00:00:00.724081 [/Devices/8237A/] (level 2)
00:00:00.724082 
00:00:00.724082 [/Devices/8237A/0/] (level 3)
00:00:00.724083   Trusted <integer> = 0x0000000000000001 (1)
00:00:00.724083 
00:00:00.724084 [/Devices/AudioSniffer/] (level 2)
00:00:00.724084 
00:00:00.724085 [/Devices/AudioSniffer/0/] (level 3)
00:00:00.724085 
00:00:00.724085 [/Devices/AudioSniffer/0/Config/] (level 4)
00:00:00.724086 
00:00:00.724086 [/Devices/AudioSniffer/0/LUN#0/] (level 4)
00:00:00.724087   Driver <string>  = "MainAudioSniffer" (cb=17)
00:00:00.724088 
00:00:00.724088 [/Devices/AudioSniffer/0/LUN#0/Config/] (level 5)
00:00:00.724089   Object <integer> = 0x00000000043eae30 (71 216 688)
00:00:00.724090 
00:00:00.724090 [/Devices/VMMDev/] (level 2)
00:00:00.724091 
00:00:00.724091 [/Devices/VMMDev/0/] (level 3)
00:00:00.724092   PCIBusNo      <integer> = 0x0000000000000000 (0)
00:00:00.724093   PCIDeviceNo   <integer> = 0x0000000000000004 (4)
00:00:00.724093   PCIFunctionNo <integer> = 0x0000000000000000 (0)
00:00:00.724094   Trusted       <integer> = 0x0000000000000001 (1)
00:00:00.724094 
00:00:00.724094 [/Devices/VMMDev/0/Config/] (level 4)
00:00:00.724095   GuestCoreDumpDir <string>  = "G:\MaquinasVirtualesChimpFarm\KitKat720x1280x16\tools\VM\Snapshots" (cb=67)
00:00:00.724096   RamSize          <integer> = 0x0000000040000000 (1 073 741 824, 1 024 MB)
00:00:00.724097 
00:00:00.724097 [/Devices/VMMDev/0/LUN#0/] (level 4)
00:00:00.724098   Driver <string>  = "HGCM" (cb=5)
00:00:00.724098 
00:00:00.724099 [/Devices/VMMDev/0/LUN#0/Config/] (level 5)
00:00:00.724099   Object <integer> = 0x0000000003a6c140 (61 260 096)
00:00:00.724100 
00:00:00.724100 [/Devices/VMMDev/0/LUN#999/] (level 4)
00:00:00.724101   Driver <string>  = "MainStatus" (cb=11)
00:00:00.724102 
00:00:00.724102 [/Devices/VMMDev/0/LUN#999/Config/] (level 5)
00:00:00.724103   First   <integer> = 0x0000000000000000 (0)
00:00:00.724103   Last    <integer> = 0x0000000000000000 (0)
00:00:00.724104   papLeds <integer> = 0x00000000043e2948 (71 182 664)
00:00:00.724104 
00:00:00.724105 [/Devices/acpi/] (level 2)
00:00:00.724105 
00:00:00.724105 [/Devices/acpi/0/] (level 3)
00:00:00.724106   PCIBusNo      <integer> = 0x0000000000000000 (0)
00:00:00.724107   PCIDeviceNo   <integer> = 0x0000000000000007 (7)
00:00:00.724107   PCIFunctionNo <integer> = 0x0000000000000000 (0)
00:00:00.724108   Trusted       <integer> = 0x0000000000000001 (1)
00:00:00.724108 
00:00:00.724108 [/Devices/acpi/0/Config/] (level 4)
00:00:00.724109   CpuHotPlug        <integer> = 0x0000000000000000 (0)
00:00:00.724110   FdcEnabled        <integer> = 0x0000000000000000 (0)
00:00:00.724110   HostBusPciAddress <integer> = 0x0000000000000000 (0)
00:00:00.724111   HpetEnabled       <integer> = 0x0000000000000000 (0)
00:00:00.724111   IOAPIC            <integer> = 0x0000000000000000 (0)
00:00:00.724112   IocPciAddress     <integer> = 0x0000000000010000 (65 536)
00:00:00.724113   NumCPUs           <integer> = 0x0000000000000001 (1)
00:00:00.724113   RamHoleSize       <integer> = 0x0000000020000000 (536 870 912, 512 MB)
00:00:00.724114   RamSize           <integer> = 0x0000000040000000 (1 073 741 824, 1 024 MB)
00:00:00.724115   Serial0IoPortBase <integer> = 0x0000000000000000 (0)
00:00:00.724116   Serial0Irq        <integer> = 0x0000000000000000 (0)
00:00:00.724116   Serial1IoPortBase <integer> = 0x0000000000000000 (0)
00:00:00.724117   Serial1Irq        <integer> = 0x0000000000000000 (0)
00:00:00.724117   ShowCpu           <integer> = 0x0000000000000000 (0)
00:00:00.724118   ShowRtc           <integer> = 0x0000000000000000 (0)
00:00:00.724118   SmcEnabled        <integer> = 0x0000000000000000 (0)
00:00:00.724119 
00:00:00.724119 [/Devices/acpi/0/LUN#0/] (level 4)
00:00:00.724120   Driver <string>  = "ACPIHost" (cb=9)
00:00:00.724120 
00:00:00.724120 [/Devices/acpi/0/LUN#0/Config/] (level 5)
00:00:00.724121 
00:00:00.724122 [/Devices/ahci/] (level 2)
00:00:00.724122 
00:00:00.724122 [/Devices/ahci/0/] (level 3)
00:00:00.724123   PCIBusNo      <integer> = 0x0000000000000000 (0)
00:00:00.724124   PCIDeviceNo   <integer> = 0x000000000000000d (13)
00:00:00.724124   PCIFunctionNo <integer> = 0x0000000000000000 (0)
00:00:00.724125   Trusted       <integer> = 0x0000000000000001 (1)
00:00:00.724125 
00:00:00.724125 [/Devices/ahci/0/Config/] (level 4)
00:00:00.724126   Bootable  <integer> = 0x0000000000000001 (1)
00:00:00.724127   PortCount <integer> = 0x0000000000000001 (1)
00:00:00.724127 
00:00:00.724127 [/Devices/ahci/0/Config/Port0/] (level 5)
00:00:00.724128   Hotpluggable        <integer> = 0x0000000000000000 (0)
00:00:00.724129   NonRotationalMedium <integer> = 0x0000000000000000 (0)
00:00:00.724130 
00:00:00.724130 [/Devices/ahci/0/LUN#0/] (level 4)
00:00:00.724131   Driver <string>  = "Block" (cb=6)
00:00:00.724131 
00:00:00.724131 [/Devices/ahci/0/LUN#0/AttachedDriver/] (level 5)
00:00:00.724132   Driver <string>  = "VD" (cb=3)
00:00:00.724133 
00:00:00.724133 [/Devices/ahci/0/LUN#0/AttachedDriver/Config/] (level 6)
00:00:00.724134   BlockCache <integer> = 0x0000000000000001 (1)
00:00:00.724134   Format     <string>  = "VDI" (cb=4)
00:00:00.724135   Path       <string>  = "G:\MaquinasVirtualesChimpFarm\KitKat720x1280x16\tools\VM\Android.vdi" (cb=69)
00:00:00.724136   Type       <string>  = "HardDisk" (cb=9)
00:00:00.724136   UseNewIo   <integer> = 0x0000000000000001 (1)
00:00:00.724137 
00:00:00.724137 [/Devices/ahci/0/LUN#0/Config/] (level 5)
00:00:00.724138   Mountable <integer> = 0x0000000000000000 (0)
00:00:00.724138   Type      <string>  = "HardDisk" (cb=9)
00:00:00.724139 
00:00:00.724139 [/Devices/ahci/0/LUN#999/] (level 4)
00:00:00.724140   Driver <string>  = "MainStatus" (cb=11)
00:00:00.724140 
00:00:00.724140 [/Devices/ahci/0/LUN#999/Config/] (level 5)
00:00:00.724141   DeviceInstance        <string>  = "ahci/0" (cb=7)
00:00:00.724142   First                 <integer> = 0x0000000000000000 (0)
00:00:00.724142   Last                  <integer> = 0x0000000000000000 (0)
00:00:00.724143   pConsole              <integer> = 0x00000000043e2330 (71 181 104)
00:00:00.724144   papLeds               <integer> = 0x00000000043e2678 (71 181 944)
00:00:00.724145   pmapMediumAttachments <integer> = 0x00000000043e2960 (71 182 688)
00:00:00.724145 
00:00:00.724145 [/Devices/apic/] (level 2)
00:00:00.724146 
00:00:00.724146 [/Devices/apic/0/] (level 3)
00:00:00.724147   Trusted <integer> = 0x0000000000000001 (1)
00:00:00.724147 
00:00:00.724148 [/Devices/apic/0/Config/] (level 4)
00:00:00.724148   IOAPIC  <integer> = 0x0000000000000000 (0)
00:00:00.724149   NumCPUs <integer> = 0x0000000000000001 (1)
00:00:00.724149 
00:00:00.724150 [/Devices/e1000/] (level 2)
00:00:00.724150 
00:00:00.724150 [/Devices/e1000/0/] (level 3)
00:00:00.724151   PCIBusNo      <integer> = 0x0000000000000000 (0)
00:00:00.724152   PCIDeviceNo   <integer> = 0x0000000000000003 (3)
00:00:00.724152   PCIFunctionNo <integer> = 0x0000000000000000 (0)
00:00:00.724152   Trusted       <integer> = 0x0000000000000001 (1)
00:00:00.724153 
00:00:00.724153 [/Devices/e1000/0/Config/] (level 4)
00:00:00.724154   AdapterType    <integer> = 0x0000000000000000 (0)
00:00:00.724154   CableConnected <integer> = 0x0000000000000001 (1)
00:00:00.724155   LineSpeed      <integer> = 0x0000000000000000 (0)
00:00:00.724155   MAC            <bytes>   = "08 00 27 0c fc 05" (cb=6)
00:00:00.724156 
00:00:00.724157 [/Devices/e1000/0/LUN#0/] (level 4)
00:00:00.724157   Driver <string>  = "NAT" (cb=4)
00:00:00.724158 
00:00:00.724158 [/Devices/e1000/0/LUN#0/Config/] (level 5)
00:00:00.724159   AliasMode       <integer> = 0x0000000000000000 (0)
00:00:00.724160   BootFile        <string>  = "KitKat.pxe" (cb=11)
00:00:00.724160   DNSProxy        <integer> = 0x0000000000000000 (0)
00:00:00.724161   Network         <string>  = "10.0.2.0/24" (cb=12)
00:00:00.724161   PassDomain      <integer> = 0x0000000000000001 (1)
00:00:00.724162   TFTPPrefix      <string>  = "C:\Users\ca.escobar2434/.VirtualBox\TFTP" (cb=41)
00:00:00.724162   UseHostResolver <integer> = 0x0000000000000000 (0)
00:00:00.724163 
00:00:00.724163 [/Devices/e1000/0/LUN#0/Config/Rule 1/] (level 6)
00:00:00.724164   GuestPort <integer> = 0x00000000000015b3 (5 555)
00:00:00.724165   HostPort  <integer> = 0x000000000000d8ff (55 551)
00:00:00.724165   Protocol  <string>  = "TCP" (cb=4)
00:00:00.724166 
00:00:00.724166 [/Devices/e1000/0/LUN#0/Config/Rule 2/] (level 6)
00:00:00.724167   GuestPort <integer> = 0x00000000000015b2 (5 554)
00:00:00.724167   HostPort  <integer> = 0x000000000000d8f5 (55 541)
00:00:00.724168   Protocol  <string>  = "TCP" (cb=4)
00:00:00.724168 
00:00:00.724169 [/Devices/e1000/0/LUN#999/] (level 4)
00:00:00.724169   Driver <string>  = "MainStatus" (cb=11)
00:00:00.724170 
00:00:00.724170 [/Devices/e1000/0/LUN#999/Config/] (level 5)
00:00:00.724171   First   <integer> = 0x0000000000000000 (0)
00:00:00.724171   Last    <integer> = 0x0000000000000000 (0)
00:00:00.724172   papLeds <integer> = 0x00000000043e2828 (71 182 376)
00:00:00.724172 
00:00:00.724172 [/Devices/i8254/] (level 2)
00:00:00.724173 
00:00:00.724173 [/Devices/i8254/0/] (level 3)
00:00:00.724174 
00:00:00.724174 [/Devices/i8254/0/Config/] (level 4)
00:00:00.724175 
00:00:00.724175 [/Devices/i8259/] (level 2)
00:00:00.724176 
00:00:00.724176 [/Devices/i8259/0/] (level 3)
00:00:00.724177   Trusted <integer> = 0x0000000000000001 (1)
00:00:00.724177 
00:00:00.724177 [/Devices/i8259/0/Config/] (level 4)
00:00:00.724178 
00:00:00.724178 [/Devices/ichac97/] (level 2)
00:00:00.724179 
00:00:00.724179 [/Devices/ichac97/0/] (level 3)
00:00:00.724180   PCIBusNo      <integer> = 0x0000000000000000 (0)
00:00:00.724180   PCIDeviceNo   <integer> = 0x0000000000000005 (5)
00:00:00.724181   PCIFunctionNo <integer> = 0x0000000000000000 (0)
00:00:00.724181   Trusted       <integer> = 0x0000000000000001 (1)
00:00:00.724182 
00:00:00.724182 [/Devices/ichac97/0/Config/] (level 4)
00:00:00.724183 
00:00:00.724183 [/Devices/ichac97/0/LUN#0/] (level 4)
00:00:00.724184   Driver <string>  = "AUDIO" (cb=6)
00:00:00.724184 
00:00:00.724184 [/Devices/ichac97/0/LUN#0/Config/] (level 5)
00:00:00.724185   AudioDriver <string>  = "dsound" (cb=7)
00:00:00.724186   StreamName  <string>  = "KitKat" (cb=7)
00:00:00.724186 
00:00:00.724186 [/Devices/mc146818/] (level 2)
00:00:00.724187 
00:00:00.724187 [/Devices/mc146818/0/] (level 3)
00:00:00.724188 
00:00:00.724188 [/Devices/mc146818/0/Config/] (level 4)
00:00:00.724189   UseUTC <integer> = 0x0000000000000001 (1)
00:00:00.724189 
00:00:00.724189 [/Devices/parallel/] (level 2)
00:00:00.724190 
00:00:00.724190 [/Devices/pcarch/] (level 2)
00:00:00.724191 
00:00:00.724191 [/Devices/pcarch/0/] (level 3)
00:00:00.724191   Trusted <integer> = 0x0000000000000001 (1)
00:00:00.724192 
00:00:00.724192 [/Devices/pcarch/0/Config/] (level 4)
00:00:00.724193 
00:00:00.724193 [/Devices/pcbios/] (level 2)
00:00:00.724194 
00:00:00.724194 [/Devices/pcbios/0/] (level 3)
00:00:00.724195   Trusted <integer> = 0x0000000000000001 (1)
00:00:00.724195 
00:00:00.724195 [/Devices/pcbios/0/Config/] (level 4)
00:00:00.724197   BootDevice0        <string>  = "FLOPPY" (cb=7)
00:00:00.724197   BootDevice1        <string>  = "DVD" (cb=4)
00:00:00.724198   BootDevice2        <string>  = "IDE" (cb=4)
00:00:00.724198   BootDevice3        <string>  = "NONE" (cb=5)
00:00:00.724199   FloppyDevice       <string>  = "i82078" (cb=7)
00:00:00.724199   HardDiskDevice     <string>  = "piix3ide" (cb=9)
00:00:00.724200   IOAPIC             <integer> = 0x0000000000000000 (0)
00:00:00.724200   McfgBase           <integer> = 0x0000000000000000 (0)
00:00:00.724201   McfgLength         <integer> = 0x0000000000000000 (0)
00:00:00.724201   NumCPUs            <integer> = 0x0000000000000001 (1)
00:00:00.724202   PXEDebug           <integer> = 0x0000000000000000 (0)
00:00:00.724202   RamHoleSize        <integer> = 0x0000000020000000 (536 870 912, 512 MB)
00:00:00.724204   RamSize            <integer> = 0x0000000040000000 (1 073 741 824, 1 024 MB)
00:00:00.724205   SataHardDiskDevice <string>  = "ahci" (cb=5)
00:00:00.724205   SataLUN1           <integer> = 0x0000000000000000 (0)
00:00:00.724206   UUID               <bytes>   = "ae 04 99 d2 cb 7a 79 46 b0 77 13 f7 bb 9b 3d 51" (cb=16)
00:00:00.724207 
00:00:00.724207 [/Devices/pcbios/0/Config/NetBoot/] (level 5)
00:00:00.724208 
00:00:00.724208 [/Devices/pcbios/0/Config/NetBoot/0/] (level 6)
00:00:00.724209   NIC           <integer> = 0x0000000000000000 (0)
00:00:00.724210   PCIBusNo      <integer> = 0x0000000000000000 (0)
00:00:00.724210   PCIDeviceNo   <integer> = 0x0000000000000003 (3)
00:00:00.724211   PCIFunctionNo <integer> = 0x0000000000000000 (0)
00:00:00.724211 
00:00:00.724211 [/Devices/pci/] (level 2)
00:00:00.724212 
00:00:00.724212 [/Devices/pci/0/] (level 3)
00:00:00.724213   Trusted <integer> = 0x0000000000000001 (1)
00:00:00.724213 
00:00:00.724213 [/Devices/pci/0/Config/] (level 4)
00:00:00.724214   IOAPIC <integer> = 0x0000000000000000 (0)
00:00:00.724215 
00:00:00.724215 [/Devices/pckbd/] (level 2)
00:00:00.724215 
00:00:00.724215 [/Devices/pckbd/0/] (level 3)
00:00:00.724216   Trusted <integer> = 0x0000000000000001 (1)
00:00:00.724217 
00:00:00.724217 [/Devices/pckbd/0/Config/] (level 4)
00:00:00.724217 
00:00:00.724218 [/Devices/pckbd/0/LUN#0/] (level 4)
00:00:00.724219   Driver <string>  = "KeyboardQueue" (cb=14)
00:00:00.724220 
00:00:00.724220 [/Devices/pckbd/0/LUN#0/AttachedDriver/] (level 5)
00:00:00.724221   Driver <string>  = "MainKeyboard" (cb=13)
00:00:00.724221 
00:00:00.724221 [/Devices/pckbd/0/LUN#0/AttachedDriver/Config/] (level 6)
00:00:00.724222   Object <integer> = 0x0000000003b550a0 (62 214 304)
00:00:00.724223 
00:00:00.724223 [/Devices/pckbd/0/LUN#0/Config/] (level 5)
00:00:00.724232   QueueSize <integer> = 0x0000000000000040 (64)
00:00:00.724233 
00:00:00.724233 [/Devices/pckbd/0/LUN#1/] (level 4)
00:00:00.724234   Driver <string>  = "MouseQueue" (cb=11)
00:00:00.724234 
00:00:00.724235 [/Devices/pckbd/0/LUN#1/AttachedDriver/] (level 5)
00:00:00.724236   Driver <string>  = "MainMouse" (cb=10)
00:00:00.724236 
00:00:00.724236 [/Devices/pckbd/0/LUN#1/AttachedDriver/Config/] (level 6)
00:00:00.724237   Object <integer> = 0x0000000004373080 (70 725 760)
00:00:00.724238 
00:00:00.724238 [/Devices/pckbd/0/LUN#1/Config/] (level 5)
00:00:00.724239   QueueSize <integer> = 0x0000000000000080 (128)
00:00:00.724239 
00:00:00.724240 [/Devices/pcnet/] (level 2)
00:00:00.724240 
00:00:00.724240 [/Devices/piix3ide/] (level 2)
00:00:00.724241 
00:00:00.724241 [/Devices/piix3ide/0/] (level 3)
00:00:00.724242   PCIBusNo      <integer> = 0x0000000000000000 (0)
00:00:00.724242   PCIDeviceNo   <integer> = 0x0000000000000001 (1)
00:00:00.724243   PCIFunctionNo <integer> = 0x0000000000000001 (1)
00:00:00.724243   Trusted       <integer> = 0x0000000000000001 (1)
00:00:00.724244 
00:00:00.724244 [/Devices/piix3ide/0/Config/] (level 4)
00:00:00.724245   Type <string>  = "PIIX4" (cb=6)
00:00:00.724245 
00:00:00.724246 [/Devices/piix3ide/0/Config/SecondaryMaster/] (level 5)
00:00:00.724247   NonRotationalMedium <integer> = 0x0000000000000000 (0)
00:00:00.724247 
00:00:00.724247 [/Devices/piix3ide/0/LUN#2/] (level 4)
00:00:00.724248   Driver <string>  = "Block" (cb=6)
00:00:00.724248 
00:00:00.724249 [/Devices/piix3ide/0/LUN#2/Config/] (level 5)
00:00:00.724249   Mountable <integer> = 0x0000000000000001 (1)
00:00:00.724250   Type      <string>  = "DVD" (cb=4)
00:00:00.724250 
00:00:00.724251 [/Devices/piix3ide/0/LUN#999/] (level 4)
00:00:00.724251   Driver <string>  = "MainStatus" (cb=11)
00:00:00.724252 
00:00:00.724252 [/Devices/piix3ide/0/LUN#999/Config/] (level 5)
00:00:00.724253   DeviceInstance        <string>  = "piix3ide/0" (cb=11)
00:00:00.724253   First                 <integer> = 0x0000000000000000 (0)
00:00:00.724254   Last                  <integer> = 0x0000000000000003 (3)
00:00:00.724255   pConsole              <integer> = 0x00000000043e2330 (71 181 104)
00:00:00.724255   papLeds               <integer> = 0x00000000043e2658 (71 181 912)
00:00:00.724256   pmapMediumAttachments <integer> = 0x00000000043e2960 (71 182 688)
00:00:00.724257 
00:00:00.724257 [/Devices/serial/] (level 2)
00:00:00.724258 
00:00:00.724258 [/Devices/usb-ohci/] (level 2)
00:00:00.724259 
00:00:00.724259 [/Devices/usb-ohci/0/] (level 3)
00:00:00.724260   PCIBusNo      <integer> = 0x0000000000000000 (0)
00:00:00.724260   PCIDeviceNo   <integer> = 0x0000000000000006 (6)
00:00:00.724261   PCIFunctionNo <integer> = 0x0000000000000000 (0)
00:00:00.724261   Trusted       <integer> = 0x0000000000000001 (1)
00:00:00.724262 
00:00:00.724262 [/Devices/usb-ohci/0/Config/] (level 4)
00:00:00.724263 
00:00:00.724263 [/Devices/usb-ohci/0/LUN#0/] (level 4)
00:00:00.724264   Driver <string>  = "VUSBRootHub" (cb=12)
00:00:00.724264 
00:00:00.724264 [/Devices/usb-ohci/0/LUN#0/Config/] (level 5)
00:00:00.724265 
00:00:00.724265 [/Devices/usb-ohci/0/LUN#999/] (level 4)
00:00:00.724266   Driver <string>  = "MainStatus" (cb=11)
00:00:00.724266 
00:00:00.724267 [/Devices/usb-ohci/0/LUN#999/Config/] (level 5)
00:00:00.724268   First   <integer> = 0x0000000000000000 (0)
00:00:00.724268   Last    <integer> = 0x0000000000000000 (0)
00:00:00.724269   papLeds <integer> = 0x00000000043e2950 (71 182 672)
00:00:00.724269 
00:00:00.724269 [/Devices/vga/] (level 2)
00:00:00.724270 
00:00:00.724271 [/Devices/vga/0/] (level 3)
00:00:00.724271   PCIBusNo      <integer> = 0x0000000000000000 (0)
00:00:00.724272   PCIDeviceNo   <integer> = 0x0000000000000002 (2)
00:00:00.724273   PCIFunctionNo <integer> = 0x0000000000000000 (0)
00:00:00.724273   Trusted       <integer> = 0x0000000000000001 (1)
00:00:00.724274 
00:00:00.724274 [/Devices/vga/0/Config/] (level 4)
00:00:00.724275   CustomVideoModes <integer> = 0x0000000000000000 (0)
00:00:00.724276   FadeIn           <integer> = 0x0000000000000001 (1)
00:00:00.724276   FadeOut          <integer> = 0x0000000000000001 (1)
00:00:00.724277   HeightReduction  <integer> = 0x0000000000000000 (0)
00:00:00.724277   LogoFile         <string>  = "" (cb=1)
00:00:00.724278   LogoTime         <integer> = 0x0000000000000000 (0)
00:00:00.724278   MonitorCount     <integer> = 0x0000000000000001 (1)
00:00:00.724279   ShowBootMenu     <integer> = 0x0000000000000002 (2)
00:00:00.724279   VRamSize         <integer> = 0x0000000001000000 (16 777 216, 16 MB)
00:00:00.724280 
00:00:00.724281 [/Devices/vga/0/LUN#0/] (level 4)
00:00:00.724281   Driver <string>  = "MainDisplay" (cb=12)
00:00:00.724282 
00:00:00.724282 [/Devices/vga/0/LUN#0/Config/] (level 5)
00:00:00.724283   Object <integer> = 0x00000000043f73f0 (71 267 312)
00:00:00.724283 
00:00:00.724284 [/Devices/virtio-net/] (level 2)
00:00:00.724284 
00:00:00.724284 [/EM/] (level 1)
00:00:00.724285   TripleFaultReset <integer> = 0x0000000000000000 (0)
00:00:00.724285 
00:00:00.724286 [/HM/] (level 1)
00:00:00.724286   64bitEnabled       <integer> = 0x0000000000000000 (0)
00:00:00.724287   EnableLargePages   <integer> = 0x0000000000000001 (1)
00:00:00.724287   EnableNestedPaging <integer> = 0x0000000000000001 (1)
00:00:00.724288   EnableUX           <integer> = 0x0000000000000001 (1)
00:00:00.724289   EnableVPID         <integer> = 0x0000000000000001 (1)
00:00:00.724289   Exclusive          <integer> = 0x0000000000000000 (0)
00:00:00.724290   HMForced           <integer> = 0x0000000000000000 (0)
00:00:00.724290 
00:00:00.724291 [/MM/] (level 1)
00:00:00.724291   CanUseLargerHeap <integer> = 0x0000000000000000 (0)
00:00:00.724292 
00:00:00.724292 [/PDM/] (level 1)
00:00:00.724292 
00:00:00.724292 [/PDM/AsyncCompletion/] (level 2)
00:00:00.724293 
00:00:00.724293 [/PDM/AsyncCompletion/File/] (level 3)
00:00:00.724294 
00:00:00.724294 [/PDM/AsyncCompletion/File/BwGroups/] (level 4)
00:00:00.724295 
00:00:00.724295 [/PDM/BlkCache/] (level 2)
00:00:00.724296   CacheSize <integer> = 0x0000000000500000 (5 242 880, 5 MB)
00:00:00.724297 
00:00:00.724297 [/PDM/Devices/] (level 2)
00:00:00.724298 
00:00:00.724298 [/PDM/Drivers/] (level 2)
00:00:00.724298 
00:00:00.724298 [/PDM/Drivers/VBoxC/] (level 3)
00:00:00.724299   Path <string>  = "VBoxC" (cb=6)
00:00:00.724300 
00:00:00.724300 [/PDM/NetworkShaper/] (level 2)
00:00:00.724300 
00:00:00.724301 [/PDM/NetworkShaper/BwGroups/] (level 3)
00:00:00.724301 
00:00:00.724301 [/TM/] (level 1)
00:00:00.724302   UTCOffset <integer> = 0x0000000000000000 (0)
00:00:00.724302 
00:00:00.724303 [/USB/] (level 1)
00:00:00.724303 
00:00:00.724303 [/USB/HidMouse/] (level 2)
00:00:00.724304 
00:00:00.724304 [/USB/HidMouse/0/] (level 3)
00:00:00.724305 
00:00:00.724305 [/USB/HidMouse/0/Config/] (level 4)
00:00:00.724306   Mode <string>  = "absolute" (cb=9)
00:00:00.724306 
00:00:00.724306 [/USB/HidMouse/0/LUN#0/] (level 4)
00:00:00.724307   Driver <string>  = "MouseQueue" (cb=11)
00:00:00.724308 
00:00:00.724308 [/USB/HidMouse/0/LUN#0/AttachedDriver/] (level 5)
00:00:00.724309   Driver <string>  = "MainMouse" (cb=10)
00:00:00.724309 
00:00:00.724309 [/USB/HidMouse/0/LUN#0/AttachedDriver/Config/] (level 6)
00:00:00.724310   Object <integer> = 0x0000000004373080 (70 725 760)
00:00:00.724311 
00:00:00.724311 [/USB/HidMouse/0/LUN#0/Config/] (level 5)
00:00:00.724312   QueueSize <integer> = 0x0000000000000080 (128)
00:00:00.724313 
00:00:00.724313 [/USB/USBProxy/] (level 2)
00:00:00.724313 
00:00:00.724314 [/USB/USBProxy/GlobalConfig/] (level 3)
00:00:00.724314 
00:00:00.724315 ********************* End of CFGM dump **********************
00:00:00.724320 VM: fHMEnabled=true  (configured) fRecompileUser=false fRecompileSupervisor=false
00:00:00.724321 VM: fRawRing1Enabled=false CSAM=true  PATM=true 
00:00:00.724391 HMR3Init: VT-x w/ nested paging
00:00:00.724419 MM: cbHyperHeap=0x100000 (1048576)
00:00:00.725789 CPUM: Matched host CPU INTEL 0x6/0x3c/0x3 Intel_Core7_Haswell with CPU DB entry 'Intel Core i5-3570' (INTEL 0x6/0x3a/0x9 Intel_Core7_IvyBridge).
00:00:00.726648 Debug: HCPhysInterPD=00000000c8c5b000 HCPhysInterPaePDPT=00000000c8c58000 HCPhysInterPaePML4=00000000c8c56000
00:00:00.726655 Debug: apInterPTs={00000000c8c5a000,00000000c8c59000} apInterPaePTs={0000000525407000,000000052ca08000} apInterPaePDs={0000000549789000,00000006e180a000,00000006e308b000,000000017fd0c000} pInterPaePDPT64=00000000c8c57000
00:00:00.726660 Host paging mode: AMD64+PGE+NX
00:00:00.726664 PGMPool: cMaxPages=560 (u64MaxPages=545)
00:00:00.726667 pgmR3PoolInit: cMaxPages=0x230 cMaxUsers=0x460 cMaxPhysExts=0x460 fCacheEnable=true 
00:00:00.735273 TM: GIP - u32Mode=1 (SyncTSC) u32UpdateHz=99
00:00:00.766975 TM: cTSCTicksPerSecond=0xd68d7509 (3 599 594 761) fTSCVirtualized=true  fTSCUseRealTSC=false
00:00:00.766978 TM: fMaybeUseOffsettedHostTSC=true  TSCTiedToExecution=false TSCNotTiedToHalt=false
00:00:00.768171 CoreCode: R3=00000000040f0000 R0=fffff88021b15000 RC=a0553000 Phys=00000000c8bfa000 cb=0x1000
00:00:00.768305 AIOMgr: Default manager type is "Async"
00:00:00.768310 AIOMgr: Default file backend is "NonBuffered"
00:00:00.768474 BlkCache: Cache successfully initialised. Cache size is 5242880 bytes
00:00:00.768483 BlkCache: Cache commit interval is 10000 ms
00:00:00.768485 BlkCache: Cache commit threshold is 2621440 bytes
00:00:00.860700 [SMP] BIOS with 1 CPUs
00:00:00.870511 SUP: Loaded VBoxDDR0.r0 (C:\Program Files\Oracle\VirtualBox\VBoxDDR0.r0) at 0xfffff8802499a000 - ModuleInit at 0000000000000000 and ModuleTerm at 0000000000000000 using the native ring-0 loader
00:00:00.870523 SUP: windbg> .reload /f C:\Program Files\Oracle\VirtualBox\VBoxDDR0.r0=0xfffff8802499a000
00:00:00.877852 SUP: Loaded VBoxDD2R0.r0 (C:\Program Files\Oracle\VirtualBox\VBoxDD2R0.r0) at 0xfffff880249be000 - ModuleInit at 0000000000000000 and ModuleTerm at 0000000000000000 using the native ring-0 loader
00:00:00.877861 SUP: windbg> .reload /f C:\Program Files\Oracle\VirtualBox\VBoxDD2R0.r0=0xfffff880249be000
00:00:00.877891 Activating Local APIC
00:00:00.877896 CPUM: SetGuestCpuIdFeature: Enabled APIC
00:00:00.878061 PIT: mode=3 count=0x10000 (65536) - 18.20 Hz (ch=0)
00:00:00.886278 Shared Folders service loaded.
00:00:00.889874 DrvBlock: Flushes will be ignored
00:00:00.889896 DrvBlock: Async flushes will be passed to the disk
00:00:00.890107 VDInit finished
00:00:00.892522 AIOMgr: Endpoint for file 'G:\MaquinasVirtualesChimpFarm\KitKat720x1280x16\tools\VM\Android.vdi' (flags 000c0723) created successfully
00:00:00.895169 VD: Opening the disk took 5255900 ns
00:00:00.895202 AHCI: LUN#0: disk, PCHS=12483/16/63, total number of sectors 12582912
00:00:00.895208 AHCI: LUN#0: using async I/O
00:00:00.895372 AHCI#0: Reset the HBA
00:00:00.895524 PIIX3 ATA: LUN#0: no unit
00:00:00.895530 PIIX3 ATA: LUN#1: no unit
00:00:00.895590 DrvBlock: Flushes will be ignored
00:00:00.895595 DrvBlock: Async flushes will be passed to the disk
00:00:00.895674 PIIX3 ATA: LUN#2: CD/DVD, total number of sectors 0, passthrough disabled
00:00:00.895681 PIIX3 ATA: LUN#3: no unit
00:00:00.895704 PIIX3 ATA: Ctl#0: finished processing RESET
00:00:00.895749 PIIX3 ATA: Ctl#1: finished processing RESET
00:00:00.909641 NAT: DNS#0: 157.253.79.100
00:00:00.909954 Audio: Trying driver 'dsound'.
00:00:00.944156 Audio: set_record_source ars=0 als=0 (not implemented)
00:00:00.982830 VUSB: attached 'HidMouse' to port 1
00:00:00.983202 DevPcBios: SATA LUN#0 LCHS=783/255/63
00:00:00.983242 PGM: The CPU physical address width is 39 bits
00:00:00.983246 PGMR3InitFinalize: 4 MB PSE mask 0000007fffffffff
00:00:01.004409 VMM: Thread-context hooks unavailable.
00:00:01.011463 HM: Using VT-x implementation 2.0!
00:00:01.011464 HM: Host CR4                        = 0x406f8
00:00:01.011465 HM: Host EFER                       = 0xd01
00:00:01.011466 HM: MSR_IA32_FEATURE_CONTROL        = 0x5
00:00:01.011466 HM: MSR_IA32_VMX_BASIC_INFO         = 0xda040000000012
00:00:01.011467 HM:   VMCS id                             = 0x12
00:00:01.011467 HM:   VMCS size                           = 1024 bytes
00:00:01.011468 HM:   VMCS physical address limit         = None
00:00:01.011468 HM:   VMCS memory type                    = 0x6
00:00:01.011469 HM:   Dual-monitor treatment support      = true 
00:00:01.011470 HM:   OUTS & INS instruction-info         = true 
00:00:01.011470 HM: Max resume loops                = 1024
00:00:01.011470 HM: MSR_IA32_VMX_PINBASED_CTLS      = 0x7f00000016
00:00:01.011480 HM:   VMX_VMCS_CTRL_PIN_EXEC_EXT_INT_EXIT
00:00:01.011480 HM:   VMX_VMCS_CTRL_PIN_EXEC_NMI_EXIT
00:00:01.011482 HM:   VMX_VMCS_CTRL_PIN_EXEC_VIRTUAL_NMI
00:00:01.011482 HM:   VMX_VMCS_CTRL_PIN_EXEC_PREEMPT_TIMER
00:00:01.011482 HM: MSR_IA32_VMX_PROCBASED_CTLS     = 0xfff9fffe0401e172
00:00:01.011483 HM:   VMX_VMCS_CTRL_PROC_EXEC_INT_WINDOW_EXIT
00:00:01.011483 HM:   VMX_VMCS_CTRL_PROC_EXEC_USE_TSC_OFFSETTING
00:00:01.011484 HM:   VMX_VMCS_CTRL_PROC_EXEC_HLT_EXIT
00:00:01.011484 HM:   VMX_VMCS_CTRL_PROC_EXEC_INVLPG_EXIT
00:00:01.011484 HM:   VMX_VMCS_CTRL_PROC_EXEC_MWAIT_EXIT
00:00:01.011485 HM:   VMX_VMCS_CTRL_PROC_EXEC_RDPMC_EXIT
00:00:01.011486 HM:   VMX_VMCS_CTRL_PROC_EXEC_RDTSC_EXIT
00:00:01.011486 HM:   VMX_VMCS_CTRL_PROC_EXEC_CR3_LOAD_EXIT
00:00:01.011486 HM:   VMX_VMCS_CTRL_PROC_EXEC_CR3_LOAD_EXIT (must be set)
00:00:01.011487 HM:   VMX_VMCS_CTRL_PROC_EXEC_CR3_STORE_EXIT
00:00:01.011487 HM:   VMX_VMCS_CTRL_PROC_EXEC_CR3_STORE_EXIT (must be set)
00:00:01.011487 HM:   VMX_VMCS_CTRL_PROC_EXEC_CR8_LOAD_EXIT
00:00:01.011487 HM:   VMX_VMCS_CTRL_PROC_EXEC_CR8_STORE_EXIT
00:00:01.011488 HM:   VMX_VMCS_CTRL_PROC_EXEC_USE_TPR_SHADOW
00:00:01.011488 HM:   VMX_VMCS_CTRL_PROC_EXEC_NMI_WINDOW_EXIT
00:00:01.011488 HM:   VMX_VMCS_CTRL_PROC_EXEC_MOV_DR_EXIT
00:00:01.011488 HM:   VMX_VMCS_CTRL_PROC_EXEC_UNCOND_IO_EXIT
00:00:01.011489 HM:   VMX_VMCS_CTRL_PROC_EXEC_USE_IO_BITMAPS
00:00:01.011489 HM:   VMX_VMCS_CTRL_PROC_EXEC_MONITOR_TRAP_FLAG
00:00:01.011489 HM:   VMX_VMCS_CTRL_PROC_EXEC_USE_MSR_BITMAPS
00:00:01.011489 HM:   VMX_VMCS_CTRL_PROC_EXEC_MONITOR_EXIT
00:00:01.011490 HM:   VMX_VMCS_CTRL_PROC_EXEC_PAUSE_EXIT
00:00:01.011490 HM:   VMX_VMCS_CTRL_PROC_EXEC_USE_SECONDARY_EXEC_CTRL
00:00:01.011491 HM: MSR_IA32_VMX_PROCBASED_CTLS2    = 0x7cff00000000
00:00:01.011492 HM:   VMX_VMCS_CTRL_PROC_EXEC2_VIRT_APIC
00:00:01.011492 HM:   VMX_VMCS_CTRL_PROC_EXEC2_EPT
00:00:01.011492 HM:   VMX_VMCS_CTRL_PROC_EXEC2_DESCRIPTOR_TABLE_EXIT
00:00:01.011493 HM:   VMX_VMCS_CTRL_PROC_EXEC2_RDTSCP
00:00:01.011493 HM:   VMX_VMCS_CTRL_PROC_EXEC2_VIRT_X2APIC
00:00:01.011493 HM:   VMX_VMCS_CTRL_PROC_EXEC2_VPID
00:00:01.011493 HM:   VMX_VMCS_CTRL_PROC_EXEC2_WBINVD_EXIT
00:00:01.011494 HM:   VMX_VMCS_CTRL_PROC_EXEC2_UNRESTRICTED_GUEST
00:00:01.011494 HM:   VMX_VMCS_CTRL_PROC_EXEC2_PAUSE_LOOP_EXIT
00:00:01.011494 HM:   VMX_VMCS_CTRL_PROC_EXEC2_RDRAND_EXIT
00:00:01.011494 HM:   VMX_VMCS_CTRL_PROC_EXEC2_INVPCID
00:00:01.011495 HM:   VMX_VMCS_CTRL_PROC_EXEC2_VMFUNC
00:00:01.011495 HM: MSR_IA32_VMX_ENTRY_CTLS         = 0xffff000011ff
00:00:01.011496 HM:   VMX_VMCS_CTRL_ENTRY_LOAD_DEBUG
00:00:01.011496 HM:   VMX_VMCS_CTRL_ENTRY_LOAD_DEBUG (must be set)
00:00:01.011496 HM:   VMX_VMCS_CTRL_ENTRY_IA32E_MODE_GUEST
00:00:01.011496 HM:   VMX_VMCS_CTRL_ENTRY_ENTRY_SMM
00:00:01.011498 HM:   VMX_VMCS_CTRL_ENTRY_DEACTIVATE_DUALMON
00:00:01.011498 HM:   VMX_VMCS_CTRL_ENTRY_LOAD_GUEST_PERF_MSR
00:00:01.011498 HM:   VMX_VMCS_CTRL_ENTRY_LOAD_GUEST_PAT_MSR
00:00:01.011498 HM:   VMX_VMCS_CTRL_ENTRY_LOAD_GUEST_EFER_MSR
00:00:01.011499 HM: MSR_IA32_VMX_EXIT_CTLS          = 0x7fffff00036dff
00:00:01.011499 HM:   VMX_VMCS_CTRL_EXIT_SAVE_DEBUG
00:00:01.011500 HM:   VMX_VMCS_CTRL_EXIT_SAVE_DEBUG (must be set)
00:00:01.011500 HM:   VMX_VMCS_CTRL_EXIT_HOST_ADDR_SPACE_SIZE
00:00:01.011500 HM:   VMX_VMCS_CTRL_EXIT_LOAD_PERF_MSR
00:00:01.011501 HM:   VMX_VMCS_CTRL_EXIT_ACK_EXT_INT
00:00:01.011501 HM:   VMX_VMCS_CTRL_EXIT_SAVE_GUEST_PAT_MSR
00:00:01.011502 HM:   VMX_VMCS_CTRL_EXIT_LOAD_HOST_PAT_MSR
00:00:01.011502 HM:   VMX_VMCS_CTRL_EXIT_SAVE_GUEST_EFER_MSR
00:00:01.011502 HM:   VMX_VMCS_CTRL_EXIT_LOAD_HOST_EFER_MSR
00:00:01.011503 HM:   VMX_VMCS_CTRL_EXIT_SAVE_VMX_PREEMPT_TIMER
00:00:01.011503 HM: MSR_IA32_VMX_EPT_VPID_CAP       = 0xf0106334141
00:00:01.011503 HM:   MSR_IA32_VMX_EPT_VPID_CAP_RWX_X_ONLY
00:00:01.011504 HM:   MSR_IA32_VMX_EPT_VPID_CAP_GAW_48_BITS
00:00:01.011504 HM:   MSR_IA32_VMX_EPT_VPID_CAP_EMT_UC
00:00:01.011504 HM:   MSR_IA32_VMX_EPT_VPID_CAP_EMT_WB
00:00:01.011505 HM:   MSR_IA32_VMX_EPT_VPID_CAP_SP_21_BITS
00:00:01.011505 HM:   MSR_IA32_VMX_EPT_VPID_CAP_SP_30_BITS
00:00:01.011505 HM:   MSR_IA32_VMX_EPT_VPID_CAP_INVEPT
00:00:01.011505 HM:   MSR_IA32_VMX_EPT_VPID_CAP_INVEPT_SINGLE_CONTEXT
00:00:01.011506 HM:   MSR_IA32_VMX_EPT_VPID_CAP_INVEPT_ALL_CONTEXTS
00:00:01.011506 HM:   MSR_IA32_VMX_EPT_VPID_CAP_INVVPID
00:00:01.011506 HM:   MSR_IA32_VMX_EPT_VPID_CAP_INVVPID_INDIV_ADDR
00:00:01.011506 HM:   MSR_IA32_VMX_EPT_VPID_CAP_INVVPID_SINGLE_CONTEXT
00:00:01.011507 HM:   MSR_IA32_VMX_EPT_VPID_CAP_INVVPID_ALL_CONTEXTS
00:00:01.011507 HM:   MSR_IA32_VMX_EPT_VPID_CAP_INVVPID_SINGLE_CONTEXT_RETAIN_GLOBALS
00:00:01.011507 HM: MSR_IA32_VMX_MISC               = 0x300481e5
00:00:01.011508 HM:   MSR_IA32_VMX_MISC_PREEMPT_TSC_BIT      = 0x5
00:00:01.011508 HM:   MSR_IA32_VMX_MISC_STORE_EFERLMA_VMEXIT = true 
00:00:01.011508 HM:   MSR_IA32_VMX_MISC_ACTIVITY_STATES      = 0x7
00:00:01.011509 HM:   MSR_IA32_VMX_MISC_CR3_TARGET           = 0x4
00:00:01.011509 HM:   MSR_IA32_VMX_MISC_MAX_MSR              = 512
00:00:01.011509 HM:   MSR_IA32_VMX_MISC_RDMSR_SMBASE_MSR_SMM = true 
00:00:01.011510 HM:   MSR_IA32_VMX_MISC_SMM_MONITOR_CTL_B2   = true 
00:00:01.011510 HM:   MSR_IA32_VMX_MISC_VMWRITE_VMEXIT_INFO  = true 
00:00:01.011510 HM:   MSR_IA32_VMX_MISC_MSEG_ID              = 0x0
00:00:01.011511 HM: MSR_IA32_VMX_CR0_FIXED0         = 0x80000021
00:00:01.011511 HM: MSR_IA32_VMX_CR0_FIXED1         = 0xffffffff
00:00:01.011512 HM: MSR_IA32_VMX_CR4_FIXED0         = 0x2000
00:00:01.011512 HM: MSR_IA32_VMX_CR4_FIXED1         = 0x1767ff
00:00:01.011513 HM: MSR_IA32_VMX_VMCS_ENUM          = 0x2a
00:00:01.011514 HM:   MSR_IA32_VMX_VMCS_ENUM_HIGHEST_INDEX   = 0x15
00:00:01.011514 HM: MSR_A32_VMX_VMFUNC              = 0x1
00:00:01.011514 HM:   VMX_VMCS_CTRL_VMFUNC_EPTP_SWITCHING
00:00:01.011515 HM: APIC-access page physaddr       = 0x00000000c8bf9000
00:00:01.011515 HM: VCPU  0: MSR bitmap physaddr    = 0x00000000c8bf6000
00:00:01.011516 HM: VCPU  0: VMCS physaddr          = 0x00000000c8bf8000
00:00:01.011517 HM: Guest support: 32-bit only.
00:00:01.011520 HM: Supports VMCS EFER fields       = true 
00:00:01.011521 HM: VMX enabled!
00:00:01.011527 CPUM: SetGuestCpuIdFeature: Enabled SYSENTER/EXIT
00:00:01.011527 HM: Nested paging enabled!
00:00:01.011528 HM:   EPT flush type                = VMX_FLUSH_EPT_SINGLE_CONTEXT
00:00:01.011528 HM: Unrestricted guest execution enabled!
00:00:01.011528 HM: Large page support enabled!
00:00:01.011529 HM: VPID enabled!
00:00:01.011529 HM:   VPID flush type               = VMX_FLUSH_VPID_SINGLE_CONTEXT
00:00:01.011531 HM: VMX-preemption timer enabled (cPreemptTimerShift=5).
00:00:01.011531 HM: VT-x/AMD-V init method: LOCAL
00:00:01.011532 VMM: fUsePeriodicPreemptionTimers=false
00:00:01.011544 Logical host processors: 8 present, 8 max, 8 online, online mask: 00000000000000ff
00:00:01.011972 Physical host cores: 4
00:00:01.011973 ************************* CPUID dump ************************
00:00:01.011977          RAW Standard CPUIDs
00:00:01.011977      Function  eax      ebx      ecx      edx
00:00:01.011978 Gst: 00000000  00000005 756e6547 6c65746e 49656e69
00:00:01.011979 Hst:           0000000d 756e6547 6c65746e 49656e69
00:00:01.011980 Gst: 00000001  000306c3 00000800 00000209 078bfbbf
00:00:01.011981 Hst:           000306c3 00100800 7ffafbff bfebfbff
00:00:01.011981 Gst: 00000002  76036301 00f0b5ff 00000000 00c10000
00:00:01.011982 Hst:           76036301 00f0b5ff 00000000 00c10000
00:00:01.011983 Gst: 00000003  00000000 00000000 00000000 00000000
00:00:01.011983 Hst:           00000000 00000000 00000000 00000000
00:00:01.011984 Gst: 00000004  00000000 00000000 00000000 00000000
00:00:01.011984 Hst:           1c004121 01c0003f 0000003f 00000000
00:00:01.011985 Gst: 00000005  00000040 00000040 00000000 00000000
00:00:01.011985 Hst:           00000040 00000040 00000003 00042120
00:00:01.011986 Hst: 00000006  00000077 00000002 00000009 00000000
00:00:01.011987 Hst: 00000007  00000000 000027ab 00000000 00000000
00:00:01.011987 Hst: 00000008  00000000 00000000 00000000 00000000
00:00:01.011988 Hst: 00000009  00000000 00000000 00000000 00000000
00:00:01.011988 Hst: 0000000a  07300403 00000000 00000000 00000603
00:00:01.011989 Hst: 0000000b  00000001 00000002 00000100 00000000
00:00:01.011990 Hst: 0000000c  00000000 00000000 00000000 00000000
00:00:01.011990 Hst: 0000000d  00000007 00000340 00000340 00000000
00:00:01.011991 Name:                            GenuineIntel
00:00:01.011991 Supports:                        0-5
00:00:01.011992 Family:                          6  	Extended: 0 	Effective: 6
00:00:01.011992 Model:                           12  	Extended: 3 	Effective: 60
00:00:01.011993 Stepping:                        3
00:00:01.011993 Type:                            0 (primary)
00:00:01.011993 APIC ID:                         0x00
00:00:01.011994 Logical CPUs:                    0
00:00:01.011994 CLFLUSH Size:                    8
00:00:01.011994 Brand ID:                        0x00
00:00:01.011995 Mnemonic - Description                 = guest (host)
00:00:01.011995 FPU - x87 FPU on Chip                  = 1 (1)
00:00:01.011995 VME - Virtual 8086 Mode Enhancements   = 1 (1)
00:00:01.011996 DE - Debugging extensions              = 1 (1)
00:00:01.011996 PSE - Page Size Extension              = 1 (1)
00:00:01.011996 TSC - Time Stamp Counter               = 1 (1)
00:00:01.011997 MSR - Model Specific Registers         = 1 (1)
00:00:01.011997 PAE - Physical Address Extension       = 0 (1)
00:00:01.011997 MCE - Machine Check Exception          = 1 (1)
00:00:01.011998 CX8 - CMPXCHG8B instruction            = 1 (1)
00:00:01.011998 APIC - APIC On-Chip                    = 1 (1)
00:00:01.011998 10 - Reserved                          = 0 (0)
00:00:01.011998 SEP - SYSENTER and SYSEXIT             = 1 (1)
00:00:01.011999 MTRR - Memory Type Range Registers     = 1 (1)
00:00:01.011999 PGE - PTE Global Bit                   = 1 (1)
00:00:01.011999 MCA - Machine Check Architecture       = 1 (1)
00:00:01.012000 CMOV - Conditional Move Instructions   = 1 (1)
00:00:01.012001 PAT - Page Attribute Table             = 1 (1)
00:00:01.012001 PSE-36 - 36-bit Page Size Extention    = 1 (1)
00:00:01.012001 PSN - Processor Serial Number          = 0 (0)
00:00:01.012002 CLFSH - CLFLUSH Instruction.           = 1 (1)
00:00:01.012002 20 - Reserved                          = 0 (0)
00:00:01.012002 DS - Debug Store                       = 0 (1)
00:00:01.012003 ACPI - Thermal Mon. & Soft. Clock Ctrl.= 0 (1)
00:00:01.012003 MMX - Intel MMX Technology             = 1 (1)
00:00:01.012003 FXSR - FXSAVE and FXRSTOR Instructions = 1 (1)
00:00:01.012003 SSE - SSE Support                      = 1 (1)
00:00:01.012005 SSE2 - SSE2 Support                    = 1 (1)
00:00:01.012005 SS - Self Snoop                        = 0 (1)
00:00:01.012005 HTT - Hyper-Threading Technology       = 0 (1)
00:00:01.012006 TM - Thermal Monitor                   = 0 (1)
00:00:01.012006 30 - Reserved                          = 0 (0)
00:00:01.012006 PBE - Pending Break Enable             = 0 (1)
00:00:01.012007 Supports SSE3                          = 1 (1)
00:00:01.012007 PCLMULQDQ                              = 0 (1)
00:00:01.012007 DS Area 64-bit layout                  = 0 (1)
00:00:01.012007 Supports MONITOR/MWAIT                 = 1 (1)
00:00:01.012008 CPL-DS - CPL Qualified Debug Store     = 0 (1)
00:00:01.012008 VMX - Virtual Machine Technology       = 0 (1)
00:00:01.012008 SMX - Safer Mode Extensions            = 0 (1)
00:00:01.012009 Enhanced SpeedStep Technology          = 0 (1)
00:00:01.012009 Terminal Monitor 2                     = 0 (1)
00:00:01.012009 Supplemental SSE3 instructions         = 1 (1)
00:00:01.012009 L1 Context ID                          = 0 (0)
00:00:01.012010 11 - Reserved                          = 0 (1)
00:00:01.012010 FMA extensions using YMM state         = 0 (1)
00:00:01.012010 CMPXCHG16B instruction                 = 0 (1)
00:00:01.012011 xTPR Update Control                    = 0 (1)
00:00:01.012011 Perf/Debug Capability MSR              = 0 (1)
00:00:01.012011 16 - Reserved                          = 0 (0)
00:00:01.012012 PCID - Process-context identifiers     = 0 (1)
00:00:01.012012 DCA - Direct Cache Access              = 0 (0)
00:00:01.012012 SSE4.1 instruction extensions          = 0 (1)
00:00:01.012012 SSE4.2 instruction extensions          = 0 (1)
00:00:01.012013 Supports the x2APIC extensions         = 0 (1)
00:00:01.012013 MOVBE instruction                      = 0 (1)
00:00:01.012013 POPCNT instruction                     = 0 (1)
00:00:01.012014 TSC-Deadline LAPIC timer mode          = 0 (1)
00:00:01.012014 AESNI instruction extensions           = 0 (1)
00:00:01.012014 XSAVE/XRSTOR extended state feature    = 0 (1)
00:00:01.012015 Supports OSXSAVE                       = 0 (1)
00:00:01.012015 AVX instruction extensions             = 0 (1)
00:00:01.012015 16-bit floating point conversion instr = 0 (1)
00:00:01.012015 RDRAND instruction                     = 0 (1)
00:00:01.012016 Hypervisor Present (we're a guest)     = 0 (0)
00:00:01.012016 
00:00:01.012016          RAW Extended CPUIDs
00:00:01.012016      Function  eax      ebx      ecx      edx
00:00:01.012017 Gst: 80000000  80000008 00000000 00000000 00000000
00:00:01.012018 Hst:           80000008 00000000 00000000 00000000
00:00:01.012018 Gst: 80000001  00000000 00000000 00000000 08000000
00:00:01.012019 Hst:           00000000 00000000 00000021 2c100800
00:00:01.012020 Gst: 80000002  65746e49 2952286c 726f4320 4d542865
00:00:01.012020 Hst:           65746e49 2952286c 726f4320 4d542865
00:00:01.012022 Gst: 80000003  37692029 3937342d 50432030 20402055
00:00:01.012022 Hst:           37692029 3937342d 50432030 20402055
00:00:01.012023 Gst: 80000004  30362e33 007a4847 00000000 00000000
00:00:01.012024 Hst:           30362e33 007a4847 00000000 00000000
00:00:01.012024 Gst: 80000005  00000000 00000000 00000000 00000000
00:00:01.012025 Hst:           00000000 00000000 00000000 00000000
00:00:01.012025 Gst: 80000006  00000000 00000000 01006040 00000000
00:00:01.012026 Hst:           00000000 00000000 01006040 00000000
00:00:01.012026 Gst: 80000007  00000000 00000000 00000000 00000000
00:00:01.012027 Hst:           00000000 00000000 00000000 00000100
00:00:01.012027 Gst: 80000008  00003027 00000000 00000000 00000000
00:00:01.012028 Hst:           00003027 00000000 00000000 00000000
00:00:01.012028 Gst: 80000009  00000007 00000340 00000340 00000000*
00:00:01.012029 Hst:           00000007 00000340 00000340 00000000
00:00:01.012029 Ext Name:                        
00:00:01.012030 Ext Supports:                    0x80000000-0x80000008
00:00:01.012030 Family:                          0  	Extended: 0 	Effective: 0
00:00:01.012031 Model:                           0  	Extended: 0 	Effective: 0
00:00:01.012031 Stepping:                        0
00:00:01.012031 Brand ID:                        0x000
00:00:01.012032 Mnemonic - Description                 = guest (host)
00:00:01.012032 FPU - x87 FPU on Chip                  = 0 (0)
00:00:01.012033 VME - Virtual 8086 Mode Enhancements   = 0 (0)
00:00:01.012033 DE - Debugging extensions              = 0 (0)
00:00:01.012033 PSE - Page Size Extension              = 0 (0)
00:00:01.012033 TSC - Time Stamp Counter               = 0 (0)
00:00:01.012034 MSR - K86 Model Specific Registers     = 0 (0)
00:00:01.012034 PAE - Physical Address Extension       = 0 (0)
00:00:01.012034 MCE - Machine Check Exception          = 0 (0)
00:00:01.012035 CX8 - CMPXCHG8B instruction            = 0 (0)
00:00:01.012035 APIC - APIC On-Chip                    = 0 (0)
00:00:01.012035 10 - Reserved                          = 0 (0)
00:00:01.012036 SEP - SYSCALL and SYSRET               = 0 (1)
00:00:01.012036 MTRR - Memory Type Range Registers     = 0 (0)
00:00:01.012036 PGE - PTE Global Bit                   = 0 (0)
00:00:01.012036 MCA - Machine Check Architecture       = 0 (0)
00:00:01.012037 CMOV - Conditional Move Instructions   = 0 (0)
00:00:01.012037 PAT - Page Attribute Table             = 0 (0)
00:00:01.012037 PSE-36 - 36-bit Page Size Extention    = 0 (0)
00:00:01.012038 18 - Reserved                          = 0 (0)
00:00:01.012038 19 - Reserved                          = 0 (0)
00:00:01.012038 NX - No-Execute Page Protection        = 0 (1)
00:00:01.012039 DS - Debug Store                       = 0 (0)
00:00:01.012039 AXMMX - AMD Extensions to MMX Instr.   = 0 (0)
00:00:01.012039 MMX - Intel MMX Technology             = 0 (0)
00:00:01.012039 FXSR - FXSAVE and FXRSTOR Instructions = 0 (0)
00:00:01.012040 25 - AMD fast FXSAVE and FXRSTOR Instr.= 0 (0)
00:00:01.012040 26 - 1 GB large page support           = 0 (1)
00:00:01.012040 27 - RDTSCP instruction                = 1 (1)
00:00:01.012041 28 - Reserved                          = 0 (0)
00:00:01.012043 29 - AMD Long Mode                     = 0 (1)
00:00:01.012043 30 - AMD Extensions to 3DNow!          = 0 (0)
00:00:01.012044 31 - AMD 3DNow!                        = 0 (0)
00:00:01.012044 LahfSahf - LAHF/SAHF in 64-bit mode    = 0 (1)
00:00:01.012045 CmpLegacy - Core MP legacy mode (depr) = 0 (0)
00:00:01.012045 SVM - AMD VM Extensions                = 0 (0)
00:00:01.012045 APIC registers starting at 0x400       = 0 (0)
00:00:01.012046 AltMovCR8 - LOCK MOV CR0 means MOV CR8 = 0 (0)
00:00:01.012046 5  - Advanced bit manipulation         = 0 (1)
00:00:01.012046 6  - SSE4A instruction support         = 0 (0)
00:00:01.012047 7  - Misaligned SSE mode               = 0 (0)
00:00:01.012047 8  - PREFETCH and PREFETCHW instruction= 0 (0)
00:00:01.012047 9  - OS visible workaround             = 0 (0)
00:00:01.012048 10 - Instruction based sampling        = 0 (0)
00:00:01.012048 11 - SSE5 support                      = 0 (0)
00:00:01.012048 12 - SKINIT, STGI, and DEV support     = 0 (0)
00:00:01.012049 13 - Watchdog timer support.           = 0 (0)
00:00:01.012049 31:14 - Reserved                       = 0x0 (0x0)
00:00:01.012049 Full Name:                       Intel(R) Core(TM) i7-4790 CPU @ 3.60GHz
00:00:01.012050 TLB 2/4M Instr/Uni:              res0     0 entries
00:00:01.012050 TLB 2/4M Data:                   res0     0 entries
00:00:01.012051 TLB 4K Instr/Uni:                res0     0 entries
00:00:01.012051 TLB 4K Data:                     res0     0 entries
00:00:01.012052 L1 Instr Cache Line Size:        0 bytes
00:00:01.012052 L1 Instr Cache Lines Per Tag:    0
00:00:01.012052 L1 Instr Cache Associativity:    res0  
00:00:01.012052 L1 Instr Cache Size:             0 KB
00:00:01.012053 L1 Data Cache Line Size:         0 bytes
00:00:01.012053 L1 Data Cache Lines Per Tag:     0
00:00:01.012053 L1 Data Cache Associativity:     res0  
00:00:01.012053 L1 Data Cache Size:              0 KB
00:00:01.012054 L2 TLB 2/4M Instr/Uni:           off       0 entries
00:00:01.012054 L2 TLB 2/4M Data:                off       0 entries
00:00:01.012055 L2 TLB 4K Instr/Uni:             off       0 entries
00:00:01.012055 L2 TLB 4K Data:                  off       0 entries
00:00:01.012055 L2 Cache Line Size:              0 bytes
00:00:01.012055 L2 Cache Lines Per Tag:          0
00:00:01.012056 L2 Cache Associativity:          off   
00:00:01.012056 L2 Cache Size:                   0 KB
00:00:01.012056 Host Invariant-TSC support:      true 
00:00:01.012057 APM Features:                   
00:00:01.012057 Physical Address Width:          39 bits
00:00:01.012057 Virtual Address Width:           48 bits
00:00:01.012058 Guest Physical Address Width:    0 bits
00:00:01.012058 Physical Core Count:             0
00:00:01.012058 
00:00:01.012058          RAW Centaur CPUIDs
00:00:01.012059      Function  eax      ebx      ecx      edx
00:00:01.012059 Gst: c0000000  00000007 00000340 00000340 00000000
00:00:01.012060 Hst:           00000007 00000340 00000340 00000000
00:00:01.012060 Gst: c0000001  00000007 00000340 00000340 00000000
00:00:01.012061 Hst:           00000007 00000340 00000340 00000000
00:00:01.012062 Gst: c0000002  00000007 00000340 00000340 00000000
00:00:01.012062 Hst:           00000007 00000340 00000340 00000000
00:00:01.012062 Gst: c0000003  00000007 00000340 00000340 00000000
00:00:01.012063 Hst:           00000007 00000340 00000340 00000000
00:00:01.012063 Centaur Supports:                0xc0000000-0x00000007
00:00:01.012064 Mnemonic - Description                 = guest (host)
00:00:01.012064 AIS - Alternate Instruction Set        = 0 (0)
00:00:01.012065 AIS-E - AIS enabled                    = 0 (0)
00:00:01.012065 RNG - Random Number Generator          = 0 (0)
00:00:01.012065 RNG-E - RNG enabled                    = 0 (0)
00:00:01.012066 LH - LongHaul MSR 0000_110Ah           = 0 (0)
00:00:01.012066 FEMMS - FEMMS                          = 0 (0)
00:00:01.012066 ACE - Advanced Cryptography Engine     = 0 (0)
00:00:01.012066 ACE-E - ACE enabled                    = 0 (0)
00:00:01.012067 ACE2 - Advanced Cryptography Engine 2  = 0 (0)
00:00:01.012067 ACE2-E - ACE enabled                   = 0 (0)
00:00:01.012067 PHE - Padlock Hash Engine              = 0 (0)
00:00:01.012068 PHE-E - PHE enabled                    = 0 (0)
00:00:01.012068 PMM - Montgomery Multiplier            = 0 (0)
00:00:01.012068 PMM-E - PMM enabled                    = 0 (0)
00:00:01.012069 14 - Reserved                          = 0 (0)
00:00:01.012069 15 - Reserved                          = 0 (0)
00:00:01.012069 Parallax                               = 0 (0)
00:00:01.012069 Parallax enabled                       = 0 (0)
00:00:01.012070 Overstress                             = 0 (0)
00:00:01.012070 Overstress enabled                     = 0 (0)
00:00:01.012070 TM3 - Temperature Monitoring 3         = 0 (0)
00:00:01.012071 TM3-E - TM3 enabled                    = 0 (0)
00:00:01.012071 RNG2 - Random Number Generator 2       = 0 (0)
00:00:01.012071 RNG2-E - RNG2 enabled                  = 0 (0)
00:00:01.012071 24 - Reserved                          = 0 (0)
00:00:01.012072 PHE2 - Padlock Hash Engine 2           = 0 (0)
00:00:01.012072 PHE2-E - PHE2 enabled                  = 0 (0)
00:00:01.012072 
00:00:01.012073 
00:00:01.012073 ******************** End of CPUID dump **********************
00:00:01.027905 VM: Halt method global1 (5)
00:00:01.027916 HaltedGlobal1 config: cNsSpinBlockThresholdCfg=125000
00:00:01.027920 Changing the VM state from 'CREATING' to 'CREATED'.
00:00:01.028044 Changing the VM state from 'CREATED' to 'POWERING_ON'.
00:00:01.030937 NAT: set redirect TCP host 0.0.0.0:55541 => guest 10.0.2.15:5554
00:00:01.038714 NAT: set redirect TCP host 0.0.0.0:55551 => guest 10.0.2.15:5555
00:00:01.038768 AIOMgr: Endpoints without assigned bandwidth groups:
00:00:01.038772 AIOMgr:     G:\MaquinasVirtualesChimpFarm\KitKat720x1280x16\tools\VM\Android.vdi
00:00:01.038856 Changing the VM state from 'POWERING_ON' to 'RUNNING'.
00:00:01.040542 Guest Log: BIOS: VirtualBox 4.3.40
00:00:01.040601 PIT: mode=2 count=0x10000 (65536) - 18.20 Hz (ch=0)
00:00:01.048136 PIIX3 ATA: Ctl#1: RESET, DevSel=0 AIOIf=0 CmdIf0=0x00 (-1 usec ago) CmdIf1=0x00 (-1 usec ago)
00:00:01.048164 PIIX3 ATA: Ctl#1: finished processing RESET
00:00:01.053869 AHCI#0: Reset the HBA
00:00:01.053906 AHCI#0: Port 0 reset
00:00:01.054213 Guest Log: BIOS: AHCI 0-P#0: PCHS=12483/16/63 LCHS=783/255/63 12582912 sectors
00:00:01.054239 PIT: mode=2 count=0x48d3 (18643) - 64.00 Hz (ch=0)
00:00:01.056239 ERROR [COM]: aRC=VBOX_E_IPRT_ERROR (0x80bb0005) aIID={480b372c-c0b5-4c23-9bd7-dcbb85b1594c} aComponent={Display} aText={Could not take a screenshot (VERR_NOT_SUPPORTED)}, preserve=false
00:00:01.059568 Display::handleDisplayResize(): uScreenId = 0, pvVRAM=000000000a1e0000 w=640 h=480 bpp=32 cbLine=0xA00, flags=0x1
00:00:01.059583 UIFrameBuffer::RequestResize: Screen=0, Format=843204434, BitsPerPixel=32, BytesPerLine=2560, Size=640x480, Sending to async-handler..
00:00:01.059619 UIFrameBufferQImage::resizeEvent: Format=843204434, BitsPerPixel=32, BytesPerLine=2560, Size=640x480
00:00:01.059628 UIFrameBufferQImage::resizeEvent: Resizing to directly use VGA device content..
00:00:01.336740 2D video acceleration is disabled.
00:00:01.336799 HID LEDs sync is disabled.
00:00:01.336817 UIMachineLogicNormal::sltCheckForRequestedVisualStateType: Requested-state=0, Machine-state=5
00:00:03.540538 Display::handleDisplayResize(): uScreenId = 0, pvVRAM=0000000000000000 w=720 h=400 bpp=0 cbLine=0x0, flags=0x1
00:00:03.540600 UIFrameBuffer::RequestResize: Screen=0, Format=0, BitsPerPixel=0, BytesPerLine=0, Size=720x400, Sending to async-handler..
00:00:03.540712 UIFrameBufferQImage::resizeEvent: Format=0, BitsPerPixel=0, BytesPerLine=0, Size=720x400
00:00:03.540759 UIFrameBufferQImage::resizeEvent: Resizing to FALLBACK buffer due to format is invalid..
00:00:03.541717 PIT: mode=2 count=0x10000 (65536) - 18.20 Hz (ch=0)
00:00:03.542393 Guest Log: BIOS: Boot : bseqnr=1, bootseq=0231
00:00:03.542959 Guest Log: BIOS: Boot from Floppy 0 failed
00:00:03.543589 Guest Log: BIOS: Boot : bseqnr=2, bootseq=0023
00:00:03.545001 Guest Log: BIOS: CDROM boot failure code : 0003
00:00:03.545511 Guest Log: BIOS: Boot from CD-ROM failed
00:00:03.546145 Guest Log: BIOS: Boot : bseqnr=3, bootseq=0002
00:00:03.547852 Guest Log: BIOS: Booting from Hard Disk...
00:00:03.711239 Guest Log: int13_harddisk_ext: function 41, unmapped device for ELDL=81
00:00:03.711455 Guest Log: int13_harddisk: function 08, unmapped device for ELDL=81
00:00:03.747020 Display::handleDisplayResize(): uScreenId = 0, pvVRAM=000000000a1e0000 w=640 h=480 bpp=0 cbLine=0x140, flags=0x1
00:00:03.747036 UIFrameBuffer::RequestResize: Screen=0, Format=0, BitsPerPixel=0, BytesPerLine=0, Size=640x480, Sending to async-handler..
00:00:03.747095 UIFrameBufferQImage::resizeEvent: Format=0, BitsPerPixel=0, BytesPerLine=0, Size=640x480
00:00:03.747106 UIFrameBufferQImage::resizeEvent: Resizing to FALLBACK buffer due to format is invalid..
00:00:06.627804 Display::handleDisplayResize(): uScreenId = 0, pvVRAM=0000000000000000 w=720 h=400 bpp=0 cbLine=0x0, flags=0x1
00:00:06.627831 UIFrameBuffer::RequestResize: Screen=0, Format=0, BitsPerPixel=0, BytesPerLine=0, Size=720x400, Sending to async-handler..
00:00:06.627864 UIFrameBufferQImage::resizeEvent: Format=0, BitsPerPixel=0, BytesPerLine=0, Size=720x400
00:00:06.627873 UIFrameBufferQImage::resizeEvent: Resizing to FALLBACK buffer due to format is invalid..
00:00:07.152710 Guest Log: BIOS: KBD: unsupported int 16h function 03
00:00:07.152854 Guest Log: BIOS: AX=0305 BX=0000 CX=0000 DX=0000 
00:00:07.416227 PIT: mode=2 count=0x4a9 (1193) - 1000.15 Hz (ch=0)
00:00:07.548165 PIT: mode=0 count=0x10000 (65536) - 18.20 Hz (ch=0)
00:00:07.658816 OHCI: Software reset
00:00:08.084654 AHCI#0: Reset the HBA
00:00:08.086471 AHCI#0: Port 0 reset
00:00:08.091785 PIIX3 ATA: Ctl#0: RESET, DevSel=0 AIOIf=0 CmdIf0=0x00 (-1 usec ago) CmdIf1=0x00 (-1 usec ago)
00:00:08.091872 PIIX3 ATA: Ctl#0: finished processing RESET
00:00:08.092016 PIIX3 ATA: Ctl#1: RESET, DevSel=0 AIOIf=0 CmdIf0=0xa0 (-1 usec ago) CmdIf1=0x00 (-1 usec ago)
00:00:08.092072 PIIX3 ATA: Ctl#1: finished processing RESET
00:00:08.093244 OHCI: USB Reset
00:00:08.144563 OHCI: Software reset
00:00:08.144617 OHCI: USB Operational
00:00:08.540674 AIOMgr: Preparing flush failed with VERR_NOT_SUPPORTED, disabling async flushes
00:03:02.246821 OHCI: Software reset
00:03:02.247788 Reset initiated by ACPI
00:03:02.247807 Changing the VM state from 'RUNNING' to 'RESETTING'.
00:03:02.248026 CPUM: SetGuestCpuIdFeature: Enabled APIC
00:03:02.248036 PIT: mode=3 count=0x10000 (65536) - 18.20 Hz (ch=0)
00:03:02.249082 AHCI#0: Reset the HBA
00:03:02.249112 PIIX3 ATA: Ctl#1: finished processing RESET
00:03:02.249122 PIIX3 ATA: Ctl#0: finished processing RESET
00:03:02.249133 Audio: set_record_source ars=0 als=0 (not implemented)
00:03:02.249179 PDMR3Reset: after     1 ms, 1 loops: 1 async tasks - piix3ide/0
00:03:02.255383 Changing the VM state from 'RESETTING' to 'RUNNING'.
00:03:02.256189 Guest Log: BIOS: VirtualBox 4.3.40
00:03:02.256245 PIT: mode=2 count=0x10000 (65536) - 18.20 Hz (ch=0)
00:03:02.259191 OHCI: root hub reset completed with VINF_SUCCESS
00:03:02.263889 PIIX3 ATA: Ctl#1: RESET, DevSel=0 AIOIf=0 CmdIf0=0xa0 (-1 usec ago) CmdIf1=0x00 (-1 usec ago)
00:03:02.263923 PIIX3 ATA: Ctl#1: finished processing RESET
00:03:02.269337 AHCI#0: Reset the HBA
00:03:02.269376 AHCI#0: Port 0 reset
00:03:02.269657 Guest Log: BIOS: AHCI 0-P#0: PCHS=12483/16/63 LCHS=783/255/63 12582912 sectors
00:03:02.269684 PIT: mode=2 count=0x48d3 (18643) - 64.00 Hz (ch=0)
00:03:02.280647 Display::handleDisplayResize(): uScreenId = 0, pvVRAM=000000000a1e0000 w=640 h=480 bpp=32 cbLine=0xA00, flags=0x1
00:03:02.280664 UIFrameBuffer::RequestResize: Screen=0, Format=843204434, BitsPerPixel=32, BytesPerLine=2560, Size=640x480, Sending to async-handler..
00:03:02.280712 UIFrameBufferQImage::resizeEvent: Format=843204434, BitsPerPixel=32, BytesPerLine=2560, Size=640x480
00:03:02.280725 UIFrameBufferQImage::resizeEvent: Resizing to directly use VGA device content..
00:03:04.742609 PIT: mode=2 count=0x10000 (65536) - 18.20 Hz (ch=0)
00:03:04.742778 Guest Log: BIOS: Boot : bseqnr=1, bootseq=0231
00:03:04.742894 Guest Log: BIOS: Boot from Floppy 0 failed
00:03:04.743040 Guest Log: BIOS: Boot : bseqnr=2, bootseq=0023
00:03:04.743363 Guest Log: BIOS: CDROM boot failure code : 0003
00:03:04.743473 Guest Log: BIOS: Boot from CD-ROM failed
00:03:04.743602 Guest Log: BIOS: Boot : bseqnr=3, bootseq=0002
00:03:04.750960 Display::handleDisplayResize(): uScreenId = 0, pvVRAM=0000000000000000 w=720 h=400 bpp=0 cbLine=0x0, flags=0x1
00:03:04.750970 UIFrameBuffer::RequestResize: Screen=0, Format=0, BitsPerPixel=0, BytesPerLine=0, Size=720x400, Sending to async-handler..
00:03:04.751013 UIFrameBufferQImage::resizeEvent: Format=0, BitsPerPixel=0, BytesPerLine=0, Size=720x400
00:03:04.751023 UIFrameBufferQImage::resizeEvent: Resizing to FALLBACK buffer due to format is invalid..
00:03:04.790365 Guest Log: BIOS: Booting from Hard Disk...
00:03:04.865308 Guest Log: int13_harddisk_ext: function 41, unmapped device for ELDL=81
00:03:04.865522 Guest Log: int13_harddisk: function 08, unmapped device for ELDL=81
00:03:04.918513 Display::handleDisplayResize(): uScreenId = 0, pvVRAM=000000000a1e0000 w=640 h=480 bpp=0 cbLine=0x140, flags=0x1
00:03:04.918534 UIFrameBuffer::RequestResize: Screen=0, Format=0, BitsPerPixel=0, BytesPerLine=0, Size=640x480, Sending to async-handler..
00:03:04.918558 UIFrameBufferQImage::resizeEvent: Format=0, BitsPerPixel=0, BytesPerLine=0, Size=640x480
00:03:04.918567 UIFrameBufferQImage::resizeEvent: Resizing to FALLBACK buffer due to format is invalid..
00:03:09.002490 Display::handleDisplayResize(): uScreenId = 0, pvVRAM=0000000000000000 w=720 h=400 bpp=0 cbLine=0x0, flags=0x1
00:03:09.002520 UIFrameBuffer::RequestResize: Screen=0, Format=0, BitsPerPixel=0, BytesPerLine=0, Size=720x400, Sending to async-handler..
00:03:09.002567 UIFrameBufferQImage::resizeEvent: Format=0, BitsPerPixel=0, BytesPerLine=0, Size=720x400
00:03:09.002578 UIFrameBufferQImage::resizeEvent: Resizing to FALLBACK buffer due to format is invalid..
00:03:09.442766 Guest Log: BIOS: KBD: unsupported int 16h function 03
00:03:09.442902 Guest Log: BIOS: AX=0305 BX=0000 CX=0000 DX=0000 
00:03:39.146772 Changing the VM state from 'RUNNING' to 'SUSPENDING'.
00:03:39.529046 AIOMgr: Endpoint for file 'G:\MaquinasVirtualesChimpFarm\KitKat720x1280x16\tools\VM\Android.vdi' (flags 000c0781) created successfully
00:03:39.568451 PDMR3Suspend: 421 623 856 ns run time
00:03:39.568503 Changing the VM state from 'SUSPENDING' to 'SUSPENDED'.
00:03:41.156756 Console::powerDown(): A request to power off the VM has been issued (mMachineState=Stopping, InUninit=0)
00:03:41.159529 Changing the VM state from 'SUSPENDED' to 'POWERING_OFF'.
00:03:41.159576 ****************** Guest state at power off ******************
00:03:41.159604 Guest CPUM (VCPU 0) state: 
00:03:41.159617 eax=00000000 ebx=00000022 ecx=00000000 edx=00000000 esi=00000000 edi=00000000
00:03:41.159622 eip=0000e84c esp=00008e5a ebp=00000000 iopl=0         nv up di pl nz na po nc
00:03:41.159631 cs={f000 base=00000000000f0000 limit=0000ffff flags=0000009f} dr0=00000000 dr1=00000000
00:03:41.159640 ds={0040 base=0000000000000400 limit=0000ffff flags=00000093} dr2=00000000 dr3=00000000
00:03:41.159646 es={9000 base=0000000000090000 limit=0000ffff flags=00000093} dr4=00000000 dr5=00000000
00:03:41.159651 fs={9000 base=0000000000090000 limit=0000ffff flags=00000093} dr6=ffff0ff0 dr7=00000400
00:03:41.159656 gs={9000 base=0000000000090000 limit=0000ffff flags=00000093} cr0=00000010 cr2=00000000
00:03:41.159661 ss={9000 base=0000000000090000 limit=0000ffff flags=00000093} cr3=00000000 cr4=00000000
00:03:41.159666 gdtr=000000000000905c:0027  idtr=0000000000000000:ffff  eflags=00000046
00:03:41.159670 ldtr={0000 base=00000000 limit=0000ffff flags=00000082}
00:03:41.159674 tr  ={0000 base=00000000 limit=0000ffff flags=0000008b}
00:03:41.159677 SysEnter={cs=0000 eip=00000000 esp=00000000}
00:03:41.159680 FCW=037f FSW=0000 FTW=0000 FOP=0000 MXCSR=00001f80 MXCSR_MASK=0000ffff
00:03:41.159684 FPUIP=00000000 CS=0000 Rsrvd1=0000  FPUDP=00000000 DS=0000 Rsvrd2=0000
00:03:41.159688 ST(0)=FPR0={0000'00000000'00000000} t0 +0.0000000000000000000000 ^ 0
00:03:41.159695 ST(1)=FPR1={0000'00000000'00000000} t0 +0.0000000000000000000000 ^ 0
00:03:41.159700 ST(2)=FPR2={0000'00000000'00000000} t0 +0.0000000000000000000000 ^ 0
00:03:41.159704 ST(3)=FPR3={0000'00000000'00000000} t0 +0.0000000000000000000000 ^ 0
00:03:41.159708 ST(4)=FPR4={0000'00000000'00000000} t0 +0.0000000000000000000000 ^ 0
00:03:41.159712 ST(5)=FPR5={0000'00000000'00000000} t0 +0.0000000000000000000000 ^ 0
00:03:41.159716 ST(6)=FPR6={0000'00000000'00000000} t0 +0.0000000000000000000000 ^ 0
00:03:41.159720 ST(7)=FPR7={0000'00000000'00000000} t0 +0.0000000000000000000000 ^ 0
00:03:41.159724 XMM0 =00000000'00000000'00000000'00000000  XMM1 =00000000'00000000'00000000'00000000
00:03:41.159731 XMM2 =00000000'00000000'00000000'00000000  XMM3 =00000000'00000000'00000000'00000000
00:03:41.159736 XMM4 =00000000'00000000'00000000'00000000  XMM5 =00000000'00000000'00000000'00000000
00:03:41.159741 XMM6 =00000000'00000000'00000000'00000000  XMM7 =00000000'00000000'00000000'00000000
00:03:41.159746 XMM8 =00000000'00000000'00000000'00000000  XMM9 =00000000'00000000'00000000'00000000
00:03:41.159752 XMM10=00000000'00000000'00000000'00000000  XMM11=00000000'00000000'00000000'00000000
00:03:41.159757 XMM12=00000000'00000000'00000000'00000000  XMM13=00000000'00000000'00000000'00000000
00:03:41.159762 XMM14=00000000'00000000'00000000'00000000  XMM15=00000000'00000000'00000000'00000000
00:03:41.159768 EFER         =0000000000000000
00:03:41.159770 PAT          =0007040600070406
00:03:41.159773 STAR         =0000000000000000
00:03:41.159774 CSTAR        =0000000000000000
00:03:41.159776 LSTAR        =0000000000000000
00:03:41.159777 SFMASK       =0000000000000000
00:03:41.159779 KERNELGSBASE =0000000000000000
00:03:41.159780 ***
00:03:41.159793 Guest paging mode:  Real (changed 577688 times), A20 enabled (changed 2 times)
00:03:41.159802 Shadow paging mode: EPT
00:03:41.159804 Host paging mode:   AMD64+G+NX
00:03:41.159806 ***
00:03:41.159821 Active Timers (pVM=0000000002890000)
00:03:41.159824 pTimerR3         offNext  offPrev  offSched Clock               Time             Expire HzHint State                     Description
00:03:41.159834 0000000006ad8480 fffed850 00000000 00000000 Real          2540333630         2540331626      0 2-ACTIVE                  EMT Yielder
00:03:41.159889 0000000006ac5cd0 00012730 000127b0 00000000 Real          2540333630         2540331629      0 2-ACTIVE                  VGA Refresh Timer
00:03:41.159900 0000000006ad8400 00000000 fffed8d0 00000000 Real          2540333630         2540332500      0 2-ACTIVE                  CPU Load Timer
00:03:41.159915 0000000006ad3ee0 00000000 00000000 00000000 Virt        218529893519       218109807140      0 2-ACTIVE                  Audio timer
00:03:41.159924 0000000006abd660 000005d0 00000000 00000000 VrSy        218107100425       218141536378     18 2-ACTIVE                  i8254 Programmable Interval Timer
00:03:41.159934 0000000006abdc30 000197e0 fffffa30 00000000 VrSy        218107100425       218990000000      0 2-ACTIVE                  MC146818 RTC/CMOS - Second
00:03:41.159943 0000000006ad7410 00000000 fffe6820 00000000 VrSy        218107100425       781141993319      0 2-ACTIVE                  ACPI PM Timer
00:03:41.159953 ***
00:03:41.159962 ***
00:03:41.159964 ************** End of Guest state at power off ***************
00:03:41.160000 PDMR3PowerOff: 12 420 ns run time
00:03:41.160094 Changing the VM state from 'POWERING_OFF' to 'OFF'.
00:03:41.163281 Changing the VM state from 'OFF' to 'DESTROYING'.
00:03:41.163392 ************************* Statistics *************************
00:03:41.163645 /CPUM/MSR-Totals/Reads                 21 times
00:03:41.163664 /CPUM/MSR-Totals/ReadsRaisingGP         0 times
00:03:41.163676 /CPUM/MSR-Totals/ReadsUnknown           0 times
00:03:41.163685 /CPUM/MSR-Totals/Writes                 6 times
00:03:41.163695 /CPUM/MSR-Totals/WritesRaisingGP        0 times
00:03:41.163704 /CPUM/MSR-Totals/WritesToIgnoredBits        0 times
00:03:41.163714 /CPUM/MSR-Totals/WritesUnknown          0 times
00:03:41.163724 /Devices/E1k0/ReceiveBytes              0 bytes
00:03:41.163734 /Devices/E1k0/TransmitBytes             0 bytes
00:03:41.163743 /Devices/IDE0/ATA0/Unit0/AtapiDMA        0 times
00:03:41.163753 /Devices/IDE0/ATA0/Unit0/AtapiPIO        0 times
00:03:41.163762 /Devices/IDE0/ATA0/Unit0/DMA            0 times
00:03:41.163771 /Devices/IDE0/ATA0/Unit0/PIO            0 times
00:03:41.163781 /Devices/IDE0/ATA0/Unit0/ReadBytes        0 bytes
00:03:41.163791 /Devices/IDE0/ATA0/Unit0/WrittenBytes        0 bytes
00:03:41.163800 /Devices/IDE0/ATA0/Unit1/AtapiDMA        0 times
00:03:41.163809 /Devices/IDE0/ATA0/Unit1/AtapiPIO        0 times
00:03:41.163818 /Devices/IDE0/ATA0/Unit1/DMA            0 times
00:03:41.163827 /Devices/IDE0/ATA0/Unit1/PIO            0 times
00:03:41.163836 /Devices/IDE0/ATA0/Unit1/ReadBytes        0 bytes
00:03:41.163845 /Devices/IDE0/ATA0/Unit1/WrittenBytes        0 bytes
00:03:41.163854 /Devices/IDE0/ATA1/Unit0/AtapiDMA        2 times
00:03:41.163863 /Devices/IDE0/ATA1/Unit0/AtapiPIO        3 times
00:03:41.163872 /Devices/IDE0/ATA1/Unit0/DMA            0 times
00:03:41.163880 /Devices/IDE0/ATA1/Unit0/PIO            0 times
00:03:41.163890 /Devices/IDE0/ATA1/Unit0/ReadBytes        0 bytes
00:03:41.163899 /Devices/IDE0/ATA1/Unit0/WrittenBytes        0 bytes
00:03:41.163908 /Devices/IDE0/ATA1/Unit1/AtapiDMA        0 times
00:03:41.163916 /Devices/IDE0/ATA1/Unit1/AtapiPIO        0 times
00:03:41.163925 /Devices/IDE0/ATA1/Unit1/DMA            0 times
00:03:41.163934 /Devices/IDE0/ATA1/Unit1/PIO            0 times
00:03:41.163949 /Devices/IDE0/ATA1/Unit1/ReadBytes        0 bytes
00:03:41.163960 /Devices/IDE0/ATA1/Unit1/WrittenBytes        0 bytes
00:03:41.163971 /Devices/SATA0/Port0/DMA              628 times
00:03:41.163982 /Devices/SATA0/Port0/ReadBytes   16350720 bytes
00:03:41.163992 /Devices/SATA0/Port0/WrittenBytes    24576 bytes
00:03:41.164017 /Devices/VMMDev/BalloonChunks           0 count
00:03:41.164028 /FT/Checkpoint/Network                  0 times
00:03:41.164038 /FT/Checkpoint/Storage                  0 times
00:03:41.164051 /FT/Received/Mem                        0 bytes
00:03:41.164061 /FT/Received/State                      0 bytes
00:03:41.164070 /FT/Sent/Mem                            0 bytes
00:03:41.164080 /FT/Sent/State                          0 bytes
00:03:41.164090 /FT/Sync/DeltaMem                       0 times
00:03:41.164100 /FT/Sync/DeltaVM                        0 times
00:03:41.164111 /FT/Sync/Full                           0 times
00:03:41.164121 /GMM/VM/Allocated/cBasePages        13438 pages
00:03:41.164131 /GMM/VM/Allocated/cFixedPages           0 pages
00:03:41.164141 /GMM/VM/Allocated/cShadowPages          0 pages
00:03:41.164150 /GMM/VM/Reserved/cBasePages        262302 pages
00:03:41.164160 /GMM/VM/Reserved/cFixedPages         5124 pages
00:03:41.164169 /GMM/VM/Reserved/cShadowPages           1 pages
00:03:41.164178 /GMM/VM/cBalloonedPages                 0 pages
00:03:41.164188 /GMM/VM/cMaxBalloonedPages              0 pages
00:03:41.164197 /GMM/VM/cPrivatePages               13438 pages
00:03:41.164207 /GMM/VM/cReqActuallyBalloonedPages        0 pages
00:03:41.164216 /GMM/VM/cReqBalloonedPages              0 pages
00:03:41.164226 /GMM/VM/cReqDeflatePages                0 pages
00:03:41.164235 /GMM/VM/cShareableModules               0 count
00:03:41.164245 /GMM/VM/cSharedPages                    0 pages
00:03:41.164254 /GMM/VM/enmPolicy                       1 
00:03:41.164264 /GMM/VM/enmPriority                     2 
00:03:41.164274 /GMM/VM/fBallooningEnabled       false    
00:03:41.164284 /GMM/VM/fMayAllocate             true     
00:03:41.164293 /GMM/VM/fSharedPagingEnabled     false    
00:03:41.164302 /GMM/cAllocatedPages                13438 pages
00:03:41.164312 /GMM/cBalloonedPages                    0 pages
00:03:41.164322 /GMM/cChunks                           28 count
00:03:41.164332 /GMM/cDuplicatePages                    0 pages
00:03:41.164342 /GMM/cFreedChunks                       0 count
00:03:41.164351 /GMM/cLeftBehindSharedPages             0 pages
00:03:41.164361 /GMM/cMaxPages                   4294967295 pages
00:03:41.164372 /GMM/cOverCommittedPages                0 pages
00:03:41.164381 /GMM/cReservedPages                267427 pages
00:03:41.164391 /GMM/cShareableModules                  0 count
00:03:41.164400 /GMM/cSharedPages                       0 pages
00:03:41.164410 /GVMM/EMTs                              1 calls
00:03:41.164420 /GVMM/HostCPUs                          8 calls
00:03:41.164429 /GVMM/HostCpus/0                        0 
00:03:41.164439 /GVMM/HostCpus/0/CurTimerHz             0 Hz
00:03:41.164448 /GVMM/HostCpus/0/DesiredHz              0 Hz
00:03:41.164457 /GVMM/HostCpus/0/PPTChanges             0 times
00:03:41.164466 /GVMM/HostCpus/0/PPTStarts              0 times
00:03:41.164475 /GVMM/HostCpus/0/idxCpuSet              0 
00:03:41.164484 /GVMM/HostCpus/1                        1 
00:03:41.164494 /GVMM/HostCpus/1/CurTimerHz             0 Hz
00:03:41.164503 /GVMM/HostCpus/1/DesiredHz              0 Hz
00:03:41.164512 /GVMM/HostCpus/1/PPTChanges             0 times
00:03:41.164521 /GVMM/HostCpus/1/PPTStarts              0 times
00:03:41.164530 /GVMM/HostCpus/1/idxCpuSet              1 
00:03:41.164539 /GVMM/HostCpus/2                        2 
00:03:41.164550 /GVMM/HostCpus/2/CurTimerHz             0 Hz
00:03:41.164559 /GVMM/HostCpus/2/DesiredHz              0 Hz
00:03:41.164568 /GVMM/HostCpus/2/PPTChanges             0 times
00:03:41.164577 /GVMM/HostCpus/2/PPTStarts              0 times
00:03:41.164589 /GVMM/HostCpus/2/idxCpuSet              2 
00:03:41.164600 /GVMM/HostCpus/3                        3 
00:03:41.164609 /GVMM/HostCpus/3/CurTimerHz             0 Hz
00:03:41.164619 /GVMM/HostCpus/3/DesiredHz              0 Hz
00:03:41.164628 /GVMM/HostCpus/3/PPTChanges             0 times
00:03:41.164637 /GVMM/HostCpus/3/PPTStarts              0 times
00:03:41.164646 /GVMM/HostCpus/3/idxCpuSet              3 
00:03:41.164655 /GVMM/HostCpus/4                        4 
00:03:41.164665 /GVMM/HostCpus/4/CurTimerHz             0 Hz
00:03:41.164673 /GVMM/HostCpus/4/DesiredHz              0 Hz
00:03:41.164682 /GVMM/HostCpus/4/PPTChanges             0 times
00:03:41.164691 /GVMM/HostCpus/4/PPTStarts              0 times
00:03:41.164700 /GVMM/HostCpus/4/idxCpuSet              4 
00:03:41.164709 /GVMM/HostCpus/5                        5 
00:03:41.164718 /GVMM/HostCpus/5/CurTimerHz             0 Hz
00:03:41.164727 /GVMM/HostCpus/5/DesiredHz              0 Hz
00:03:41.164736 /GVMM/HostCpus/5/PPTChanges             0 times
00:03:41.164745 /GVMM/HostCpus/5/PPTStarts              0 times
00:03:41.164754 /GVMM/HostCpus/5/idxCpuSet              5 
00:03:41.164763 /GVMM/HostCpus/6                        6 
00:03:41.164772 /GVMM/HostCpus/6/CurTimerHz             0 Hz
00:03:41.164781 /GVMM/HostCpus/6/DesiredHz              0 Hz
00:03:41.164790 /GVMM/HostCpus/6/PPTChanges             0 times
00:03:41.164799 /GVMM/HostCpus/6/PPTStarts              0 times
00:03:41.164808 /GVMM/HostCpus/6/idxCpuSet              6 
00:03:41.164817 /GVMM/HostCpus/7                        7 
00:03:41.164826 /GVMM/HostCpus/7/CurTimerHz             0 Hz
00:03:41.164835 /GVMM/HostCpus/7/DesiredHz              0 Hz
00:03:41.164844 /GVMM/HostCpus/7/PPTChanges             0 times
00:03:41.164853 /GVMM/HostCpus/7/PPTStarts              0 times
00:03:41.164862 /GVMM/HostCpus/7/idxCpuSet              7 
00:03:41.164871 /GVMM/Sum/HaltBlocking              43214 calls
00:03:41.164880 /GVMM/Sum/HaltCalls                343196 calls
00:03:41.164890 /GVMM/Sum/HaltNotBlocking          299982 calls
00:03:41.164900 /GVMM/Sum/HaltTimeouts              34178 calls
00:03:41.164910 /GVMM/Sum/HaltWakeUps                   0 calls
00:03:41.164919 /GVMM/Sum/PokeCalls                    17 calls
00:03:41.164929 /GVMM/Sum/PokeNotBusy                   4 calls
00:03:41.164938 /GVMM/Sum/PollCalls                    57 calls
00:03:41.164948 /GVMM/Sum/PollHalts                     0 calls
00:03:41.164957 /GVMM/Sum/PollWakeUps                   0 calls
00:03:41.164967 /GVMM/Sum/WakeUpCalls                9735 calls
00:03:41.164977 /GVMM/Sum/WakeUpNotHalted            2085 calls
00:03:41.164986 /GVMM/Sum/WakeUpWakeUps                 0 calls
00:03:41.164996 /GVMM/VM/HaltBlocking               43214 calls
00:03:41.165006 /GVMM/VM/HaltCalls                 343196 calls
00:03:41.165016 /GVMM/VM/HaltNotBlocking           299982 calls
00:03:41.165025 /GVMM/VM/HaltTimeouts               34178 calls
00:03:41.165035 /GVMM/VM/HaltWakeUps                    0 calls
00:03:41.165046 /GVMM/VM/PokeCalls                     17 calls
00:03:41.165059 /GVMM/VM/PokeNotBusy                    4 calls
00:03:41.165074 /GVMM/VM/PollCalls                     57 calls
00:03:41.165084 /GVMM/VM/PollHalts                      0 calls
00:03:41.165093 /GVMM/VM/PollWakeUps                    0 calls
00:03:41.165102 /GVMM/VM/WakeUpCalls                 9735 calls
00:03:41.165112 /GVMM/VM/WakeUpNotHalted             2085 calls
00:03:41.165122 /GVMM/VM/WakeUpWakeUps                  0 calls
00:03:41.165131 /GVMM/VMs                               1 calls
00:03:41.165142 /HM/CPU0/Exit/HostNmiInGC               0 times
00:03:41.165152 /IEM/CPU0/cInstructions           3563520 count
00:03:41.165162 /IEM/CPU0/cPotentialExits          194367 count
00:03:41.165172 /IEM/CPU0/cRetAspectNotImplemented        0 count
00:03:41.165181 /IEM/CPU0/cRetErrStatuses               0 count
00:03:41.165190 /IEM/CPU0/cRetInfStatuses               0 count
00:03:41.165200 /IEM/CPU0/cRetInstrNotImplemented        0 count
00:03:41.165212 /IEM/CPU0/cbWritten               1180948 bytes
00:03:41.165224 /MM/HyperHeap/cbFree               842496 bytes
00:03:41.165235 /MM/HyperHeap/cbHeap              1048256 bytes
00:03:41.165245 /PDM/BlkCache/cbCached                  0 bytes
00:03:41.165255 /PDM/BlkCache/cbCachedFru               0 bytes
00:03:41.165269 /PDM/BlkCache/cbCachedMruIn             0 bytes
00:03:41.165283 /PDM/BlkCache/cbCachedMruOut            0 bytes
00:03:41.165297 /PDM/BlkCache/cbMax               5242880 bytes
00:03:41.165313 /PDM/CritSects/8237A#0Auto/ContentionR3        0 times
00:03:41.165325 /PDM/CritSects/8237A#0Auto/ContentionRZLock        0 times
00:03:41.165335 /PDM/CritSects/8237A#0Auto/ContentionRZUnlock        0 times
00:03:41.165346 /PDM/CritSects/AHCI#0/ContentionR3        0 times
00:03:41.165356 /PDM/CritSects/AHCI#0/ContentionRZLock        0 times
00:03:41.165366 /PDM/CritSects/AHCI#0/ContentionRZUnlock        0 times
00:03:41.165375 /PDM/CritSects/ATA#0/ContentionR3        0 times
00:03:41.165385 /PDM/CritSects/ATA#0/ContentionRZLock        0 times
00:03:41.165395 /PDM/CritSects/ATA#0/ContentionRZUnlock        0 times
00:03:41.165405 /PDM/CritSects/ATA#1/ContentionR3        0 times
00:03:41.165415 /PDM/CritSects/ATA#1/ContentionRZLock        3 times
00:03:41.165424 /PDM/CritSects/ATA#1/ContentionRZUnlock        0 times
00:03:41.165434 /PDM/CritSects/AudioSniffer#0Auto/ContentionR3        0 times
00:03:41.165443 /PDM/CritSects/AudioSniffer#0Auto/ContentionRZLock        0 times
00:03:41.165453 /PDM/CritSects/AudioSniffer#0Auto/ContentionRZUnlock        0 times
00:03:41.165462 /PDM/CritSects/E1000#0/ContentionR3        0 times
00:03:41.165472 /PDM/CritSects/E1000#0/ContentionRZLock        0 times
00:03:41.165481 /PDM/CritSects/E1000#0/ContentionRZUnlock        0 times
00:03:41.165490 /PDM/CritSects/E1000#0RX/ContentionR3        0 times
00:03:41.165499 /PDM/CritSects/E1000#0RX/ContentionRZLock        0 times
00:03:41.165508 /PDM/CritSects/E1000#0RX/ContentionRZUnlock        0 times
00:03:41.165517 /PDM/CritSects/E1000#0TX/ContentionR3        0 times
00:03:41.165526 /PDM/CritSects/E1000#0TX/ContentionRZLock        0 times
00:03:41.165535 /PDM/CritSects/E1000#0TX/ContentionRZUnlock        0 times
00:03:41.165545 /PDM/CritSects/EM-REM/ContentionR3        0 times
00:03:41.165555 /PDM/CritSects/EM-REM/ContentionRZLock        0 times
00:03:41.165564 /PDM/CritSects/EM-REM/ContentionRZUnlock        0 times
00:03:41.165573 /PDM/CritSects/FTM/ContentionR3         0 times
00:03:41.165582 /PDM/CritSects/FTM/ContentionRZLock        0 times
00:03:41.165591 /PDM/CritSects/FTM/ContentionRZUnlock        0 times
00:03:41.165600 /PDM/CritSects/MM-HYPER/ContentionR3        0 times
00:03:41.165609 /PDM/CritSects/MM-HYPER/ContentionRZLock        0 times
00:03:41.165618 /PDM/CritSects/MM-HYPER/ContentionRZUnlock        0 times
00:03:41.165627 /PDM/CritSects/NOP/ContentionR3         0 times
00:03:41.165636 /PDM/CritSects/NOP/ContentionRZLock        0 times
00:03:41.165645 /PDM/CritSects/NOP/ContentionRZUnlock        0 times
00:03:41.165654 /PDM/CritSects/OHCI#0Irq/ContentionR3        0 times
00:03:41.165663 /PDM/CritSects/OHCI#0Irq/ContentionRZLock        0 times
00:03:41.165672 /PDM/CritSects/OHCI#0Irq/ContentionRZUnlock        0 times
00:03:41.165681 /PDM/CritSects/PDM/ContentionR3         0 times
00:03:41.165690 /PDM/CritSects/PDM/ContentionRZLock        0 times
00:03:41.165699 /PDM/CritSects/PDM/ContentionRZUnlock        0 times
00:03:41.165708 /PDM/CritSects/PGM/ContentionR3         0 times
00:03:41.165717 /PDM/CritSects/PGM/ContentionRZLock        0 times
00:03:41.165725 /PDM/CritSects/PGM/ContentionRZUnlock        0 times
00:03:41.165734 /PDM/CritSects/REM-Register/ContentionR3        0 times
00:03:41.165743 /PDM/CritSects/REM-Register/ContentionRZLock        0 times
00:03:41.165753 /PDM/CritSects/REM-Register/ContentionRZUnlock        0 times
00:03:41.165762 /PDM/CritSects/TM Timer Lock/ContentionR3        0 times
00:03:41.165774 /PDM/CritSects/TM Timer Lock/ContentionRZLock        0 times
00:03:41.165784 /PDM/CritSects/TM Timer Lock/ContentionRZUnlock        0 times
00:03:41.165793 /PDM/CritSects/TM VirtualSync Lock/ContentionR3        0 times
00:03:41.165802 /PDM/CritSects/TM VirtualSync Lock/ContentionRZLock        0 times
00:03:41.165812 /PDM/CritSects/TM VirtualSync Lock/ContentionRZUnlock        0 times
00:03:41.165821 /PDM/CritSects/VGA#0/ContentionR3        0 times
00:03:41.165830 /PDM/CritSects/VGA#0/ContentionRZLock        0 times
00:03:41.165839 /PDM/CritSects/VGA#0/ContentionRZUnlock        0 times
00:03:41.165848 /PDM/CritSects/VMMDev#0/ContentionR3        0 times
00:03:41.165857 /PDM/CritSects/VMMDev#0/ContentionRZLock        0 times
00:03:41.165866 /PDM/CritSects/VMMDev#0/ContentionRZUnlock        0 times
00:03:41.165876 /PDM/CritSects/acpi#0/ContentionR3        0 times
00:03:41.165885 /PDM/CritSects/acpi#0/ContentionRZLock        0 times
00:03:41.165894 /PDM/CritSects/acpi#0/ContentionRZUnlock        0 times
00:03:41.165903 /PDM/CritSects/ichac97#0Auto/ContentionR3        0 times
00:03:41.165912 /PDM/CritSects/ichac97#0Auto/ContentionRZLock        0 times
00:03:41.165921 /PDM/CritSects/ichac97#0Auto/ContentionRZUnlock        0 times
00:03:41.165930 /PDM/CritSects/mc146818#0Auto/ContentionR3        0 times
00:03:41.165939 /PDM/CritSects/mc146818#0Auto/ContentionRZLock        0 times
00:03:41.165948 /PDM/CritSects/mc146818#0Auto/ContentionRZUnlock        0 times
00:03:41.165958 /PDM/CritSects/pcarch#0Auto/ContentionR3        0 times
00:03:41.165967 /PDM/CritSects/pcarch#0Auto/ContentionRZLock        0 times
00:03:41.165976 /PDM/CritSects/pcarch#0Auto/ContentionRZUnlock        0 times
00:03:41.165985 /PDM/CritSects/pcbios#0Auto/ContentionR3        0 times
00:03:41.165994 /PDM/CritSects/pcbios#0Auto/ContentionRZLock        0 times
00:03:41.166003 /PDM/CritSects/pcbios#0Auto/ContentionRZUnlock        0 times
00:03:41.166012 /PDM/CritSects/pckbd#0Auto/ContentionR3        0 times
00:03:41.166021 /PDM/CritSects/pckbd#0Auto/ContentionRZLock        0 times
00:03:41.166030 /PDM/CritSects/pckbd#0Auto/ContentionRZUnlock        0 times
00:03:41.166040 /PDM/CritSects/pit#0/ContentionR3        0 times
00:03:41.166049 /PDM/CritSects/pit#0/ContentionRZLock        0 times
00:03:41.166058 /PDM/CritSects/pit#0/ContentionRZUnlock        0 times
00:03:41.166067 /PDM/CritSects/usb-ohci#0Auto/ContentionR3        0 times
00:03:41.166076 /PDM/CritSects/usb-ohci#0Auto/ContentionRZLock        0 times
00:03:41.166085 /PDM/CritSects/usb-ohci#0Auto/ContentionRZUnlock        0 times
00:03:41.166094 /PDM/CritSectsRw/IOM Lock/ContentionR3EnterExcl        0 times
00:03:41.166103 /PDM/CritSectsRw/IOM Lock/ContentionR3EnterShared        0 times
00:03:41.166113 /PDM/CritSectsRw/IOM Lock/ContentionRZEnterExcl        0 times
00:03:41.166122 /PDM/CritSectsRw/IOM Lock/ContentionRZEnterShared        0 times
00:03:41.166130 /PDM/CritSectsRw/IOM Lock/ContentionRZLeaveExcl        0 times
00:03:41.166140 /PDM/CritSectsRw/IOM Lock/ContentionRZLeaveShared        0 times
00:03:41.166149 /PDM/CritSectsRw/IOM Lock/R3EnterExcl      703 times
00:03:41.166158 /PDM/CritSectsRw/IOM Lock/R3EnterShared  1399628 times
00:03:41.166168 /PDM/CritSectsRw/IOM Lock/RZEnterExcl        0 times
00:03:41.166177 /PDM/CritSectsRw/IOM Lock/RZEnterShared 17541315 times
00:03:41.166187 /PDM/Queue/AHCI-Xmit/AllocFailures        0 times
00:03:41.166196 /PDM/Queue/AHCI-Xmit/Flush              0 calls
00:03:41.166205 /PDM/Queue/AHCI-Xmit/FlushLeftovers        0 times
00:03:41.166216 /PDM/Queue/AHCI-Xmit/Insert             0 calls
00:03:41.166225 /PDM/Queue/AHCI-Xmit/cItems            60 count
00:03:41.166235 /PDM/Queue/AHCI-Xmit/cbItem            32 bytes
00:03:41.166244 /PDM/Queue/DevHlp/AllocFailures         0 times
00:03:41.166254 /PDM/Queue/DevHlp/Flush                 0 calls
00:03:41.166263 /PDM/Queue/DevHlp/FlushLeftovers        0 times
00:03:41.166272 /PDM/Queue/DevHlp/Insert                0 calls
00:03:41.166282 /PDM/Queue/DevHlp/cItems                8 count
00:03:41.166295 /PDM/Queue/DevHlp/cbItem               56 bytes
00:03:41.166306 /PDM/Queue/E1000-Rcv/AllocFailures        0 times
00:03:41.166315 /PDM/Queue/E1000-Rcv/Flush              0 calls
00:03:41.166324 /PDM/Queue/E1000-Rcv/FlushLeftovers        0 times
00:03:41.166333 /PDM/Queue/E1000-Rcv/Insert             0 calls
00:03:41.166343 /PDM/Queue/E1000-Rcv/cItems             1 count
00:03:41.166352 /PDM/Queue/E1000-Rcv/cbItem            24 bytes
00:03:41.166362 /PDM/Queue/E1000-Xmit/AllocFailures        0 times
00:03:41.166370 /PDM/Queue/E1000-Xmit/Flush             0 calls
00:03:41.166381 /PDM/Queue/E1000-Xmit/FlushLeftovers        0 times
00:03:41.166390 /PDM/Queue/E1000-Xmit/Insert            0 calls
00:03:41.166399 /PDM/Queue/E1000-Xmit/cItems            1 count
00:03:41.166408 /PDM/Queue/E1000-Xmit/cbItem           24 bytes
00:03:41.166417 /PDM/Queue/Keyboard/AllocFailures        0 times
00:03:41.166426 /PDM/Queue/Keyboard/Flush               0 calls
00:03:41.166435 /PDM/Queue/Keyboard/FlushLeftovers        0 times
00:03:41.166444 /PDM/Queue/Keyboard/Insert            438 calls
00:03:41.166454 /PDM/Queue/Keyboard/cItems             64 count
00:03:41.166463 /PDM/Queue/Keyboard/cbItem             32 bytes
00:03:41.166472 /PDM/Queue/Mouse/AllocFailures          0 times
00:03:41.166481 /PDM/Queue/Mouse/Flush                  0 calls
00:03:41.166491 /PDM/Queue/Mouse/FlushLeftovers         0 times
00:03:41.166499 /PDM/Queue/Mouse/Insert                 0 calls
00:03:41.166509 /PDM/Queue/Mouse/cItems               128 count
00:03:41.166518 /PDM/Queue/Mouse/cbItem                48 bytes
00:03:41.166530 /PDM/Queue/Mouse_1/AllocFailures        0 times
00:03:41.166539 /PDM/Queue/Mouse_1/Flush                0 calls
00:03:41.166548 /PDM/Queue/Mouse_1/FlushLeftovers        0 times
00:03:41.166557 /PDM/Queue/Mouse_1/Insert             545 calls
00:03:41.166567 /PDM/Queue/Mouse_1/cItems             128 count
00:03:41.166576 /PDM/Queue/Mouse_1/cbItem              48 bytes
00:03:41.166585 /PGM/CPU0/cA20Changes                   2 times
00:03:41.166595 /PGM/CPU0/cGuestModeChanges        577688 times
00:03:41.166605 /PGM/ChunkR3Map/Mapped                 28 count
00:03:41.166614 /PGM/ChunkR3Map/Unmapped                0 count
00:03:41.166623 /PGM/ChunkR3Map/c                      28 count
00:03:41.166633 /PGM/ChunkR3Map/cMax             4294967295 count
00:03:41.166643 /PGM/LargePage/Recheck                  0 times
00:03:41.166653 /PGM/LargePage/Refused                  3 times
00:03:41.166662 /PGM/LargePage/Reused                 305 times
00:03:41.166676 /PGM/Page/cAllPages                267334 count
00:03:41.166686 /PGM/Page/cBalloonedPages               0 count
00:03:41.166695 /PGM/Page/cHandyPages                 128 count
00:03:41.166704 /PGM/Page/cLargePages                  25 count
00:03:41.166714 /PGM/Page/cLargePagesDisabled           0 count
00:03:41.166723 /PGM/Page/cMonitoredPages               0 count
00:03:41.166732 /PGM/Page/cPrivatePages             18434 count
00:03:41.166742 /PGM/Page/cPureMmioPages               36 count
00:03:41.166752 /PGM/Page/cReadLockedPages              0 count
00:03:41.166761 /PGM/Page/cReusedSharedPages            0 count
00:03:41.166770 /PGM/Page/cSharedPages                  0 count
00:03:41.166779 /PGM/Page/cWriteLockedPages             0 count
00:03:41.166788 /PGM/Page/cWrittenToPages               0 count
00:03:41.166797 /PGM/Page/cZeroPages               248864 count
00:03:41.166807 /PGM/ShMod/Check                        0 ticks/call (           0 ticks,       0 times, max         0, min      -1)
00:03:41.166821 /PGM/cRelocations                       0 times
00:03:41.166831 /PROF/CPU0/EM/Capped                    0 ticks/call (           0 ticks,       0 times, max         0, min      -1)
00:03:41.166843 /PROF/CPU0/EM/ForcedActions       3064780 times
00:03:41.166852 /PROF/CPU0/EM/Halted                10094 times
00:03:41.166862 /PROF/CPU0/EM/RAWTotal                  0 times
00:03:41.166871 /PROF/CPU0/EM/REMTotal               3408 times
00:03:41.166884 /PROF/CPU0/EM/Total              784890109704 ticks/call (784890109704 ticks,       1 times, max 784890109704, min 784890109704)
00:03:41.166902 /PROF/CPU0/VM/Halt/Block           515326 ns/call (176853729426 ticks,  343188 times, max  11540680, min     518)
00:03:41.166919 /PROF/CPU0/VM/Halt/BlockInsomnia        0 ns/call (           0 ticks,       0 times, max         0, min      -1)
00:03:41.166930 /PROF/CPU0/VM/Halt/BlockOnTime          0 ns/call (           0 ticks,       0 times, max         0, min      -1)
00:03:41.166941 /PROF/CPU0/VM/Halt/BlockOverslept        0 ns/call (           0 ticks,       0 times, max         0, min      -1)
00:03:41.166953 /PROF/CPU0/VM/Halt/Timers             738 ns/call (  1095007566 ticks, 1482719 times, max   1134666, min     267)
00:03:41.166967 /PROF/CPU0/VM/Halt/Yield             3348 ns/call (      190837 ticks,      57 times, max      7215, min    1084)
00:03:41.166980 /Public/Net/E1k0/BytesReceived          0 bytes
00:03:41.166990 /Public/Net/E1k0/BytesTransmitted        0 bytes
00:03:41.166999 /REM/TbFlushCount                       1 times
00:03:41.167009 /REM/TbPhysInvldCount                   0 times
00:03:41.167020 /REM/TlbFlushCount                     15 times
00:03:41.167029 /SELM/LoadHidSel/GstReadErrors          0 times
00:03:41.167038 /SELM/LoadHidSel/NoGoodGuest            0 times
00:03:41.167048 /TM/CPU/00/cNsExecuting          28453215406 ns
00:03:41.167059 /TM/CPU/00/cNsHalted             178277811390 ns
00:03:41.167069 /TM/CPU/00/cNsOther              11798870148 ns
00:03:41.167079 /TM/CPU/00/cNsTotal              218529896944 ns
00:03:41.167090 /TM/CPU/00/cPeriodsExecuting     18477029 count
00:03:41.167099 /TM/CPU/00/cPeriodsHalted           10094 count
00:03:41.167109 /TM/CPU/00/pctExecuting                97 %
00:03:41.167119 /TM/CPU/00/pctHalted                    0 %
00:03:41.167128 /TM/CPU/00/pctOther                     2 %
00:03:41.167137 /TM/CPU/pctExecuting                   97 %
00:03:41.167147 /TM/CPU/pctHalted                       0 %
00:03:41.167156 /TM/CPU/pctOther                        2 %
00:03:41.167166 /TM/MaxHzHint                           0 Hz
00:03:41.167175 /TM/R0/1nsSteps                      1934 times
00:03:41.167187 /TM/R3/1nsSteps                      1621 times
00:03:41.167197 /TM/TSC/offCPU0                         0 ticks
00:03:41.167207 /TM/VirtualSync/CurrentOffset      176609 ns
00:03:41.167217 /VUSB/0/cUrbsInPool                     1 count
00:03:41.167227 ********************* End of statistics **********************
00:03:41.167576 VUSB: detached 'HidMouse' from port 1
00:03:41.171842 NAT: zone(nm:mbuf_cluster, used:0)
00:03:41.172344 NAT: zone(nm:mbuf_packet, used:0)
00:03:41.172352 NAT: zone(nm:mbuf, used:0)
00:03:41.172358 NAT: zone(nm:mbuf_jumbo_pagesize, used:0)
00:03:41.172821 NAT: zone(nm:mbuf_jumbo_9k, used:0)
00:03:41.173060 NAT: zone(nm:mbuf_jumbo_16k, used:0)
00:03:41.173190 NAT: zone(nm:mbuf_ext_refcnt, used:0)
00:03:41.338445 Changing the VM state from 'DESTROYING' to 'TERMINATED'.
00:03:41.517314 UIMachineView::storeGuestSizeHint: Storing guest size-hint for screen 0 as 720x400
