VirtualBox VM 4.3.40 r110317 win.amd64 (Aug 22 2016 13:43:30) release log
00:00:00.579820 Log opened 2017-06-29T22:35:15.756393000Z
00:00:00.579821 Build Type: release
00:00:00.579823 OS Product: Windows 7
00:00:00.579824 OS Release: 6.1.7601
00:00:00.579824 OS Service Pack: 1
00:00:00.605928 DMI Product Name: Precision T1700
00:00:00.607642 DMI Product Version: 01
00:00:00.607646 Host RAM: 32676MB total, 27190MB available
00:00:00.607647 Executable: C:\Program Files\Oracle\VirtualBox\VirtualBox.exe
00:00:00.607647 Process ID: 22748
00:00:00.607648 Package type: WINDOWS_64BITS_GENERIC
00:00:00.609947 Installed Extension Packs:
00:00:00.609969   None installed!
00:00:00.612633 UIMediumEnumerator: Medium-enumeration finished!
00:00:00.663510 SUP: Loaded VMMR0.r0 (C:\Program Files\Oracle\VirtualBox\VMMR0.r0) at 0xfffff880248a0000 - ModuleInit at fffff880248bdb20 and ModuleTerm at fffff880248bde30 using the native ring-0 loader
00:00:00.663526 SUP: VMMR0EntryEx located at fffff880248bff50, VMMR0EntryFast at fffff880248be1a0 and VMMR0EntryInt at fffff880248be190
00:00:00.663531 SUP: windbg> .reload /f C:\Program Files\Oracle\VirtualBox\VMMR0.r0=0xfffff880248a0000
00:00:00.665774 Guest OS type: 'Linux26'
00:00:00.676167 File system of 'G:\MaquinasVirtualesChimpFarm\KitKat720x1280x16\tools\VM\Snapshots' (snapshots) is unknown
00:00:00.676175 File system of 'G:\MaquinasVirtualesChimpFarm\KitKat720x1280x16\tools\VM\Android.vdi' is ntfs
00:00:00.699059 Shared clipboard mode: Off
00:00:00.705258 Drag'n'drop mode: Off
00:00:00.720231 ************************* CFGM dump *************************
00:00:00.720233 [/] (level 0)
00:00:00.720236   CSAMEnabled       <integer> = 0x0000000000000001 (1)
00:00:00.720238   CpuExecutionCap   <integer> = 0x0000000000000064 (100)
00:00:00.720238   EnablePAE         <integer> = 0x0000000000000000 (0)
00:00:00.720239   HMEnabled         <integer> = 0x0000000000000001 (1)
00:00:00.720240   MemBalloonSize    <integer> = 0x0000000000000000 (0)
00:00:00.720241   Name              <string>  = "KitKat" (cb=7)
00:00:00.720241   NumCPUs           <integer> = 0x0000000000000001 (1)
00:00:00.720242   PATMEnabled       <integer> = 0x0000000000000001 (1)
00:00:00.720243   PageFusionAllowed <integer> = 0x0000000000000000 (0)
00:00:00.720243   RamHoleSize       <integer> = 0x0000000020000000 (536 870 912, 512 MB)
00:00:00.720245   RamSize           <integer> = 0x0000000040000000 (1 073 741 824, 1 024 MB)
00:00:00.720246   RawR0Enabled      <integer> = 0x0000000000000001 (1)
00:00:00.720246   RawR3Enabled      <integer> = 0x0000000000000001 (1)
00:00:00.720247   TimerMillies      <integer> = 0x000000000000000a (10)
00:00:00.720248   UUID              <bytes>   = "ae 04 99 d2 cb 7a 79 46 b0 77 13 f7 bb 9b 3d 51" (cb=16)
00:00:00.720251 
00:00:00.720252 [/CPUM/] (level 1)
00:00:00.720252   SyntheticCpu <integer> = 0x0000000000000000 (0)
00:00:00.720253 
00:00:00.720253 [/DBGF/] (level 1)
00:00:00.720254   Path <string>  = "G:\MaquinasVirtualesChimpFarm\KitKat720x1280x16\tools\VM/debug/;G:\MaquinasVirtualesChimpFarm\KitKat720x1280x16\tools\VM/;C:\Users\ca.escobar2434/" (cb=147)
00:00:00.720255 
00:00:00.720255 [/Devices/] (level 1)
00:00:00.720256 
00:00:00.720256 [/Devices/8237A/] (level 2)
00:00:00.720256 
00:00:00.720257 [/Devices/8237A/0/] (level 3)
00:00:00.720258   Trusted <integer> = 0x0000000000000001 (1)
00:00:00.720258 
00:00:00.720258 [/Devices/AudioSniffer/] (level 2)
00:00:00.720259 
00:00:00.720259 [/Devices/AudioSniffer/0/] (level 3)
00:00:00.720260 
00:00:00.720260 [/Devices/AudioSniffer/0/Config/] (level 4)
00:00:00.720261 
00:00:00.720261 [/Devices/AudioSniffer/0/LUN#0/] (level 4)
00:00:00.720262   Driver <string>  = "MainAudioSniffer" (cb=17)
00:00:00.720263 
00:00:00.720263 [/Devices/AudioSniffer/0/LUN#0/Config/] (level 5)
00:00:00.720264   Object <integer> = 0x000000000444feb0 (71 630 512)
00:00:00.720265 
00:00:00.720265 [/Devices/VMMDev/] (level 2)
00:00:00.720266 
00:00:00.720266 [/Devices/VMMDev/0/] (level 3)
00:00:00.720267   PCIBusNo      <integer> = 0x0000000000000000 (0)
00:00:00.720268   PCIDeviceNo   <integer> = 0x0000000000000004 (4)
00:00:00.720269   PCIFunctionNo <integer> = 0x0000000000000000 (0)
00:00:00.720269   Trusted       <integer> = 0x0000000000000001 (1)
00:00:00.720270 
00:00:00.720270 [/Devices/VMMDev/0/Config/] (level 4)
00:00:00.720271   GuestCoreDumpDir <string>  = "G:\MaquinasVirtualesChimpFarm\KitKat720x1280x16\tools\VM\Snapshots" (cb=67)
00:00:00.720271   RamSize          <integer> = 0x0000000040000000 (1 073 741 824, 1 024 MB)
00:00:00.720273 
00:00:00.720273 [/Devices/VMMDev/0/LUN#0/] (level 4)
00:00:00.720274   Driver <string>  = "HGCM" (cb=5)
00:00:00.720274 
00:00:00.720275 [/Devices/VMMDev/0/LUN#0/Config/] (level 5)
00:00:00.720275   Object <integer> = 0x00000000039ac140 (60 473 664)
00:00:00.720276 
00:00:00.720276 [/Devices/VMMDev/0/LUN#999/] (level 4)
00:00:00.720277   Driver <string>  = "MainStatus" (cb=11)
00:00:00.720278 
00:00:00.720278 [/Devices/VMMDev/0/LUN#999/Config/] (level 5)
00:00:00.720279   First   <integer> = 0x0000000000000000 (0)
00:00:00.720279   Last    <integer> = 0x0000000000000000 (0)
00:00:00.720280   papLeds <integer> = 0x0000000004456538 (71 656 760)
00:00:00.720281 
00:00:00.720281 [/Devices/acpi/] (level 2)
00:00:00.720281 
00:00:00.720282 [/Devices/acpi/0/] (level 3)
00:00:00.720283   PCIBusNo      <integer> = 0x0000000000000000 (0)
00:00:00.720283   PCIDeviceNo   <integer> = 0x0000000000000007 (7)
00:00:00.720284   PCIFunctionNo <integer> = 0x0000000000000000 (0)
00:00:00.720284   Trusted       <integer> = 0x0000000000000001 (1)
00:00:00.720285 
00:00:00.720285 [/Devices/acpi/0/Config/] (level 4)
00:00:00.720286   CpuHotPlug        <integer> = 0x0000000000000000 (0)
00:00:00.720287   FdcEnabled        <integer> = 0x0000000000000000 (0)
00:00:00.720287   HostBusPciAddress <integer> = 0x0000000000000000 (0)
00:00:00.720288   HpetEnabled       <integer> = 0x0000000000000000 (0)
00:00:00.720288   IOAPIC            <integer> = 0x0000000000000000 (0)
00:00:00.720289   IocPciAddress     <integer> = 0x0000000000010000 (65 536)
00:00:00.720289   NumCPUs           <integer> = 0x0000000000000001 (1)
00:00:00.720290   RamHoleSize       <integer> = 0x0000000020000000 (536 870 912, 512 MB)
00:00:00.720291   RamSize           <integer> = 0x0000000040000000 (1 073 741 824, 1 024 MB)
00:00:00.720292   Serial0IoPortBase <integer> = 0x0000000000000000 (0)
00:00:00.720293   Serial0Irq        <integer> = 0x0000000000000000 (0)
00:00:00.720293   Serial1IoPortBase <integer> = 0x0000000000000000 (0)
00:00:00.720294   Serial1Irq        <integer> = 0x0000000000000000 (0)
00:00:00.720294   ShowCpu           <integer> = 0x0000000000000000 (0)
00:00:00.720295   ShowRtc           <integer> = 0x0000000000000000 (0)
00:00:00.720295   SmcEnabled        <integer> = 0x0000000000000000 (0)
00:00:00.720296 
00:00:00.720296 [/Devices/acpi/0/LUN#0/] (level 4)
00:00:00.720297   Driver <string>  = "ACPIHost" (cb=9)
00:00:00.720297 
00:00:00.720298 [/Devices/acpi/0/LUN#0/Config/] (level 5)
00:00:00.720298 
00:00:00.720299 [/Devices/ahci/] (level 2)
00:00:00.720299 
00:00:00.720300 [/Devices/ahci/0/] (level 3)
00:00:00.720301   PCIBusNo      <integer> = 0x0000000000000000 (0)
00:00:00.720301   PCIDeviceNo   <integer> = 0x000000000000000d (13)
00:00:00.720302   PCIFunctionNo <integer> = 0x0000000000000000 (0)
00:00:00.720302   Trusted       <integer> = 0x0000000000000001 (1)
00:00:00.720303 
00:00:00.720303 [/Devices/ahci/0/Config/] (level 4)
00:00:00.720304   Bootable  <integer> = 0x0000000000000001 (1)
00:00:00.720304   PortCount <integer> = 0x0000000000000001 (1)
00:00:00.720305 
00:00:00.720305 [/Devices/ahci/0/Config/Port0/] (level 5)
00:00:00.720306   Hotpluggable        <integer> = 0x0000000000000000 (0)
00:00:00.720306   NonRotationalMedium <integer> = 0x0000000000000000 (0)
00:00:00.720307 
00:00:00.720307 [/Devices/ahci/0/LUN#0/] (level 4)
00:00:00.720308   Driver <string>  = "Block" (cb=6)
00:00:00.720308 
00:00:00.720309 [/Devices/ahci/0/LUN#0/AttachedDriver/] (level 5)
00:00:00.720310   Driver <string>  = "VD" (cb=3)
00:00:00.720310 
00:00:00.720310 [/Devices/ahci/0/LUN#0/AttachedDriver/Config/] (level 6)
00:00:00.720312   BlockCache <integer> = 0x0000000000000001 (1)
00:00:00.720312   Format     <string>  = "VDI" (cb=4)
00:00:00.720312   Path       <string>  = "G:\MaquinasVirtualesChimpFarm\KitKat720x1280x16\tools\VM\Android.vdi" (cb=69)
00:00:00.720313   Type       <string>  = "HardDisk" (cb=9)
00:00:00.720314   UseNewIo   <integer> = 0x0000000000000001 (1)
00:00:00.720314 
00:00:00.720314 [/Devices/ahci/0/LUN#0/Config/] (level 5)
00:00:00.720315   Mountable <integer> = 0x0000000000000000 (0)
00:00:00.720316   Type      <string>  = "HardDisk" (cb=9)
00:00:00.720316 
00:00:00.720316 [/Devices/ahci/0/LUN#999/] (level 4)
00:00:00.720317   Driver <string>  = "MainStatus" (cb=11)
00:00:00.720318 
00:00:00.720318 [/Devices/ahci/0/LUN#999/Config/] (level 5)
00:00:00.720319   DeviceInstance        <string>  = "ahci/0" (cb=7)
00:00:00.720319   First                 <integer> = 0x0000000000000000 (0)
00:00:00.720320   Last                  <integer> = 0x0000000000000000 (0)
00:00:00.720321   pConsole              <integer> = 0x0000000004455f20 (71 655 200)
00:00:00.720322   papLeds               <integer> = 0x0000000004456268 (71 656 040)
00:00:00.720323   pmapMediumAttachments <integer> = 0x0000000004456550 (71 656 784)
00:00:00.720323 
00:00:00.720324 [/Devices/apic/] (level 2)
00:00:00.720324 
00:00:00.720325 [/Devices/apic/0/] (level 3)
00:00:00.720325   Trusted <integer> = 0x0000000000000001 (1)
00:00:00.720326 
00:00:00.720326 [/Devices/apic/0/Config/] (level 4)
00:00:00.720327   IOAPIC  <integer> = 0x0000000000000000 (0)
00:00:00.720327   NumCPUs <integer> = 0x0000000000000001 (1)
00:00:00.720328 
00:00:00.720328 [/Devices/e1000/] (level 2)
00:00:00.720329 
00:00:00.720329 [/Devices/e1000/0/] (level 3)
00:00:00.720330   PCIBusNo      <integer> = 0x0000000000000000 (0)
00:00:00.720330   PCIDeviceNo   <integer> = 0x0000000000000003 (3)
00:00:00.720331   PCIFunctionNo <integer> = 0x0000000000000000 (0)
00:00:00.720331   Trusted       <integer> = 0x0000000000000001 (1)
00:00:00.720332 
00:00:00.720332 [/Devices/e1000/0/Config/] (level 4)
00:00:00.720333   AdapterType    <integer> = 0x0000000000000000 (0)
00:00:00.720333   CableConnected <integer> = 0x0000000000000001 (1)
00:00:00.720334   LineSpeed      <integer> = 0x0000000000000000 (0)
00:00:00.720334   MAC            <bytes>   = "08 00 27 0c fc 05" (cb=6)
00:00:00.720335 
00:00:00.720336 [/Devices/e1000/0/LUN#0/] (level 4)
00:00:00.720336   Driver <string>  = "NAT" (cb=4)
00:00:00.720337 
00:00:00.720337 [/Devices/e1000/0/LUN#0/Config/] (level 5)
00:00:00.720338   AliasMode       <integer> = 0x0000000000000000 (0)
00:00:00.720338   BootFile        <string>  = "KitKat.pxe" (cb=11)
00:00:00.720339   DNSProxy        <integer> = 0x0000000000000000 (0)
00:00:00.720340   Network         <string>  = "10.0.2.0/24" (cb=12)
00:00:00.720340   PassDomain      <integer> = 0x0000000000000001 (1)
00:00:00.720341   TFTPPrefix      <string>  = "C:\Users\ca.escobar2434/.VirtualBox\TFTP" (cb=41)
00:00:00.720341   UseHostResolver <integer> = 0x0000000000000000 (0)
00:00:00.720342 
00:00:00.720342 [/Devices/e1000/0/LUN#0/Config/Rule 1/] (level 6)
00:00:00.720343   GuestPort <integer> = 0x00000000000015b3 (5 555)
00:00:00.720344   HostPort  <integer> = 0x000000000000d8ff (55 551)
00:00:00.720344   Protocol  <string>  = "TCP" (cb=4)
00:00:00.720345 
00:00:00.720345 [/Devices/e1000/0/LUN#0/Config/Rule 2/] (level 6)
00:00:00.720346   GuestPort <integer> = 0x00000000000015b2 (5 554)
00:00:00.720347   HostPort  <integer> = 0x000000000000d8f5 (55 541)
00:00:00.720347   Protocol  <string>  = "TCP" (cb=4)
00:00:00.720348 
00:00:00.720348 [/Devices/e1000/0/LUN#999/] (level 4)
00:00:00.720348   Driver <string>  = "MainStatus" (cb=11)
00:00:00.720349 
00:00:00.720349 [/Devices/e1000/0/LUN#999/Config/] (level 5)
00:00:00.720350   First   <integer> = 0x0000000000000000 (0)
00:00:00.720350   Last    <integer> = 0x0000000000000000 (0)
00:00:00.720351   papLeds <integer> = 0x0000000004456418 (71 656 472)
00:00:00.720352 
00:00:00.720352 [/Devices/i8254/] (level 2)
00:00:00.720353 
00:00:00.720353 [/Devices/i8254/0/] (level 3)
00:00:00.720354 
00:00:00.720354 [/Devices/i8254/0/Config/] (level 4)
00:00:00.720354 
00:00:00.720355 [/Devices/i8259/] (level 2)
00:00:00.720355 
00:00:00.720356 [/Devices/i8259/0/] (level 3)
00:00:00.720356   Trusted <integer> = 0x0000000000000001 (1)
00:00:00.720357 
00:00:00.720357 [/Devices/i8259/0/Config/] (level 4)
00:00:00.720358 
00:00:00.720358 [/Devices/ichac97/] (level 2)
00:00:00.720359 
00:00:00.720359 [/Devices/ichac97/0/] (level 3)
00:00:00.720360   PCIBusNo      <integer> = 0x0000000000000000 (0)
00:00:00.720361   PCIDeviceNo   <integer> = 0x0000000000000005 (5)
00:00:00.720361   PCIFunctionNo <integer> = 0x0000000000000000 (0)
00:00:00.720362   Trusted       <integer> = 0x0000000000000001 (1)
00:00:00.720362 
00:00:00.720362 [/Devices/ichac97/0/Config/] (level 4)
00:00:00.720363 
00:00:00.720363 [/Devices/ichac97/0/LUN#0/] (level 4)
00:00:00.720364   Driver <string>  = "AUDIO" (cb=6)
00:00:00.720364 
00:00:00.720365 [/Devices/ichac97/0/LUN#0/Config/] (level 5)
00:00:00.720366   AudioDriver <string>  = "dsound" (cb=7)
00:00:00.720366   StreamName  <string>  = "KitKat" (cb=7)
00:00:00.720366 
00:00:00.720367 [/Devices/mc146818/] (level 2)
00:00:00.720367 
00:00:00.720368 [/Devices/mc146818/0/] (level 3)
00:00:00.720368 
00:00:00.720369 [/Devices/mc146818/0/Config/] (level 4)
00:00:00.720369   UseUTC <integer> = 0x0000000000000001 (1)
00:00:00.720370 
00:00:00.720370 [/Devices/parallel/] (level 2)
00:00:00.720371 
00:00:00.720371 [/Devices/pcarch/] (level 2)
00:00:00.720371 
00:00:00.720372 [/Devices/pcarch/0/] (level 3)
00:00:00.720372   Trusted <integer> = 0x0000000000000001 (1)
00:00:00.720373 
00:00:00.720373 [/Devices/pcarch/0/Config/] (level 4)
00:00:00.720374 
00:00:00.720374 [/Devices/pcbios/] (level 2)
00:00:00.720375 
00:00:00.720375 [/Devices/pcbios/0/] (level 3)
00:00:00.720376   Trusted <integer> = 0x0000000000000001 (1)
00:00:00.720376 
00:00:00.720376 [/Devices/pcbios/0/Config/] (level 4)
00:00:00.720378   BootDevice0        <string>  = "FLOPPY" (cb=7)
00:00:00.720378   BootDevice1        <string>  = "DVD" (cb=4)
00:00:00.720379   BootDevice2        <string>  = "IDE" (cb=4)
00:00:00.720379   BootDevice3        <string>  = "NONE" (cb=5)
00:00:00.720380   FloppyDevice       <string>  = "i82078" (cb=7)
00:00:00.720380   HardDiskDevice     <string>  = "piix3ide" (cb=9)
00:00:00.720381   IOAPIC             <integer> = 0x0000000000000000 (0)
00:00:00.720381   McfgBase           <integer> = 0x0000000000000000 (0)
00:00:00.720382   McfgLength         <integer> = 0x0000000000000000 (0)
00:00:00.720383   NumCPUs            <integer> = 0x0000000000000001 (1)
00:00:00.720383   PXEDebug           <integer> = 0x0000000000000000 (0)
00:00:00.720384   RamHoleSize        <integer> = 0x0000000020000000 (536 870 912, 512 MB)
00:00:00.720385   RamSize            <integer> = 0x0000000040000000 (1 073 741 824, 1 024 MB)
00:00:00.720386   SataHardDiskDevice <string>  = "ahci" (cb=5)
00:00:00.720386   SataLUN1           <integer> = 0x0000000000000000 (0)
00:00:00.720387   UUID               <bytes>   = "ae 04 99 d2 cb 7a 79 46 b0 77 13 f7 bb 9b 3d 51" (cb=16)
00:00:00.720389 
00:00:00.720389 [/Devices/pcbios/0/Config/NetBoot/] (level 5)
00:00:00.720389 
00:00:00.720390 [/Devices/pcbios/0/Config/NetBoot/0/] (level 6)
00:00:00.720391   NIC           <integer> = 0x0000000000000000 (0)
00:00:00.720391   PCIBusNo      <integer> = 0x0000000000000000 (0)
00:00:00.720392   PCIDeviceNo   <integer> = 0x0000000000000003 (3)
00:00:00.720392   PCIFunctionNo <integer> = 0x0000000000000000 (0)
00:00:00.720393 
00:00:00.720393 [/Devices/pci/] (level 2)
00:00:00.720394 
00:00:00.720394 [/Devices/pci/0/] (level 3)
00:00:00.720394   Trusted <integer> = 0x0000000000000001 (1)
00:00:00.720395 
00:00:00.720395 [/Devices/pci/0/Config/] (level 4)
00:00:00.720396   IOAPIC <integer> = 0x0000000000000000 (0)
00:00:00.720396 
00:00:00.720397 [/Devices/pckbd/] (level 2)
00:00:00.720397 
00:00:00.720397 [/Devices/pckbd/0/] (level 3)
00:00:00.720398   Trusted <integer> = 0x0000000000000001 (1)
00:00:00.720399 
00:00:00.720399 [/Devices/pckbd/0/Config/] (level 4)
00:00:00.720400 
00:00:00.720400 [/Devices/pckbd/0/LUN#0/] (level 4)
00:00:00.720401   Driver <string>  = "KeyboardQueue" (cb=14)
00:00:00.720401 
00:00:00.720402 [/Devices/pckbd/0/LUN#0/AttachedDriver/] (level 5)
00:00:00.720402   Driver <string>  = "MainKeyboard" (cb=13)
00:00:00.720403 
00:00:00.720403 [/Devices/pckbd/0/LUN#0/AttachedDriver/Config/] (level 6)
00:00:00.720404   Object <integer> = 0x0000000003a95260 (61 428 320)
00:00:00.720405 
00:00:00.720405 [/Devices/pckbd/0/LUN#0/Config/] (level 5)
00:00:00.720406   QueueSize <integer> = 0x0000000000000040 (64)
00:00:00.720406 
00:00:00.720407 [/Devices/pckbd/0/LUN#1/] (level 4)
00:00:00.720407   Driver <string>  = "MouseQueue" (cb=11)
00:00:00.720408 
00:00:00.720408 [/Devices/pckbd/0/LUN#1/AttachedDriver/] (level 5)
00:00:00.720409   Driver <string>  = "MainMouse" (cb=10)
00:00:00.720409 
00:00:00.720409 [/Devices/pckbd/0/LUN#1/AttachedDriver/Config/] (level 6)
00:00:00.720410   Object <integer> = 0x0000000004365f10 (70 672 144)
00:00:00.720411 
00:00:00.720411 [/Devices/pckbd/0/LUN#1/Config/] (level 5)
00:00:00.720412   QueueSize <integer> = 0x0000000000000080 (128)
00:00:00.720413 
00:00:00.720413 [/Devices/pcnet/] (level 2)
00:00:00.720413 
00:00:00.720414 [/Devices/piix3ide/] (level 2)
00:00:00.720414 
00:00:00.720415 [/Devices/piix3ide/0/] (level 3)
00:00:00.720415   PCIBusNo      <integer> = 0x0000000000000000 (0)
00:00:00.720416   PCIDeviceNo   <integer> = 0x0000000000000001 (1)
00:00:00.720416   PCIFunctionNo <integer> = 0x0000000000000001 (1)
00:00:00.720417   Trusted       <integer> = 0x0000000000000001 (1)
00:00:00.720418 
00:00:00.720418 [/Devices/piix3ide/0/Config/] (level 4)
00:00:00.720419   Type <string>  = "PIIX4" (cb=6)
00:00:00.720419 
00:00:00.720419 [/Devices/piix3ide/0/Config/SecondaryMaster/] (level 5)
00:00:00.720420   NonRotationalMedium <integer> = 0x0000000000000000 (0)
00:00:00.720421 
00:00:00.720421 [/Devices/piix3ide/0/LUN#2/] (level 4)
00:00:00.720422   Driver <string>  = "Block" (cb=6)
00:00:00.720423 
00:00:00.720423 [/Devices/piix3ide/0/LUN#2/Config/] (level 5)
00:00:00.720424   Mountable <integer> = 0x0000000000000001 (1)
00:00:00.720424   Type      <string>  = "DVD" (cb=4)
00:00:00.720425 
00:00:00.720425 [/Devices/piix3ide/0/LUN#999/] (level 4)
00:00:00.720426   Driver <string>  = "MainStatus" (cb=11)
00:00:00.720426 
00:00:00.720426 [/Devices/piix3ide/0/LUN#999/Config/] (level 5)
00:00:00.720427   DeviceInstance        <string>  = "piix3ide/0" (cb=11)
00:00:00.720428   First                 <integer> = 0x0000000000000000 (0)
00:00:00.720429   Last                  <integer> = 0x0000000000000003 (3)
00:00:00.720430   pConsole              <integer> = 0x0000000004455f20 (71 655 200)
00:00:00.720431   papLeds               <integer> = 0x0000000004456248 (71 656 008)
00:00:00.720431   pmapMediumAttachments <integer> = 0x0000000004456550 (71 656 784)
00:00:00.720432 
00:00:00.720432 [/Devices/serial/] (level 2)
00:00:00.720433 
00:00:00.720433 [/Devices/usb-ohci/] (level 2)
00:00:00.720434 
00:00:00.720434 [/Devices/usb-ohci/0/] (level 3)
00:00:00.720435   PCIBusNo      <integer> = 0x0000000000000000 (0)
00:00:00.720435   PCIDeviceNo   <integer> = 0x0000000000000006 (6)
00:00:00.720436   PCIFunctionNo <integer> = 0x0000000000000000 (0)
00:00:00.720436   Trusted       <integer> = 0x0000000000000001 (1)
00:00:00.720437 
00:00:00.720437 [/Devices/usb-ohci/0/Config/] (level 4)
00:00:00.720438 
00:00:00.720438 [/Devices/usb-ohci/0/LUN#0/] (level 4)
00:00:00.720439   Driver <string>  = "VUSBRootHub" (cb=12)
00:00:00.720439 
00:00:00.720439 [/Devices/usb-ohci/0/LUN#0/Config/] (level 5)
00:00:00.720440 
00:00:00.720440 [/Devices/usb-ohci/0/LUN#999/] (level 4)
00:00:00.720441   Driver <string>  = "MainStatus" (cb=11)
00:00:00.720441 
00:00:00.720442 [/Devices/usb-ohci/0/LUN#999/Config/] (level 5)
00:00:00.720442   First   <integer> = 0x0000000000000000 (0)
00:00:00.720443   Last    <integer> = 0x0000000000000000 (0)
00:00:00.720443   papLeds <integer> = 0x0000000004456540 (71 656 768)
00:00:00.720444 
00:00:00.720444 [/Devices/vga/] (level 2)
00:00:00.720445 
00:00:00.720445 [/Devices/vga/0/] (level 3)
00:00:00.720446   PCIBusNo      <integer> = 0x0000000000000000 (0)
00:00:00.720446   PCIDeviceNo   <integer> = 0x0000000000000002 (2)
00:00:00.720447   PCIFunctionNo <integer> = 0x0000000000000000 (0)
00:00:00.720447   Trusted       <integer> = 0x0000000000000001 (1)
00:00:00.720448 
00:00:00.720448 [/Devices/vga/0/Config/] (level 4)
00:00:00.720449   CustomVideoModes <integer> = 0x0000000000000000 (0)
00:00:00.720449   FadeIn           <integer> = 0x0000000000000001 (1)
00:00:00.720450   FadeOut          <integer> = 0x0000000000000001 (1)
00:00:00.720450   HeightReduction  <integer> = 0x0000000000000000 (0)
00:00:00.720451   LogoFile         <string>  = "" (cb=1)
00:00:00.720452   LogoTime         <integer> = 0x0000000000000000 (0)
00:00:00.720452   MonitorCount     <integer> = 0x0000000000000001 (1)
00:00:00.720453   ShowBootMenu     <integer> = 0x0000000000000002 (2)
00:00:00.720453   VRamSize         <integer> = 0x0000000001000000 (16 777 216, 16 MB)
00:00:00.720454 
00:00:00.720454 [/Devices/vga/0/LUN#0/] (level 4)
00:00:00.720455   Driver <string>  = "MainDisplay" (cb=12)
00:00:00.720456 
00:00:00.720456 [/Devices/vga/0/LUN#0/Config/] (level 5)
00:00:00.720456   Object <integer> = 0x00000000044685c0 (71 730 624)
00:00:00.720457 
00:00:00.720457 [/Devices/virtio-net/] (level 2)
00:00:00.720458 
00:00:00.720458 [/EM/] (level 1)
00:00:00.720459   TripleFaultReset <integer> = 0x0000000000000000 (0)
00:00:00.720459 
00:00:00.720460 [/HM/] (level 1)
00:00:00.720460   64bitEnabled       <integer> = 0x0000000000000000 (0)
00:00:00.720461   EnableLargePages   <integer> = 0x0000000000000001 (1)
00:00:00.720461   EnableNestedPaging <integer> = 0x0000000000000001 (1)
00:00:00.720462   EnableUX           <integer> = 0x0000000000000001 (1)
00:00:00.720462   EnableVPID         <integer> = 0x0000000000000001 (1)
00:00:00.720463   Exclusive          <integer> = 0x0000000000000000 (0)
00:00:00.720464   HMForced           <integer> = 0x0000000000000000 (0)
00:00:00.720464 
00:00:00.720464 [/MM/] (level 1)
00:00:00.720465   CanUseLargerHeap <integer> = 0x0000000000000000 (0)
00:00:00.720466 
00:00:00.720466 [/PDM/] (level 1)
00:00:00.720467 
00:00:00.720467 [/PDM/AsyncCompletion/] (level 2)
00:00:00.720468 
00:00:00.720468 [/PDM/AsyncCompletion/File/] (level 3)
00:00:00.720469 
00:00:00.720469 [/PDM/AsyncCompletion/File/BwGroups/] (level 4)
00:00:00.720470 
00:00:00.720470 [/PDM/BlkCache/] (level 2)
00:00:00.720471   CacheSize <integer> = 0x0000000000500000 (5 242 880, 5 MB)
00:00:00.720472 
00:00:00.720472 [/PDM/Devices/] (level 2)
00:00:00.720472 
00:00:00.720473 [/PDM/Drivers/] (level 2)
00:00:00.720473 
00:00:00.720473 [/PDM/Drivers/VBoxC/] (level 3)
00:00:00.720474   Path <string>  = "VBoxC" (cb=6)
00:00:00.720475 
00:00:00.720475 [/PDM/NetworkShaper/] (level 2)
00:00:00.720475 
00:00:00.720476 [/PDM/NetworkShaper/BwGroups/] (level 3)
00:00:00.720476 
00:00:00.720477 [/TM/] (level 1)
00:00:00.720477   UTCOffset <integer> = 0x0000000000000000 (0)
00:00:00.720478 
00:00:00.720478 [/USB/] (level 1)
00:00:00.720478 
00:00:00.720478 [/USB/HidMouse/] (level 2)
00:00:00.720479 
00:00:00.720479 [/USB/HidMouse/0/] (level 3)
00:00:00.720480 
00:00:00.720480 [/USB/HidMouse/0/Config/] (level 4)
00:00:00.720481   Mode <string>  = "absolute" (cb=9)
00:00:00.720481 
00:00:00.720482 [/USB/HidMouse/0/LUN#0/] (level 4)
00:00:00.720482   Driver <string>  = "MouseQueue" (cb=11)
00:00:00.720483 
00:00:00.720483 [/USB/HidMouse/0/LUN#0/AttachedDriver/] (level 5)
00:00:00.720484   Driver <string>  = "MainMouse" (cb=10)
00:00:00.720484 
00:00:00.720484 [/USB/HidMouse/0/LUN#0/AttachedDriver/Config/] (level 6)
00:00:00.720485   Object <integer> = 0x0000000004365f10 (70 672 144)
00:00:00.720486 
00:00:00.720486 [/USB/HidMouse/0/LUN#0/Config/] (level 5)
00:00:00.720487   QueueSize <integer> = 0x0000000000000080 (128)
00:00:00.720488 
00:00:00.720488 [/USB/USBProxy/] (level 2)
00:00:00.720488 
00:00:00.720489 [/USB/USBProxy/GlobalConfig/] (level 3)
00:00:00.720489 
00:00:00.720490 ********************* End of CFGM dump **********************
00:00:00.720495 VM: fHMEnabled=true  (configured) fRecompileUser=false fRecompileSupervisor=false
00:00:00.720497 VM: fRawRing1Enabled=false CSAM=true  PATM=true 
00:00:00.720566 HMR3Init: VT-x w/ nested paging
00:00:00.720596 MM: cbHyperHeap=0x100000 (1048576)
00:00:00.721800 CPUM: Matched host CPU INTEL 0x6/0x3c/0x3 Intel_Core7_Haswell with CPU DB entry 'Intel Core i5-3570' (INTEL 0x6/0x3a/0x9 Intel_Core7_IvyBridge).
00:00:00.722547 Debug: HCPhysInterPD=00000000c8c5b000 HCPhysInterPaePDPT=00000000c8c58000 HCPhysInterPaePML4=00000000c8c56000
00:00:00.722554 Debug: apInterPTs={00000000c8c5a000,00000000c8c59000} apInterPaePTs={0000000472b96000,00000007db997000} apInterPaePDs={000000016b218000,000000011af19000,000000049699a000,00000003b991b000} pInterPaePDPT64=00000000c8c57000
00:00:00.722559 Host paging mode: AMD64+PGE+NX
00:00:00.722564 PGMPool: cMaxPages=560 (u64MaxPages=545)
00:00:00.722567 pgmR3PoolInit: cMaxPages=0x230 cMaxUsers=0x460 cMaxPhysExts=0x460 fCacheEnable=true 
00:00:00.730129 TM: GIP - u32Mode=1 (SyncTSC) u32UpdateHz=100
00:00:00.762118 TM: cTSCTicksPerSecond=0xd603b1e7 (3 590 566 375) fTSCVirtualized=true  fTSCUseRealTSC=false
00:00:00.762133 TM: fMaybeUseOffsettedHostTSC=true  TSCTiedToExecution=false TSCNotTiedToHalt=false
00:00:00.766511 CoreCode: R3=0000000000f30000 R0=fffff88022490000 RC=a0553000 Phys=00000000c8bfb000 cb=0x1000
00:00:00.767059 AIOMgr: Default manager type is "Async"
00:00:00.767082 AIOMgr: Default file backend is "NonBuffered"
00:00:00.767628 BlkCache: Cache successfully initialised. Cache size is 5242880 bytes
00:00:00.767664 BlkCache: Cache commit interval is 10000 ms
00:00:00.767676 BlkCache: Cache commit threshold is 2621440 bytes
00:00:00.879550 [SMP] BIOS with 1 CPUs
00:00:00.888724 SUP: Loaded VBoxDDR0.r0 (C:\Program Files\Oracle\VirtualBox\VBoxDDR0.r0) at 0xfffff8802499a000 - ModuleInit at 0000000000000000 and ModuleTerm at 0000000000000000 using the native ring-0 loader
00:00:00.888735 SUP: windbg> .reload /f C:\Program Files\Oracle\VirtualBox\VBoxDDR0.r0=0xfffff8802499a000
00:00:00.895972 SUP: Loaded VBoxDD2R0.r0 (C:\Program Files\Oracle\VirtualBox\VBoxDD2R0.r0) at 0xfffff880249be000 - ModuleInit at 0000000000000000 and ModuleTerm at 0000000000000000 using the native ring-0 loader
00:00:00.895982 SUP: windbg> .reload /f C:\Program Files\Oracle\VirtualBox\VBoxDD2R0.r0=0xfffff880249be000
00:00:00.896011 Activating Local APIC
00:00:00.896017 CPUM: SetGuestCpuIdFeature: Enabled APIC
00:00:00.896180 PIT: mode=3 count=0x10000 (65536) - 18.20 Hz (ch=0)
00:00:00.904413 Shared Folders service loaded.
00:00:00.908004 DrvBlock: Flushes will be ignored
00:00:00.908025 DrvBlock: Async flushes will be passed to the disk
00:00:00.908154 VDInit finished
00:00:00.909013 AIOMgr: Endpoint for file 'G:\MaquinasVirtualesChimpFarm\KitKat720x1280x16\tools\VM\Android.vdi' (flags 000c0723) created successfully
00:00:00.911299 VD: Opening the disk took 3246360 ns
00:00:00.911319 AHCI: LUN#0: disk, PCHS=12483/16/63, total number of sectors 12582912
00:00:00.911326 AHCI: LUN#0: using async I/O
00:00:00.911436 AHCI#0: Reset the HBA
00:00:00.911575 PIIX3 ATA: LUN#0: no unit
00:00:00.911581 PIIX3 ATA: LUN#1: no unit
00:00:00.911632 DrvBlock: Flushes will be ignored
00:00:00.911637 DrvBlock: Async flushes will be passed to the disk
00:00:00.911736 PIIX3 ATA: LUN#2: CD/DVD, total number of sectors 0, passthrough disabled
00:00:00.911743 PIIX3 ATA: LUN#3: no unit
00:00:00.911765 PIIX3 ATA: Ctl#0: finished processing RESET
00:00:00.911829 PIIX3 ATA: Ctl#1: finished processing RESET
00:00:00.926130 NAT: DNS#0: 157.253.79.100
00:00:00.926475 Audio: Trying driver 'dsound'.
00:00:00.975000 Audio: set_record_source ars=0 als=0 (not implemented)
00:00:01.013230 VUSB: attached 'HidMouse' to port 1
00:00:01.013609 DevPcBios: SATA LUN#0 LCHS=783/255/63
00:00:01.013650 PGM: The CPU physical address width is 39 bits
00:00:01.013654 PGMR3InitFinalize: 4 MB PSE mask 0000007fffffffff
00:00:01.034798 VMM: Thread-context hooks unavailable.
00:00:01.041873 HM: Using VT-x implementation 2.0!
00:00:01.041874 HM: Host CR4                        = 0x406f8
00:00:01.041875 HM: Host EFER                       = 0xd01
00:00:01.041876 HM: MSR_IA32_FEATURE_CONTROL        = 0x5
00:00:01.041876 HM: MSR_IA32_VMX_BASIC_INFO         = 0xda040000000012
00:00:01.041877 HM:   VMCS id                             = 0x12
00:00:01.041878 HM:   VMCS size                           = 1024 bytes
00:00:01.041878 HM:   VMCS physical address limit         = None
00:00:01.041879 HM:   VMCS memory type                    = 0x6
00:00:01.041889 HM:   Dual-monitor treatment support      = true 
00:00:01.041889 HM:   OUTS & INS instruction-info         = true 
00:00:01.041890 HM: Max resume loops                = 1024
00:00:01.041890 HM: MSR_IA32_VMX_PINBASED_CTLS      = 0x7f00000016
00:00:01.041890 HM:   VMX_VMCS_CTRL_PIN_EXEC_EXT_INT_EXIT
00:00:01.041891 HM:   VMX_VMCS_CTRL_PIN_EXEC_NMI_EXIT
00:00:01.041892 HM:   VMX_VMCS_CTRL_PIN_EXEC_VIRTUAL_NMI
00:00:01.041893 HM:   VMX_VMCS_CTRL_PIN_EXEC_PREEMPT_TIMER
00:00:01.041893 HM: MSR_IA32_VMX_PROCBASED_CTLS     = 0xfff9fffe0401e172
00:00:01.041894 HM:   VMX_VMCS_CTRL_PROC_EXEC_INT_WINDOW_EXIT
00:00:01.041894 HM:   VMX_VMCS_CTRL_PROC_EXEC_USE_TSC_OFFSETTING
00:00:01.041895 HM:   VMX_VMCS_CTRL_PROC_EXEC_HLT_EXIT
00:00:01.041895 HM:   VMX_VMCS_CTRL_PROC_EXEC_INVLPG_EXIT
00:00:01.041895 HM:   VMX_VMCS_CTRL_PROC_EXEC_MWAIT_EXIT
00:00:01.041896 HM:   VMX_VMCS_CTRL_PROC_EXEC_RDPMC_EXIT
00:00:01.041897 HM:   VMX_VMCS_CTRL_PROC_EXEC_RDTSC_EXIT
00:00:01.041897 HM:   VMX_VMCS_CTRL_PROC_EXEC_CR3_LOAD_EXIT
00:00:01.041897 HM:   VMX_VMCS_CTRL_PROC_EXEC_CR3_LOAD_EXIT (must be set)
00:00:01.041897 HM:   VMX_VMCS_CTRL_PROC_EXEC_CR3_STORE_EXIT
00:00:01.041898 HM:   VMX_VMCS_CTRL_PROC_EXEC_CR3_STORE_EXIT (must be set)
00:00:01.041898 HM:   VMX_VMCS_CTRL_PROC_EXEC_CR8_LOAD_EXIT
00:00:01.041898 HM:   VMX_VMCS_CTRL_PROC_EXEC_CR8_STORE_EXIT
00:00:01.041898 HM:   VMX_VMCS_CTRL_PROC_EXEC_USE_TPR_SHADOW
00:00:01.041899 HM:   VMX_VMCS_CTRL_PROC_EXEC_NMI_WINDOW_EXIT
00:00:01.041899 HM:   VMX_VMCS_CTRL_PROC_EXEC_MOV_DR_EXIT
00:00:01.041899 HM:   VMX_VMCS_CTRL_PROC_EXEC_UNCOND_IO_EXIT
00:00:01.041900 HM:   VMX_VMCS_CTRL_PROC_EXEC_USE_IO_BITMAPS
00:00:01.041900 HM:   VMX_VMCS_CTRL_PROC_EXEC_MONITOR_TRAP_FLAG
00:00:01.041900 HM:   VMX_VMCS_CTRL_PROC_EXEC_USE_MSR_BITMAPS
00:00:01.041900 HM:   VMX_VMCS_CTRL_PROC_EXEC_MONITOR_EXIT
00:00:01.041901 HM:   VMX_VMCS_CTRL_PROC_EXEC_PAUSE_EXIT
00:00:01.041901 HM:   VMX_VMCS_CTRL_PROC_EXEC_USE_SECONDARY_EXEC_CTRL
00:00:01.041902 HM: MSR_IA32_VMX_PROCBASED_CTLS2    = 0x7cff00000000
00:00:01.041903 HM:   VMX_VMCS_CTRL_PROC_EXEC2_VIRT_APIC
00:00:01.041903 HM:   VMX_VMCS_CTRL_PROC_EXEC2_EPT
00:00:01.041903 HM:   VMX_VMCS_CTRL_PROC_EXEC2_DESCRIPTOR_TABLE_EXIT
00:00:01.041904 HM:   VMX_VMCS_CTRL_PROC_EXEC2_RDTSCP
00:00:01.041904 HM:   VMX_VMCS_CTRL_PROC_EXEC2_VIRT_X2APIC
00:00:01.041904 HM:   VMX_VMCS_CTRL_PROC_EXEC2_VPID
00:00:01.041904 HM:   VMX_VMCS_CTRL_PROC_EXEC2_WBINVD_EXIT
00:00:01.041905 HM:   VMX_VMCS_CTRL_PROC_EXEC2_UNRESTRICTED_GUEST
00:00:01.041905 HM:   VMX_VMCS_CTRL_PROC_EXEC2_PAUSE_LOOP_EXIT
00:00:01.041905 HM:   VMX_VMCS_CTRL_PROC_EXEC2_RDRAND_EXIT
00:00:01.041905 HM:   VMX_VMCS_CTRL_PROC_EXEC2_INVPCID
00:00:01.041906 HM:   VMX_VMCS_CTRL_PROC_EXEC2_VMFUNC
00:00:01.041906 HM: MSR_IA32_VMX_ENTRY_CTLS         = 0xffff000011ff
00:00:01.041907 HM:   VMX_VMCS_CTRL_ENTRY_LOAD_DEBUG
00:00:01.041907 HM:   VMX_VMCS_CTRL_ENTRY_LOAD_DEBUG (must be set)
00:00:01.041907 HM:   VMX_VMCS_CTRL_ENTRY_IA32E_MODE_GUEST
00:00:01.041907 HM:   VMX_VMCS_CTRL_ENTRY_ENTRY_SMM
00:00:01.041908 HM:   VMX_VMCS_CTRL_ENTRY_DEACTIVATE_DUALMON
00:00:01.041909 HM:   VMX_VMCS_CTRL_ENTRY_LOAD_GUEST_PERF_MSR
00:00:01.041909 HM:   VMX_VMCS_CTRL_ENTRY_LOAD_GUEST_PAT_MSR
00:00:01.041909 HM:   VMX_VMCS_CTRL_ENTRY_LOAD_GUEST_EFER_MSR
00:00:01.041910 HM: MSR_IA32_VMX_EXIT_CTLS          = 0x7fffff00036dff
00:00:01.041910 HM:   VMX_VMCS_CTRL_EXIT_SAVE_DEBUG
00:00:01.041910 HM:   VMX_VMCS_CTRL_EXIT_SAVE_DEBUG (must be set)
00:00:01.041911 HM:   VMX_VMCS_CTRL_EXIT_HOST_ADDR_SPACE_SIZE
00:00:01.041911 HM:   VMX_VMCS_CTRL_EXIT_LOAD_PERF_MSR
00:00:01.041912 HM:   VMX_VMCS_CTRL_EXIT_ACK_EXT_INT
00:00:01.041913 HM:   VMX_VMCS_CTRL_EXIT_SAVE_GUEST_PAT_MSR
00:00:01.041913 HM:   VMX_VMCS_CTRL_EXIT_LOAD_HOST_PAT_MSR
00:00:01.041913 HM:   VMX_VMCS_CTRL_EXIT_SAVE_GUEST_EFER_MSR
00:00:01.041914 HM:   VMX_VMCS_CTRL_EXIT_LOAD_HOST_EFER_MSR
00:00:01.041914 HM:   VMX_VMCS_CTRL_EXIT_SAVE_VMX_PREEMPT_TIMER
00:00:01.041914 HM: MSR_IA32_VMX_EPT_VPID_CAP       = 0xf0106334141
00:00:01.041915 HM:   MSR_IA32_VMX_EPT_VPID_CAP_RWX_X_ONLY
00:00:01.041915 HM:   MSR_IA32_VMX_EPT_VPID_CAP_GAW_48_BITS
00:00:01.041915 HM:   MSR_IA32_VMX_EPT_VPID_CAP_EMT_UC
00:00:01.041916 HM:   MSR_IA32_VMX_EPT_VPID_CAP_EMT_WB
00:00:01.041916 HM:   MSR_IA32_VMX_EPT_VPID_CAP_SP_21_BITS
00:00:01.041916 HM:   MSR_IA32_VMX_EPT_VPID_CAP_SP_30_BITS
00:00:01.041916 HM:   MSR_IA32_VMX_EPT_VPID_CAP_INVEPT
00:00:01.041917 HM:   MSR_IA32_VMX_EPT_VPID_CAP_INVEPT_SINGLE_CONTEXT
00:00:01.041917 HM:   MSR_IA32_VMX_EPT_VPID_CAP_INVEPT_ALL_CONTEXTS
00:00:01.041917 HM:   MSR_IA32_VMX_EPT_VPID_CAP_INVVPID
00:00:01.041917 HM:   MSR_IA32_VMX_EPT_VPID_CAP_INVVPID_INDIV_ADDR
00:00:01.041918 HM:   MSR_IA32_VMX_EPT_VPID_CAP_INVVPID_SINGLE_CONTEXT
00:00:01.041918 HM:   MSR_IA32_VMX_EPT_VPID_CAP_INVVPID_ALL_CONTEXTS
00:00:01.041918 HM:   MSR_IA32_VMX_EPT_VPID_CAP_INVVPID_SINGLE_CONTEXT_RETAIN_GLOBALS
00:00:01.041919 HM: MSR_IA32_VMX_MISC               = 0x300481e5
00:00:01.041919 HM:   MSR_IA32_VMX_MISC_PREEMPT_TSC_BIT      = 0x5
00:00:01.041919 HM:   MSR_IA32_VMX_MISC_STORE_EFERLMA_VMEXIT = true 
00:00:01.041920 HM:   MSR_IA32_VMX_MISC_ACTIVITY_STATES      = 0x7
00:00:01.041920 HM:   MSR_IA32_VMX_MISC_CR3_TARGET           = 0x4
00:00:01.041921 HM:   MSR_IA32_VMX_MISC_MAX_MSR              = 512
00:00:01.041921 HM:   MSR_IA32_VMX_MISC_RDMSR_SMBASE_MSR_SMM = true 
00:00:01.041921 HM:   MSR_IA32_VMX_MISC_SMM_MONITOR_CTL_B2   = true 
00:00:01.041922 HM:   MSR_IA32_VMX_MISC_VMWRITE_VMEXIT_INFO  = true 
00:00:01.041922 HM:   MSR_IA32_VMX_MISC_MSEG_ID              = 0x0
00:00:01.041922 HM: MSR_IA32_VMX_CR0_FIXED0         = 0x80000021
00:00:01.041923 HM: MSR_IA32_VMX_CR0_FIXED1         = 0xffffffff
00:00:01.041923 HM: MSR_IA32_VMX_CR4_FIXED0         = 0x2000
00:00:01.041924 HM: MSR_IA32_VMX_CR4_FIXED1         = 0x1767ff
00:00:01.041925 HM: MSR_IA32_VMX_VMCS_ENUM          = 0x2a
00:00:01.041925 HM:   MSR_IA32_VMX_VMCS_ENUM_HIGHEST_INDEX   = 0x15
00:00:01.041926 HM: MSR_A32_VMX_VMFUNC              = 0x1
00:00:01.041926 HM:   VMX_VMCS_CTRL_VMFUNC_EPTP_SWITCHING
00:00:01.041926 HM: APIC-access page physaddr       = 0x00000000c8bfa000
00:00:01.041927 HM: VCPU  0: MSR bitmap physaddr    = 0x00000000c8bf7000
00:00:01.041928 HM: VCPU  0: VMCS physaddr          = 0x00000000c8bf9000
00:00:01.041929 HM: Guest support: 32-bit only.
00:00:01.041933 HM: Supports VMCS EFER fields       = true 
00:00:01.041933 HM: VMX enabled!
00:00:01.041940 CPUM: SetGuestCpuIdFeature: Enabled SYSENTER/EXIT
00:00:01.041940 HM: Nested paging enabled!
00:00:01.041941 HM:   EPT flush type                = VMX_FLUSH_EPT_SINGLE_CONTEXT
00:00:01.041941 HM: Unrestricted guest execution enabled!
00:00:01.041941 HM: Large page support enabled!
00:00:01.041942 HM: VPID enabled!
00:00:01.041942 HM:   VPID flush type               = VMX_FLUSH_VPID_SINGLE_CONTEXT
00:00:01.041944 HM: VMX-preemption timer enabled (cPreemptTimerShift=5).
00:00:01.041945 HM: VT-x/AMD-V init method: LOCAL
00:00:01.041946 VMM: fUsePeriodicPreemptionTimers=false
00:00:01.041961 Logical host processors: 8 present, 8 max, 8 online, online mask: 00000000000000ff
00:00:01.042383 Physical host cores: 4
00:00:01.042384 ************************* CPUID dump ************************
00:00:01.042389          RAW Standard CPUIDs
00:00:01.042389      Function  eax      ebx      ecx      edx
00:00:01.042390 Gst: 00000000  00000005 756e6547 6c65746e 49656e69
00:00:01.042391 Hst:           0000000d 756e6547 6c65746e 49656e69
00:00:01.042392 Gst: 00000001  000306c3 00000800 00000209 078bfbbf
00:00:01.042392 Hst:           000306c3 02100800 7ffafbff bfebfbff
00:00:01.042393 Gst: 00000002  76036301 00f0b5ff 00000000 00c10000
00:00:01.042394 Hst:           76036301 00f0b5ff 00000000 00c10000
00:00:01.042395 Gst: 00000003  00000000 00000000 00000000 00000000
00:00:01.042395 Hst:           00000000 00000000 00000000 00000000
00:00:01.042396 Gst: 00000004  00000000 00000000 00000000 00000000
00:00:01.042396 Hst:           1c004121 01c0003f 0000003f 00000000
00:00:01.042397 Gst: 00000005  00000040 00000040 00000000 00000000
00:00:01.042397 Hst:           00000040 00000040 00000003 00042120
00:00:01.042398 Hst: 00000006  00000077 00000002 00000009 00000000
00:00:01.042399 Hst: 00000007  00000000 000027ab 00000000 00000000
00:00:01.042400 Hst: 00000008  00000000 00000000 00000000 00000000
00:00:01.042400 Hst: 00000009  00000000 00000000 00000000 00000000
00:00:01.042401 Hst: 0000000a  07300403 00000000 00000000 00000603
00:00:01.042401 Hst: 0000000b  00000001 00000002 00000100 00000002
00:00:01.042402 Hst: 0000000c  00000000 00000000 00000000 00000000
00:00:01.042402 Hst: 0000000d  00000007 00000340 00000340 00000000
00:00:01.042403 Name:                            GenuineIntel
00:00:01.042404 Supports:                        0-5
00:00:01.042404 Family:                          6  	Extended: 0 	Effective: 6
00:00:01.042405 Model:                           12  	Extended: 3 	Effective: 60
00:00:01.042405 Stepping:                        3
00:00:01.042405 Type:                            0 (primary)
00:00:01.042406 APIC ID:                         0x00
00:00:01.042406 Logical CPUs:                    0
00:00:01.042406 CLFLUSH Size:                    8
00:00:01.042407 Brand ID:                        0x00
00:00:01.042407 Mnemonic - Description                 = guest (host)
00:00:01.042408 FPU - x87 FPU on Chip                  = 1 (1)
00:00:01.042408 VME - Virtual 8086 Mode Enhancements   = 1 (1)
00:00:01.042408 DE - Debugging extensions              = 1 (1)
00:00:01.042409 PSE - Page Size Extension              = 1 (1)
00:00:01.042409 TSC - Time Stamp Counter               = 1 (1)
00:00:01.042409 MSR - Model Specific Registers         = 1 (1)
00:00:01.042410 PAE - Physical Address Extension       = 0 (1)
00:00:01.042410 MCE - Machine Check Exception          = 1 (1)
00:00:01.042410 CX8 - CMPXCHG8B instruction            = 1 (1)
00:00:01.042411 APIC - APIC On-Chip                    = 1 (1)
00:00:01.042411 10 - Reserved                          = 0 (0)
00:00:01.042411 SEP - SYSENTER and SYSEXIT             = 1 (1)
00:00:01.042412 MTRR - Memory Type Range Registers     = 1 (1)
00:00:01.042412 PGE - PTE Global Bit                   = 1 (1)
00:00:01.042412 MCA - Machine Check Architecture       = 1 (1)
00:00:01.042412 CMOV - Conditional Move Instructions   = 1 (1)
00:00:01.042413 PAT - Page Attribute Table             = 1 (1)
00:00:01.042414 PSE-36 - 36-bit Page Size Extention    = 1 (1)
00:00:01.042414 PSN - Processor Serial Number          = 0 (0)
00:00:01.042414 CLFSH - CLFLUSH Instruction.           = 1 (1)
00:00:01.042415 20 - Reserved                          = 0 (0)
00:00:01.042415 DS - Debug Store                       = 0 (1)
00:00:01.042416 ACPI - Thermal Mon. & Soft. Clock Ctrl.= 0 (1)
00:00:01.042416 MMX - Intel MMX Technology             = 1 (1)
00:00:01.042416 FXSR - FXSAVE and FXRSTOR Instructions = 1 (1)
00:00:01.042416 SSE - SSE Support                      = 1 (1)
00:00:01.042418 SSE2 - SSE2 Support                    = 1 (1)
00:00:01.042418 SS - Self Snoop                        = 0 (1)
00:00:01.042418 HTT - Hyper-Threading Technology       = 0 (1)
00:00:01.042419 TM - Thermal Monitor                   = 0 (1)
00:00:01.042419 30 - Reserved                          = 0 (0)
00:00:01.042419 PBE - Pending Break Enable             = 0 (1)
00:00:01.042420 Supports SSE3                          = 1 (1)
00:00:01.042420 PCLMULQDQ                              = 0 (1)
00:00:01.042420 DS Area 64-bit layout                  = 0 (1)
00:00:01.042421 Supports MONITOR/MWAIT                 = 1 (1)
00:00:01.042421 CPL-DS - CPL Qualified Debug Store     = 0 (1)
00:00:01.042421 VMX - Virtual Machine Technology       = 0 (1)
00:00:01.042421 SMX - Safer Mode Extensions            = 0 (1)
00:00:01.042422 Enhanced SpeedStep Technology          = 0 (1)
00:00:01.042422 Terminal Monitor 2                     = 0 (1)
00:00:01.042422 Supplemental SSE3 instructions         = 1 (1)
00:00:01.042423 L1 Context ID                          = 0 (0)
00:00:01.042423 11 - Reserved                          = 0 (1)
00:00:01.042423 FMA extensions using YMM state         = 0 (1)
00:00:01.042424 CMPXCHG16B instruction                 = 0 (1)
00:00:01.042424 xTPR Update Control                    = 0 (1)
00:00:01.042424 Perf/Debug Capability MSR              = 0 (1)
00:00:01.042424 16 - Reserved                          = 0 (0)
00:00:01.042425 PCID - Process-context identifiers     = 0 (1)
00:00:01.042425 DCA - Direct Cache Access              = 0 (0)
00:00:01.042425 SSE4.1 instruction extensions          = 0 (1)
00:00:01.042426 SSE4.2 instruction extensions          = 0 (1)
00:00:01.042426 Supports the x2APIC extensions         = 0 (1)
00:00:01.042426 MOVBE instruction                      = 0 (1)
00:00:01.042427 POPCNT instruction                     = 0 (1)
00:00:01.042427 TSC-Deadline LAPIC timer mode          = 0 (1)
00:00:01.042427 AESNI instruction extensions           = 0 (1)
00:00:01.042428 XSAVE/XRSTOR extended state feature    = 0 (1)
00:00:01.042428 Supports OSXSAVE                       = 0 (1)
00:00:01.042428 AVX instruction extensions             = 0 (1)
00:00:01.042428 16-bit floating point conversion instr = 0 (1)
00:00:01.042429 RDRAND instruction                     = 0 (1)
00:00:01.042429 Hypervisor Present (we're a guest)     = 0 (0)
00:00:01.042429 
00:00:01.042430          RAW Extended CPUIDs
00:00:01.042430      Function  eax      ebx      ecx      edx
00:00:01.042430 Gst: 80000000  80000008 00000000 00000000 00000000
00:00:01.042431 Hst:           80000008 00000000 00000000 00000000
00:00:01.042432 Gst: 80000001  00000000 00000000 00000000 08000000
00:00:01.042432 Hst:           00000000 00000000 00000021 2c100800
00:00:01.042433 Gst: 80000002  65746e49 2952286c 726f4320 4d542865
00:00:01.042434 Hst:           65746e49 2952286c 726f4320 4d542865
00:00:01.042435 Gst: 80000003  37692029 3937342d 50432030 20402055
00:00:01.042436 Hst:           37692029 3937342d 50432030 20402055
00:00:01.042437 Gst: 80000004  30362e33 007a4847 00000000 00000000
00:00:01.042437 Hst:           30362e33 007a4847 00000000 00000000
00:00:01.042438 Gst: 80000005  00000000 00000000 00000000 00000000
00:00:01.042438 Hst:           00000000 00000000 00000000 00000000
00:00:01.042439 Gst: 80000006  00000000 00000000 01006040 00000000
00:00:01.042439 Hst:           00000000 00000000 01006040 00000000
00:00:01.042440 Gst: 80000007  00000000 00000000 00000000 00000000
00:00:01.042440 Hst:           00000000 00000000 00000000 00000100
00:00:01.042441 Gst: 80000008  00003027 00000000 00000000 00000000
00:00:01.042441 Hst:           00003027 00000000 00000000 00000000
00:00:01.042442 Gst: 80000009  00000007 00000340 00000340 00000000*
00:00:01.042443 Hst:           00000007 00000340 00000340 00000000
00:00:01.042443 Ext Name:                        
00:00:01.042444 Ext Supports:                    0x80000000-0x80000008
00:00:01.042444 Family:                          0  	Extended: 0 	Effective: 0
00:00:01.042445 Model:                           0  	Extended: 0 	Effective: 0
00:00:01.042445 Stepping:                        0
00:00:01.042445 Brand ID:                        0x000
00:00:01.042446 Mnemonic - Description                 = guest (host)
00:00:01.042446 FPU - x87 FPU on Chip                  = 0 (0)
00:00:01.042446 VME - Virtual 8086 Mode Enhancements   = 0 (0)
00:00:01.042447 DE - Debugging extensions              = 0 (0)
00:00:01.042447 PSE - Page Size Extension              = 0 (0)
00:00:01.042447 TSC - Time Stamp Counter               = 0 (0)
00:00:01.042448 MSR - K86 Model Specific Registers     = 0 (0)
00:00:01.042448 PAE - Physical Address Extension       = 0 (0)
00:00:01.042448 MCE - Machine Check Exception          = 0 (0)
00:00:01.042448 CX8 - CMPXCHG8B instruction            = 0 (0)
00:00:01.042449 APIC - APIC On-Chip                    = 0 (0)
00:00:01.042449 10 - Reserved                          = 0 (0)
00:00:01.042449 SEP - SYSCALL and SYSRET               = 0 (1)
00:00:01.042450 MTRR - Memory Type Range Registers     = 0 (0)
00:00:01.042450 PGE - PTE Global Bit                   = 0 (0)
00:00:01.042450 MCA - Machine Check Architecture       = 0 (0)
00:00:01.042451 CMOV - Conditional Move Instructions   = 0 (0)
00:00:01.042451 PAT - Page Attribute Table             = 0 (0)
00:00:01.042451 PSE-36 - 36-bit Page Size Extention    = 0 (0)
00:00:01.042451 18 - Reserved                          = 0 (0)
00:00:01.042452 19 - Reserved                          = 0 (0)
00:00:01.042452 NX - No-Execute Page Protection        = 0 (1)
00:00:01.042452 DS - Debug Store                       = 0 (0)
00:00:01.042453 AXMMX - AMD Extensions to MMX Instr.   = 0 (0)
00:00:01.042453 MMX - Intel MMX Technology             = 0 (0)
00:00:01.042453 FXSR - FXSAVE and FXRSTOR Instructions = 0 (0)
00:00:01.042454 25 - AMD fast FXSAVE and FXRSTOR Instr.= 0 (0)
00:00:01.042454 26 - 1 GB large page support           = 0 (1)
00:00:01.042454 27 - RDTSCP instruction                = 1 (1)
00:00:01.042455 28 - Reserved                          = 0 (0)
00:00:01.042456 29 - AMD Long Mode                     = 0 (1)
00:00:01.042456 30 - AMD Extensions to 3DNow!          = 0 (0)
00:00:01.042456 31 - AMD 3DNow!                        = 0 (0)
00:00:01.042457 LahfSahf - LAHF/SAHF in 64-bit mode    = 0 (1)
00:00:01.042458 CmpLegacy - Core MP legacy mode (depr) = 0 (0)
00:00:01.042458 SVM - AMD VM Extensions                = 0 (0)
00:00:01.042458 APIC registers starting at 0x400       = 0 (0)
00:00:01.042459 AltMovCR8 - LOCK MOV CR0 means MOV CR8 = 0 (0)
00:00:01.042459 5  - Advanced bit manipulation         = 0 (1)
00:00:01.042459 6  - SSE4A instruction support         = 0 (0)
00:00:01.042460 7  - Misaligned SSE mode               = 0 (0)
00:00:01.042460 8  - PREFETCH and PREFETCHW instruction= 0 (0)
00:00:01.042460 9  - OS visible workaround             = 0 (0)
00:00:01.042460 10 - Instruction based sampling        = 0 (0)
00:00:01.042461 11 - SSE5 support                      = 0 (0)
00:00:01.042461 12 - SKINIT, STGI, and DEV support     = 0 (0)
00:00:01.042461 13 - Watchdog timer support.           = 0 (0)
00:00:01.042462 31:14 - Reserved                       = 0x0 (0x0)
00:00:01.042462 Full Name:                       Intel(R) Core(TM) i7-4790 CPU @ 3.60GHz
00:00:01.042463 TLB 2/4M Instr/Uni:              res0     0 entries
00:00:01.042463 TLB 2/4M Data:                   res0     0 entries
00:00:01.042464 TLB 4K Instr/Uni:                res0     0 entries
00:00:01.042464 TLB 4K Data:                     res0     0 entries
00:00:01.042464 L1 Instr Cache Line Size:        0 bytes
00:00:01.042465 L1 Instr Cache Lines Per Tag:    0
00:00:01.042465 L1 Instr Cache Associativity:    res0  
00:00:01.042465 L1 Instr Cache Size:             0 KB
00:00:01.042465 L1 Data Cache Line Size:         0 bytes
00:00:01.042466 L1 Data Cache Lines Per Tag:     0
00:00:01.042466 L1 Data Cache Associativity:     res0  
00:00:01.042466 L1 Data Cache Size:              0 KB
00:00:01.042467 L2 TLB 2/4M Instr/Uni:           off       0 entries
00:00:01.042467 L2 TLB 2/4M Data:                off       0 entries
00:00:01.042468 L2 TLB 4K Instr/Uni:             off       0 entries
00:00:01.042468 L2 TLB 4K Data:                  off       0 entries
00:00:01.042468 L2 Cache Line Size:              0 bytes
00:00:01.042469 L2 Cache Lines Per Tag:          0
00:00:01.042469 L2 Cache Associativity:          off   
00:00:01.042469 L2 Cache Size:                   0 KB
00:00:01.042469 Host Invariant-TSC support:      true 
00:00:01.042470 APM Features:                   
00:00:01.042470 Physical Address Width:          39 bits
00:00:01.042471 Virtual Address Width:           48 bits
00:00:01.042471 Guest Physical Address Width:    0 bits
00:00:01.042471 Physical Core Count:             0
00:00:01.042472 
00:00:01.042472          RAW Centaur CPUIDs
00:00:01.042472      Function  eax      ebx      ecx      edx
00:00:01.042472 Gst: c0000000  00000007 00000340 00000340 00000000
00:00:01.042473 Hst:           00000007 00000340 00000340 00000000
00:00:01.042474 Gst: c0000001  00000007 00000340 00000340 00000000
00:00:01.042474 Hst:           00000007 00000340 00000340 00000000
00:00:01.042475 Gst: c0000002  00000007 00000340 00000340 00000000
00:00:01.042475 Hst:           00000007 00000340 00000340 00000000
00:00:01.042476 Gst: c0000003  00000007 00000340 00000340 00000000
00:00:01.042476 Hst:           00000007 00000340 00000340 00000000
00:00:01.042477 Centaur Supports:                0xc0000000-0x00000007
00:00:01.042477 Mnemonic - Description                 = guest (host)
00:00:01.042477 AIS - Alternate Instruction Set        = 0 (0)
00:00:01.042478 AIS-E - AIS enabled                    = 0 (0)
00:00:01.042478 RNG - Random Number Generator          = 0 (0)
00:00:01.042478 RNG-E - RNG enabled                    = 0 (0)
00:00:01.042479 LH - LongHaul MSR 0000_110Ah           = 0 (0)
00:00:01.042479 FEMMS - FEMMS                          = 0 (0)
00:00:01.042479 ACE - Advanced Cryptography Engine     = 0 (0)
00:00:01.042480 ACE-E - ACE enabled                    = 0 (0)
00:00:01.042480 ACE2 - Advanced Cryptography Engine 2  = 0 (0)
00:00:01.042480 ACE2-E - ACE enabled                   = 0 (0)
00:00:01.042481 PHE - Padlock Hash Engine              = 0 (0)
00:00:01.042481 PHE-E - PHE enabled                    = 0 (0)
00:00:01.042481 PMM - Montgomery Multiplier            = 0 (0)
00:00:01.042481 PMM-E - PMM enabled                    = 0 (0)
00:00:01.042482 14 - Reserved                          = 0 (0)
00:00:01.042482 15 - Reserved                          = 0 (0)
00:00:01.042482 Parallax                               = 0 (0)
00:00:01.042483 Parallax enabled                       = 0 (0)
00:00:01.042483 Overstress                             = 0 (0)
00:00:01.042483 Overstress enabled                     = 0 (0)
00:00:01.042484 TM3 - Temperature Monitoring 3         = 0 (0)
00:00:01.042484 TM3-E - TM3 enabled                    = 0 (0)
00:00:01.042484 RNG2 - Random Number Generator 2       = 0 (0)
00:00:01.042484 RNG2-E - RNG2 enabled                  = 0 (0)
00:00:01.042485 24 - Reserved                          = 0 (0)
00:00:01.042485 PHE2 - Padlock Hash Engine 2           = 0 (0)
00:00:01.042485 PHE2-E - PHE2 enabled                  = 0 (0)
00:00:01.042486 
00:00:01.042486 
00:00:01.042486 ******************** End of CPUID dump **********************
00:00:01.058539 VM: Halt method global1 (5)
00:00:01.058551 HaltedGlobal1 config: cNsSpinBlockThresholdCfg=125000
00:00:01.058554 Changing the VM state from 'CREATING' to 'CREATED'.
00:00:01.058747 Changing the VM state from 'CREATED' to 'POWERING_ON'.
00:00:01.061484 NAT: set redirect TCP host 0.0.0.0:55541 => guest 10.0.2.15:5554
00:00:01.069820 NAT: set redirect TCP host 0.0.0.0:55551 => guest 10.0.2.15:5555
00:00:01.069875 AIOMgr: Endpoints without assigned bandwidth groups:
00:00:01.069879 AIOMgr:     G:\MaquinasVirtualesChimpFarm\KitKat720x1280x16\tools\VM\Android.vdi
00:00:01.069955 Changing the VM state from 'POWERING_ON' to 'RUNNING'.
00:00:01.071696 Guest Log: BIOS: VirtualBox 4.3.40
00:00:01.071753 PIT: mode=2 count=0x10000 (65536) - 18.20 Hz (ch=0)
00:00:01.079126 PIIX3 ATA: Ctl#1: RESET, DevSel=0 AIOIf=0 CmdIf0=0x00 (-1 usec ago) CmdIf1=0x00 (-1 usec ago)
00:00:01.079150 PIIX3 ATA: Ctl#1: finished processing RESET
00:00:01.084104 AHCI#0: Reset the HBA
00:00:01.084139 AHCI#0: Port 0 reset
00:00:01.084415 Guest Log: BIOS: AHCI 0-P#0: PCHS=12483/16/63 LCHS=783/255/63 12582912 sectors
00:00:01.084440 PIT: mode=2 count=0x48d3 (18643) - 64.00 Hz (ch=0)
00:00:01.086078 ERROR [COM]: aRC=VBOX_E_IPRT_ERROR (0x80bb0005) aIID={480b372c-c0b5-4c23-9bd7-dcbb85b1594c} aComponent={Display} aText={Could not take a screenshot (VERR_NOT_SUPPORTED)}, preserve=false
00:00:01.091143 Display::handleDisplayResize(): uScreenId = 0, pvVRAM=0000000009ff0000 w=640 h=480 bpp=32 cbLine=0xA00, flags=0x1
00:00:01.091158 UIFrameBuffer::RequestResize: Screen=0, Format=843204434, BitsPerPixel=32, BytesPerLine=2560, Size=640x480, Sending to async-handler..
00:00:01.091195 UIFrameBufferQImage::resizeEvent: Format=843204434, BitsPerPixel=32, BytesPerLine=2560, Size=640x480
00:00:01.091205 UIFrameBufferQImage::resizeEvent: Resizing to directly use VGA device content..
00:00:01.334536 2D video acceleration is disabled.
00:00:01.334592 HID LEDs sync is disabled.
00:00:01.334612 UIMachineLogicNormal::sltCheckForRequestedVisualStateType: Requested-state=0, Machine-state=5
00:00:03.571961 PIT: mode=2 count=0x10000 (65536) - 18.20 Hz (ch=0)
00:00:03.572453 Display::handleDisplayResize(): uScreenId = 0, pvVRAM=0000000000000000 w=720 h=400 bpp=0 cbLine=0x0, flags=0x1
00:00:03.572486 UIFrameBuffer::RequestResize: Screen=0, Format=0, BitsPerPixel=0, BytesPerLine=0, Size=720x400, Sending to async-handler..
00:00:03.572599 UIFrameBufferQImage::resizeEvent: Format=0, BitsPerPixel=0, BytesPerLine=0, Size=720x400
00:00:03.572645 UIFrameBufferQImage::resizeEvent: Resizing to FALLBACK buffer due to format is invalid..
00:00:03.572780 Guest Log: BIOS: Boot : bseqnr=1, bootseq=0231
00:00:03.573342 Guest Log: BIOS: Boot from Floppy 0 failed
00:00:03.573969 Guest Log: BIOS: Boot : bseqnr=2, bootseq=0023
00:00:03.575325 Guest Log: BIOS: CDROM boot failure code : 0003
00:00:03.575863 Guest Log: BIOS: Boot from CD-ROM failed
00:00:03.576488 Guest Log: BIOS: Boot : bseqnr=3, bootseq=0002
00:00:03.636055 Guest Log: BIOS: Booting from Hard Disk...
00:00:03.680848 Guest Log: int13_harddisk_ext: function 41, unmapped device for ELDL=81
00:00:03.681075 Guest Log: int13_harddisk: function 08, unmapped device for ELDL=81
00:00:03.732474 Display::handleDisplayResize(): uScreenId = 0, pvVRAM=0000000009ff0000 w=640 h=480 bpp=0 cbLine=0x140, flags=0x1
00:00:03.732507 UIFrameBuffer::RequestResize: Screen=0, Format=0, BitsPerPixel=0, BytesPerLine=0, Size=640x480, Sending to async-handler..
00:00:03.732540 UIFrameBufferQImage::resizeEvent: Format=0, BitsPerPixel=0, BytesPerLine=0, Size=640x480
00:00:03.732550 UIFrameBufferQImage::resizeEvent: Resizing to FALLBACK buffer due to format is invalid..
00:00:09.179963 Display::handleDisplayResize(): uScreenId = 0, pvVRAM=0000000000000000 w=720 h=400 bpp=0 cbLine=0x0, flags=0x1
00:00:09.179985 UIFrameBuffer::RequestResize: Screen=0, Format=0, BitsPerPixel=0, BytesPerLine=0, Size=720x400, Sending to async-handler..
00:00:09.180016 UIFrameBufferQImage::resizeEvent: Format=0, BitsPerPixel=0, BytesPerLine=0, Size=720x400
00:00:09.180026 UIFrameBufferQImage::resizeEvent: Resizing to FALLBACK buffer due to format is invalid..
00:00:09.671063 Guest Log: BIOS: KBD: unsupported int 16h function 03
00:00:09.671224 Guest Log: BIOS: AX=0305 BX=0000 CX=0000 DX=0000 
00:00:34.461367 Changing the VM state from 'RUNNING' to 'SUSPENDING'.
00:00:34.531704 AIOMgr: Preparing flush failed with VERR_NOT_SUPPORTED, disabling async flushes
00:00:34.555657 AIOMgr: Endpoint for file 'G:\MaquinasVirtualesChimpFarm\KitKat720x1280x16\tools\VM\Android.vdi' (flags 000c0781) created successfully
00:00:34.574327 PDMR3Suspend: 112 937 470 ns run time
00:00:34.574395 Changing the VM state from 'SUSPENDING' to 'SUSPENDED'.
00:00:36.478687 Console::powerDown(): A request to power off the VM has been issued (mMachineState=Stopping, InUninit=0)
00:00:36.479561 Changing the VM state from 'SUSPENDED' to 'POWERING_OFF'.
00:00:36.479575 ****************** Guest state at power off ******************
00:00:36.479579 Guest CPUM (VCPU 0) state: 
00:00:36.479582 eax=00000000 ebx=00000034 ecx=00000000 edx=00000000 esi=00000000 edi=00000000
00:00:36.479583 eip=0000e858 esp=00008e5a ebp=00000000 iopl=0         nv up ei pl nz na po nc
00:00:36.479584 cs={f000 base=00000000000f0000 limit=0000ffff flags=0000009f} dr0=00000000 dr1=00000000
00:00:36.479586 ds={0040 base=0000000000000400 limit=0000ffff flags=00000093} dr2=00000000 dr3=00000000
00:00:36.479587 es={9000 base=0000000000090000 limit=0000ffff flags=00000093} dr4=00000000 dr5=00000000
00:00:36.479588 fs={9000 base=0000000000090000 limit=0000ffff flags=00000093} dr6=ffff0ff0 dr7=00000400
00:00:36.479590 gs={9000 base=0000000000090000 limit=0000ffff flags=00000093} cr0=00000010 cr2=00000000
00:00:36.479591 ss={9000 base=0000000000090000 limit=0000ffff flags=00000093} cr3=00000000 cr4=00000000
00:00:36.479592 gdtr=000000000000905c:0027  idtr=0000000000000000:ffff  eflags=00000246
00:00:36.479593 ldtr={0000 base=00000000 limit=0000ffff flags=00000082}
00:00:36.479593 tr  ={0000 base=00000000 limit=0000ffff flags=0000008b}
00:00:36.479594 SysEnter={cs=0000 eip=00000000 esp=00000000}
00:00:36.479595 FCW=037f FSW=0000 FTW=0000 FOP=0000 MXCSR=00001f80 MXCSR_MASK=0000ffff
00:00:36.479596 FPUIP=00000000 CS=0000 Rsrvd1=0000  FPUDP=00000000 DS=0000 Rsvrd2=0000
00:00:36.479597 ST(0)=FPR0={0000'00000000'00000000} t0 +0.0000000000000000000000 ^ 0
00:00:36.479598 ST(1)=FPR1={0000'00000000'00000000} t0 +0.0000000000000000000000 ^ 0
00:00:36.479600 ST(2)=FPR2={0000'00000000'00000000} t0 +0.0000000000000000000000 ^ 0
00:00:36.479600 ST(3)=FPR3={0000'00000000'00000000} t0 +0.0000000000000000000000 ^ 0
00:00:36.479601 ST(4)=FPR4={0000'00000000'00000000} t0 +0.0000000000000000000000 ^ 0
00:00:36.479602 ST(5)=FPR5={0000'00000000'00000000} t0 +0.0000000000000000000000 ^ 0
00:00:36.479603 ST(6)=FPR6={0000'00000000'00000000} t0 +0.0000000000000000000000 ^ 0
00:00:36.479604 ST(7)=FPR7={0000'00000000'00000000} t0 +0.0000000000000000000000 ^ 0
00:00:36.479605 XMM0 =00000000'00000000'00000000'00000000  XMM1 =00000000'00000000'00000000'00000000
00:00:36.479606 XMM2 =00000000'00000000'00000000'00000000  XMM3 =00000000'00000000'00000000'00000000
00:00:36.479607 XMM4 =00000000'00000000'00000000'00000000  XMM5 =00000000'00000000'00000000'00000000
00:00:36.479609 XMM6 =00000000'00000000'00000000'00000000  XMM7 =00000000'00000000'00000000'00000000
00:00:36.479610 XMM8 =00000000'00000000'00000000'00000000  XMM9 =00000000'00000000'00000000'00000000
00:00:36.479611 XMM10=00000000'00000000'00000000'00000000  XMM11=00000000'00000000'00000000'00000000
00:00:36.479612 XMM12=00000000'00000000'00000000'00000000  XMM13=00000000'00000000'00000000'00000000
00:00:36.479613 XMM14=00000000'00000000'00000000'00000000  XMM15=00000000'00000000'00000000'00000000
00:00:36.479614 EFER         =0000000000000000
00:00:36.479615 PAT          =0007040600070406
00:00:36.479616 STAR         =0000000000000000
00:00:36.479616 CSTAR        =0000000000000000
00:00:36.479616 LSTAR        =0000000000000000
00:00:36.479617 SFMASK       =0000000000000000
00:00:36.479617 KERNELGSBASE =0000000000000000
00:00:36.479617 ***
00:00:36.479619 Guest paging mode:  Real (changed 176225 times), A20 enabled (changed 2 times)
00:00:36.479622 Shadow paging mode: EPT
00:00:36.479623 Host paging mode:   AMD64+G+NX
00:00:36.479623 ***
00:00:36.479624 Active Timers (pVM=0000000000a80000)
00:00:36.479625 pTimerR3         offNext  offPrev  offSched Clock               Time             Expire HzHint State                     Description
00:00:36.479627 00000000057c5cd0 000127b0 00000000 00000000 Real          2540452547         2540450529      0 2-ACTIVE                  VGA Refresh Timer
00:00:36.479631 00000000057d8480 ffffff80 fffed850 00000000 Real          2540452547         2540450548      0 2-ACTIVE                  EMT Yielder
00:00:36.479633 00000000057d8400 00000000 00000080 00000000 Real          2540452547         2540451104      0 2-ACTIVE                  CPU Load Timer
00:00:36.479635 00000000057d3ee0 00000000 00000000 00000000 Virt         33504564135        33392618177      0 2-ACTIVE                  Audio timer
00:00:36.479638 00000000057bd660 000005d0 00000000 00000000 VrSy         33390595520        33424721710     18 2-ACTIVE                  i8254 Programmable Interval Timer
00:00:36.479640 00000000057bdc30 000197e0 fffffa30 00000000 VrSy         33390595520        33990000000      0 2-ACTIVE                  MC146818 RTC/CMOS - Second
00:00:36.479642 00000000057d7410 00000000 fffe6820 00000000 VrSy         33390595520       599932015941      0 2-ACTIVE                  ACPI PM Timer
00:00:36.479644 ***
00:00:36.479647 ***
00:00:36.479648 ************** End of Guest state at power off ***************
00:00:36.479660 PDMR3PowerOff: 3 928 ns run time
00:00:36.479666 Changing the VM state from 'POWERING_OFF' to 'OFF'.
00:00:36.480668 Changing the VM state from 'OFF' to 'DESTROYING'.
00:00:36.480687 ************************* Statistics *************************
00:00:36.480742 /CPUM/MSR-Totals/Reads                  0 times
00:00:36.480746 /CPUM/MSR-Totals/ReadsRaisingGP         0 times
00:00:36.480749 /CPUM/MSR-Totals/ReadsUnknown           0 times
00:00:36.480751 /CPUM/MSR-Totals/Writes                 0 times
00:00:36.480753 /CPUM/MSR-Totals/WritesRaisingGP        0 times
00:00:36.480755 /CPUM/MSR-Totals/WritesToIgnoredBits        0 times
00:00:36.480757 /CPUM/MSR-Totals/WritesUnknown          0 times
00:00:36.480759 /Devices/E1k0/ReceiveBytes              0 bytes
00:00:36.480761 /Devices/E1k0/TransmitBytes             0 bytes
00:00:36.480764 /Devices/IDE0/ATA0/Unit0/AtapiDMA        0 times
00:00:36.480766 /Devices/IDE0/ATA0/Unit0/AtapiPIO        0 times
00:00:36.480768 /Devices/IDE0/ATA0/Unit0/DMA            0 times
00:00:36.480770 /Devices/IDE0/ATA0/Unit0/PIO            0 times
00:00:36.480772 /Devices/IDE0/ATA0/Unit0/ReadBytes        0 bytes
00:00:36.480774 /Devices/IDE0/ATA0/Unit0/WrittenBytes        0 bytes
00:00:36.480776 /Devices/IDE0/ATA0/Unit1/AtapiDMA        0 times
00:00:36.480778 /Devices/IDE0/ATA0/Unit1/AtapiPIO        0 times
00:00:36.480780 /Devices/IDE0/ATA0/Unit1/DMA            0 times
00:00:36.480782 /Devices/IDE0/ATA0/Unit1/PIO            0 times
00:00:36.480785 /Devices/IDE0/ATA0/Unit1/ReadBytes        0 bytes
00:00:36.480787 /Devices/IDE0/ATA0/Unit1/WrittenBytes        0 bytes
00:00:36.480789 /Devices/IDE0/ATA1/Unit0/AtapiDMA        0 times
00:00:36.480791 /Devices/IDE0/ATA1/Unit0/AtapiPIO        0 times
00:00:36.480793 /Devices/IDE0/ATA1/Unit0/DMA            0 times
00:00:36.480795 /Devices/IDE0/ATA1/Unit0/PIO            0 times
00:00:36.480797 /Devices/IDE0/ATA1/Unit0/ReadBytes        0 bytes
00:00:36.480799 /Devices/IDE0/ATA1/Unit0/WrittenBytes        0 bytes
00:00:36.480801 /Devices/IDE0/ATA1/Unit1/AtapiDMA        0 times
00:00:36.480803 /Devices/IDE0/ATA1/Unit1/AtapiPIO        0 times
00:00:36.480805 /Devices/IDE0/ATA1/Unit1/DMA            0 times
00:00:36.480807 /Devices/IDE0/ATA1/Unit1/PIO            0 times
00:00:36.480809 /Devices/IDE0/ATA1/Unit1/ReadBytes        0 bytes
00:00:36.480811 /Devices/IDE0/ATA1/Unit1/WrittenBytes        0 bytes
00:00:36.480813 /Devices/SATA0/Port0/DMA              241 times
00:00:36.480816 /Devices/SATA0/Port0/ReadBytes    7691776 bytes
00:00:36.480822 /Devices/VMMDev/BalloonChunks           0 count
00:00:36.480825 /FT/Checkpoint/Network                  0 times
00:00:36.480827 /FT/Checkpoint/Storage                  0 times
00:00:36.480829 /FT/Received/Mem                        0 bytes
00:00:36.480832 /FT/Received/State                      0 bytes
00:00:36.480834 /FT/Sent/Mem                            0 bytes
00:00:36.480838 /FT/Sent/State                          0 bytes
00:00:36.480842 /FT/Sync/DeltaMem                       0 times
00:00:36.480844 /FT/Sync/DeltaVM                        0 times
00:00:36.480846 /FT/Sync/Full                           0 times
00:00:36.480849 /GMM/VM/Allocated/cBasePages         3193 pages
00:00:36.480852 /GMM/VM/Allocated/cFixedPages           0 pages
00:00:36.480854 /GMM/VM/Allocated/cShadowPages          0 pages
00:00:36.480856 /GMM/VM/Reserved/cBasePages        262302 pages
00:00:36.480858 /GMM/VM/Reserved/cFixedPages         5124 pages
00:00:36.480861 /GMM/VM/Reserved/cShadowPages           1 pages
00:00:36.480863 /GMM/VM/cBalloonedPages                 0 pages
00:00:36.480865 /GMM/VM/cMaxBalloonedPages              0 pages
00:00:36.480867 /GMM/VM/cPrivatePages                3193 pages
00:00:36.480870 /GMM/VM/cReqActuallyBalloonedPages        0 pages
00:00:36.480872 /GMM/VM/cReqBalloonedPages              0 pages
00:00:36.480874 /GMM/VM/cReqDeflatePages                0 pages
00:00:36.480876 /GMM/VM/cShareableModules               0 count
00:00:36.480879 /GMM/VM/cSharedPages                    0 pages
00:00:36.480881 /GMM/VM/enmPolicy                       1 
00:00:36.480884 /GMM/VM/enmPriority                     2 
00:00:36.480886 /GMM/VM/fBallooningEnabled       false    
00:00:36.480889 /GMM/VM/fMayAllocate             true     
00:00:36.480891 /GMM/VM/fSharedPagingEnabled     false    
00:00:36.480893 /GMM/cAllocatedPages                 3193 pages
00:00:36.480895 /GMM/cBalloonedPages                    0 pages
00:00:36.480897 /GMM/cChunks                            7 count
00:00:36.480900 /GMM/cDuplicatePages                    0 pages
00:00:36.480902 /GMM/cFreedChunks                       0 count
00:00:36.480904 /GMM/cLeftBehindSharedPages             0 pages
00:00:36.480906 /GMM/cMaxPages                   4294967295 pages
00:00:36.480909 /GMM/cOverCommittedPages                0 pages
00:00:36.480911 /GMM/cReservedPages                267427 pages
00:00:36.480913 /GMM/cShareableModules                  0 count
00:00:36.480915 /GMM/cSharedPages                       0 pages
00:00:36.480917 /GVMM/EMTs                              1 calls
00:00:36.480920 /GVMM/HostCPUs                          8 calls
00:00:36.480922 /GVMM/HostCpus/0                        0 
00:00:36.480925 /GVMM/HostCpus/0/CurTimerHz             0 Hz
00:00:36.480928 /GVMM/HostCpus/0/DesiredHz              0 Hz
00:00:36.480930 /GVMM/HostCpus/0/PPTChanges             0 times
00:00:36.480932 /GVMM/HostCpus/0/PPTStarts              0 times
00:00:36.480935 /GVMM/HostCpus/0/idxCpuSet              0 
00:00:36.480938 /GVMM/HostCpus/1                        1 
00:00:36.480940 /GVMM/HostCpus/1/CurTimerHz             0 Hz
00:00:36.480942 /GVMM/HostCpus/1/DesiredHz              0 Hz
00:00:36.480944 /GVMM/HostCpus/1/PPTChanges             0 times
00:00:36.480946 /GVMM/HostCpus/1/PPTStarts              0 times
00:00:36.480948 /GVMM/HostCpus/1/idxCpuSet              1 
00:00:36.480950 /GVMM/HostCpus/2                        2 
00:00:36.480953 /GVMM/HostCpus/2/CurTimerHz             0 Hz
00:00:36.480955 /GVMM/HostCpus/2/DesiredHz              0 Hz
00:00:36.480957 /GVMM/HostCpus/2/PPTChanges             0 times
00:00:36.480959 /GVMM/HostCpus/2/PPTStarts              0 times
00:00:36.480961 /GVMM/HostCpus/2/idxCpuSet              2 
00:00:36.480963 /GVMM/HostCpus/3                        3 
00:00:36.480966 /GVMM/HostCpus/3/CurTimerHz             0 Hz
00:00:36.480968 /GVMM/HostCpus/3/DesiredHz              0 Hz
00:00:36.480970 /GVMM/HostCpus/3/PPTChanges             0 times
00:00:36.480972 /GVMM/HostCpus/3/PPTStarts              0 times
00:00:36.480974 /GVMM/HostCpus/3/idxCpuSet              3 
00:00:36.480976 /GVMM/HostCpus/4                        4 
00:00:36.480978 /GVMM/HostCpus/4/CurTimerHz             0 Hz
00:00:36.480980 /GVMM/HostCpus/4/DesiredHz              0 Hz
00:00:36.480983 /GVMM/HostCpus/4/PPTChanges             0 times
00:00:36.480986 /GVMM/HostCpus/4/PPTStarts              0 times
00:00:36.480989 /GVMM/HostCpus/4/idxCpuSet              4 
00:00:36.480992 /GVMM/HostCpus/5                        5 
00:00:36.480994 /GVMM/HostCpus/5/CurTimerHz             0 Hz
00:00:36.480996 /GVMM/HostCpus/5/DesiredHz              0 Hz
00:00:36.480998 /GVMM/HostCpus/5/PPTChanges             0 times
00:00:36.481000 /GVMM/HostCpus/5/PPTStarts              0 times
00:00:36.481002 /GVMM/HostCpus/5/idxCpuSet              5 
00:00:36.481004 /GVMM/HostCpus/6                        6 
00:00:36.481006 /GVMM/HostCpus/6/CurTimerHz             0 Hz
00:00:36.481009 /GVMM/HostCpus/6/DesiredHz              0 Hz
00:00:36.481011 /GVMM/HostCpus/6/PPTChanges             0 times
00:00:36.481013 /GVMM/HostCpus/6/PPTStarts              0 times
00:00:36.481015 /GVMM/HostCpus/6/idxCpuSet              6 
00:00:36.481017 /GVMM/HostCpus/7                        7 
00:00:36.481020 /GVMM/HostCpus/7/CurTimerHz             0 Hz
00:00:36.481022 /GVMM/HostCpus/7/DesiredHz              0 Hz
00:00:36.481024 /GVMM/HostCpus/7/PPTChanges             0 times
00:00:36.481026 /GVMM/HostCpus/7/PPTStarts              0 times
00:00:36.481028 /GVMM/HostCpus/7/idxCpuSet              7 
00:00:36.481030 /GVMM/Sum/HaltBlocking                750 calls
00:00:36.481032 /GVMM/Sum/HaltCalls                 10602 calls
00:00:36.481034 /GVMM/Sum/HaltNotBlocking            9852 calls
00:00:36.481037 /GVMM/Sum/HaltTimeouts                527 calls
00:00:36.481039 /GVMM/Sum/HaltWakeUps                   0 calls
00:00:36.481041 /GVMM/Sum/PokeCalls                     0 calls
00:00:36.481043 /GVMM/Sum/PokeNotBusy                   0 calls
00:00:36.481045 /GVMM/Sum/PollCalls                     3 calls
00:00:36.481047 /GVMM/Sum/PollHalts                     0 calls
00:00:36.481050 /GVMM/Sum/PollWakeUps                   0 calls
00:00:36.481052 /GVMM/Sum/WakeUpCalls                 241 calls
00:00:36.481055 /GVMM/Sum/WakeUpNotHalted             156 calls
00:00:36.481057 /GVMM/Sum/WakeUpWakeUps                 0 calls
00:00:36.481059 /GVMM/VM/HaltBlocking                 750 calls
00:00:36.481061 /GVMM/VM/HaltCalls                  10602 calls
00:00:36.481064 /GVMM/VM/HaltNotBlocking             9852 calls
00:00:36.481066 /GVMM/VM/HaltTimeouts                 527 calls
00:00:36.481068 /GVMM/VM/HaltWakeUps                    0 calls
00:00:36.481070 /GVMM/VM/PokeCalls                      0 calls
00:00:36.481072 /GVMM/VM/PokeNotBusy                    0 calls
00:00:36.481075 /GVMM/VM/PollCalls                      3 calls
00:00:36.481077 /GVMM/VM/PollHalts                      0 calls
00:00:36.481079 /GVMM/VM/PollWakeUps                    0 calls
00:00:36.481081 /GVMM/VM/WakeUpCalls                  241 calls
00:00:36.481083 /GVMM/VM/WakeUpNotHalted              156 calls
00:00:36.481085 /GVMM/VM/WakeUpWakeUps                  0 calls
00:00:36.481088 /GVMM/VMs                               1 calls
00:00:36.481090 /HM/CPU0/Exit/HostNmiInGC               0 times
00:00:36.481092 /IEM/CPU0/cInstructions           2000513 count
00:00:36.481095 /IEM/CPU0/cPotentialExits           89350 count
00:00:36.481097 /IEM/CPU0/cRetAspectNotImplemented        0 count
00:00:36.481099 /IEM/CPU0/cRetErrStatuses               0 count
00:00:36.481102 /IEM/CPU0/cRetInfStatuses               0 count
00:00:36.481104 /IEM/CPU0/cRetInstrNotImplemented        0 count
00:00:36.481106 /IEM/CPU0/cbWritten                647610 bytes
00:00:36.481108 /MM/HyperHeap/cbFree               842496 bytes
00:00:36.481110 /MM/HyperHeap/cbHeap              1048256 bytes
00:00:36.481113 /PDM/BlkCache/cbCached                  0 bytes
00:00:36.481115 /PDM/BlkCache/cbCachedFru               0 bytes
00:00:36.481118 /PDM/BlkCache/cbCachedMruIn             0 bytes
00:00:36.481120 /PDM/BlkCache/cbCachedMruOut            0 bytes
00:00:36.481122 /PDM/BlkCache/cbMax               5242880 bytes
00:00:36.481124 /PDM/CritSects/8237A#0Auto/ContentionR3        0 times
00:00:36.481126 /PDM/CritSects/8237A#0Auto/ContentionRZLock        0 times
00:00:36.481129 /PDM/CritSects/8237A#0Auto/ContentionRZUnlock        0 times
00:00:36.481132 /PDM/CritSects/AHCI#0/ContentionR3        0 times
00:00:36.481134 /PDM/CritSects/AHCI#0/ContentionRZLock        0 times
00:00:36.481136 /PDM/CritSects/AHCI#0/ContentionRZUnlock        0 times
00:00:36.481139 /PDM/CritSects/ATA#0/ContentionR3        0 times
00:00:36.481141 /PDM/CritSects/ATA#0/ContentionRZLock        0 times
00:00:36.481143 /PDM/CritSects/ATA#0/ContentionRZUnlock        0 times
00:00:36.481145 /PDM/CritSects/ATA#1/ContentionR3        0 times
00:00:36.481147 /PDM/CritSects/ATA#1/ContentionRZLock        2 times
00:00:36.481149 /PDM/CritSects/ATA#1/ContentionRZUnlock        0 times
00:00:36.481151 /PDM/CritSects/AudioSniffer#0Auto/ContentionR3        0 times
00:00:36.481153 /PDM/CritSects/AudioSniffer#0Auto/ContentionRZLock        0 times
00:00:36.481155 /PDM/CritSects/AudioSniffer#0Auto/ContentionRZUnlock        0 times
00:00:36.481157 /PDM/CritSects/E1000#0/ContentionR3        0 times
00:00:36.481159 /PDM/CritSects/E1000#0/ContentionRZLock        0 times
00:00:36.481161 /PDM/CritSects/E1000#0/ContentionRZUnlock        0 times
00:00:36.481163 /PDM/CritSects/E1000#0RX/ContentionR3        0 times
00:00:36.481165 /PDM/CritSects/E1000#0RX/ContentionRZLock        0 times
00:00:36.481167 /PDM/CritSects/E1000#0RX/ContentionRZUnlock        0 times
00:00:36.481169 /PDM/CritSects/E1000#0TX/ContentionR3        0 times
00:00:36.481171 /PDM/CritSects/E1000#0TX/ContentionRZLock        0 times
00:00:36.481173 /PDM/CritSects/E1000#0TX/ContentionRZUnlock        0 times
00:00:36.481176 /PDM/CritSects/EM-REM/ContentionR3        0 times
00:00:36.481178 /PDM/CritSects/EM-REM/ContentionRZLock        0 times
00:00:36.481180 /PDM/CritSects/EM-REM/ContentionRZUnlock        0 times
00:00:36.481182 /PDM/CritSects/FTM/ContentionR3         0 times
00:00:36.481184 /PDM/CritSects/FTM/ContentionRZLock        0 times
00:00:36.481186 /PDM/CritSects/FTM/ContentionRZUnlock        0 times
00:00:36.481188 /PDM/CritSects/MM-HYPER/ContentionR3        0 times
00:00:36.481190 /PDM/CritSects/MM-HYPER/ContentionRZLock        0 times
00:00:36.481192 /PDM/CritSects/MM-HYPER/ContentionRZUnlock        0 times
00:00:36.481194 /PDM/CritSects/NOP/ContentionR3         0 times
00:00:36.481196 /PDM/CritSects/NOP/ContentionRZLock        0 times
00:00:36.481198 /PDM/CritSects/NOP/ContentionRZUnlock        0 times
00:00:36.481200 /PDM/CritSects/OHCI#0Irq/ContentionR3        0 times
00:00:36.481202 /PDM/CritSects/OHCI#0Irq/ContentionRZLock        0 times
00:00:36.481204 /PDM/CritSects/OHCI#0Irq/ContentionRZUnlock        0 times
00:00:36.481206 /PDM/CritSects/PDM/ContentionR3         0 times
00:00:36.481208 /PDM/CritSects/PDM/ContentionRZLock        0 times
00:00:36.481210 /PDM/CritSects/PDM/ContentionRZUnlock        0 times
00:00:36.481212 /PDM/CritSects/PGM/ContentionR3         0 times
00:00:36.481214 /PDM/CritSects/PGM/ContentionRZLock        0 times
00:00:36.481216 /PDM/CritSects/PGM/ContentionRZUnlock        0 times
00:00:36.481218 /PDM/CritSects/REM-Register/ContentionR3        0 times
00:00:36.481220 /PDM/CritSects/REM-Register/ContentionRZLock        0 times
00:00:36.481222 /PDM/CritSects/REM-Register/ContentionRZUnlock        0 times
00:00:36.481224 /PDM/CritSects/TM Timer Lock/ContentionR3        0 times
00:00:36.481226 /PDM/CritSects/TM Timer Lock/ContentionRZLock        0 times
00:00:36.481228 /PDM/CritSects/TM Timer Lock/ContentionRZUnlock        0 times
00:00:36.481230 /PDM/CritSects/TM VirtualSync Lock/ContentionR3        0 times
00:00:36.481233 /PDM/CritSects/TM VirtualSync Lock/ContentionRZLock        0 times
00:00:36.481235 /PDM/CritSects/TM VirtualSync Lock/ContentionRZUnlock        0 times
00:00:36.481237 /PDM/CritSects/VGA#0/ContentionR3        0 times
00:00:36.481239 /PDM/CritSects/VGA#0/ContentionRZLock        0 times
00:00:36.481241 /PDM/CritSects/VGA#0/ContentionRZUnlock        0 times
00:00:36.481243 /PDM/CritSects/VMMDev#0/ContentionR3        0 times
00:00:36.481245 /PDM/CritSects/VMMDev#0/ContentionRZLock        0 times
00:00:36.481248 /PDM/CritSects/VMMDev#0/ContentionRZUnlock        0 times
00:00:36.481251 /PDM/CritSects/acpi#0/ContentionR3        0 times
00:00:36.481253 /PDM/CritSects/acpi#0/ContentionRZLock        0 times
00:00:36.481255 /PDM/CritSects/acpi#0/ContentionRZUnlock        0 times
00:00:36.481257 /PDM/CritSects/ichac97#0Auto/ContentionR3        0 times
00:00:36.481259 /PDM/CritSects/ichac97#0Auto/ContentionRZLock        0 times
00:00:36.481261 /PDM/CritSects/ichac97#0Auto/ContentionRZUnlock        0 times
00:00:36.481263 /PDM/CritSects/mc146818#0Auto/ContentionR3        0 times
00:00:36.481265 /PDM/CritSects/mc146818#0Auto/ContentionRZLock        0 times
00:00:36.481267 /PDM/CritSects/mc146818#0Auto/ContentionRZUnlock        0 times
00:00:36.481269 /PDM/CritSects/pcarch#0Auto/ContentionR3        0 times
00:00:36.481271 /PDM/CritSects/pcarch#0Auto/ContentionRZLock        0 times
00:00:36.481273 /PDM/CritSects/pcarch#0Auto/ContentionRZUnlock        0 times
00:00:36.481275 /PDM/CritSects/pcbios#0Auto/ContentionR3        0 times
00:00:36.481277 /PDM/CritSects/pcbios#0Auto/ContentionRZLock        0 times
00:00:36.481279 /PDM/CritSects/pcbios#0Auto/ContentionRZUnlock        0 times
00:00:36.481281 /PDM/CritSects/pckbd#0Auto/ContentionR3        0 times
00:00:36.481283 /PDM/CritSects/pckbd#0Auto/ContentionRZLock        0 times
00:00:36.481285 /PDM/CritSects/pckbd#0Auto/ContentionRZUnlock        0 times
00:00:36.481287 /PDM/CritSects/pit#0/ContentionR3        0 times
00:00:36.481289 /PDM/CritSects/pit#0/ContentionRZLock        0 times
00:00:36.481291 /PDM/CritSects/pit#0/ContentionRZUnlock        0 times
00:00:36.481294 /PDM/CritSects/usb-ohci#0Auto/ContentionR3        0 times
00:00:36.481296 /PDM/CritSects/usb-ohci#0Auto/ContentionRZLock        0 times
00:00:36.481297 /PDM/CritSects/usb-ohci#0Auto/ContentionRZUnlock        0 times
00:00:36.481300 /PDM/CritSectsRw/IOM Lock/ContentionR3EnterExcl        0 times
00:00:36.481302 /PDM/CritSectsRw/IOM Lock/ContentionR3EnterShared        0 times
00:00:36.481304 /PDM/CritSectsRw/IOM Lock/ContentionRZEnterExcl        0 times
00:00:36.481306 /PDM/CritSectsRw/IOM Lock/ContentionRZEnterShared        0 times
00:00:36.481308 /PDM/CritSectsRw/IOM Lock/ContentionRZLeaveExcl        0 times
00:00:36.481310 /PDM/CritSectsRw/IOM Lock/ContentionRZLeaveShared        0 times
00:00:36.481312 /PDM/CritSectsRw/IOM Lock/R3EnterExcl      190 times
00:00:36.481314 /PDM/CritSectsRw/IOM Lock/R3EnterShared   870331 times
00:00:36.481316 /PDM/CritSectsRw/IOM Lock/RZEnterExcl        0 times
00:00:36.481318 /PDM/CritSectsRw/IOM Lock/RZEnterShared  4479741 times
00:00:36.481320 /PDM/Queue/AHCI-Xmit/AllocFailures        0 times
00:00:36.481322 /PDM/Queue/AHCI-Xmit/Flush              0 calls
00:00:36.481324 /PDM/Queue/AHCI-Xmit/FlushLeftovers        0 times
00:00:36.481326 /PDM/Queue/AHCI-Xmit/Insert             0 calls
00:00:36.481328 /PDM/Queue/AHCI-Xmit/cItems            60 count
00:00:36.481331 /PDM/Queue/AHCI-Xmit/cbItem            32 bytes
00:00:36.481333 /PDM/Queue/DevHlp/AllocFailures         0 times
00:00:36.481335 /PDM/Queue/DevHlp/Flush                 0 calls
00:00:36.481337 /PDM/Queue/DevHlp/FlushLeftovers        0 times
00:00:36.481339 /PDM/Queue/DevHlp/Insert                0 calls
00:00:36.481341 /PDM/Queue/DevHlp/cItems                8 count
00:00:36.481343 /PDM/Queue/DevHlp/cbItem               56 bytes
00:00:36.481345 /PDM/Queue/E1000-Rcv/AllocFailures        0 times
00:00:36.481347 /PDM/Queue/E1000-Rcv/Flush              0 calls
00:00:36.481349 /PDM/Queue/E1000-Rcv/FlushLeftovers        0 times
00:00:36.481351 /PDM/Queue/E1000-Rcv/Insert             0 calls
00:00:36.481353 /PDM/Queue/E1000-Rcv/cItems             1 count
00:00:36.481355 /PDM/Queue/E1000-Rcv/cbItem            24 bytes
00:00:36.481357 /PDM/Queue/E1000-Xmit/AllocFailures        0 times
00:00:36.481359 /PDM/Queue/E1000-Xmit/Flush             0 calls
00:00:36.481361 /PDM/Queue/E1000-Xmit/FlushLeftovers        0 times
00:00:36.481364 /PDM/Queue/E1000-Xmit/Insert            0 calls
00:00:36.481367 /PDM/Queue/E1000-Xmit/cItems            1 count
00:00:36.481369 /PDM/Queue/E1000-Xmit/cbItem           24 bytes
00:00:36.481371 /PDM/Queue/Keyboard/AllocFailures        0 times
00:00:36.481373 /PDM/Queue/Keyboard/Flush               0 calls
00:00:36.481375 /PDM/Queue/Keyboard/FlushLeftovers        0 times
00:00:36.481377 /PDM/Queue/Keyboard/Insert             24 calls
00:00:36.481379 /PDM/Queue/Keyboard/cItems             64 count
00:00:36.481381 /PDM/Queue/Keyboard/cbItem             32 bytes
00:00:36.481383 /PDM/Queue/Mouse/AllocFailures          0 times
00:00:36.481385 /PDM/Queue/Mouse/Flush                  0 calls
00:00:36.481387 /PDM/Queue/Mouse/FlushLeftovers         0 times
00:00:36.481389 /PDM/Queue/Mouse/Insert                 0 calls
00:00:36.481391 /PDM/Queue/Mouse/cItems               128 count
00:00:36.481394 /PDM/Queue/Mouse/cbItem                48 bytes
00:00:36.481396 /PDM/Queue/Mouse_1/AllocFailures        0 times
00:00:36.481398 /PDM/Queue/Mouse_1/Flush                0 calls
00:00:36.481400 /PDM/Queue/Mouse_1/FlushLeftovers        0 times
00:00:36.481402 /PDM/Queue/Mouse_1/Insert               0 calls
00:00:36.481404 /PDM/Queue/Mouse_1/cItems             128 count
00:00:36.481406 /PDM/Queue/Mouse_1/cbItem              48 bytes
00:00:36.481409 /PGM/CPU0/cA20Changes                   2 times
00:00:36.481411 /PGM/CPU0/cGuestModeChanges        176225 times
00:00:36.481413 /PGM/ChunkR3Map/Mapped                  7 count
00:00:36.481416 /PGM/ChunkR3Map/Unmapped                0 count
00:00:36.481418 /PGM/ChunkR3Map/c                       7 count
00:00:36.481420 /PGM/ChunkR3Map/cMax             4294967295 count
00:00:36.481422 /PGM/LargePage/Recheck                  0 times
00:00:36.481425 /PGM/LargePage/Refused                  2 times
00:00:36.481427 /PGM/LargePage/Reused                   0 times
00:00:36.481430 /PGM/Page/cAllPages                267334 count
00:00:36.481433 /PGM/Page/cBalloonedPages               0 count
00:00:36.481435 /PGM/Page/cHandyPages                 123 count
00:00:36.481437 /PGM/Page/cLargePages                   4 count
00:00:36.481439 /PGM/Page/cLargePagesDisabled           0 count
00:00:36.481441 /PGM/Page/cMonitoredPages               0 count
00:00:36.481443 /PGM/Page/cPrivatePages              8194 count
00:00:36.481446 /PGM/Page/cPureMmioPages               36 count
00:00:36.481448 /PGM/Page/cReadLockedPages              0 count
00:00:36.481450 /PGM/Page/cReusedSharedPages            0 count
00:00:36.481452 /PGM/Page/cSharedPages                  0 count
00:00:36.481454 /PGM/Page/cWriteLockedPages             0 count
00:00:36.481456 /PGM/Page/cWrittenToPages               0 count
00:00:36.481459 /PGM/Page/cZeroPages               259104 count
00:00:36.481461 /PGM/ShMod/Check                        0 ticks/call (           0 ticks,       0 times, max         0, min      -1)
00:00:36.481464 /PGM/cRelocations                       0 times
00:00:36.481466 /PROF/CPU0/EM/Capped                    0 ticks/call (           0 ticks,       0 times, max         0, min      -1)
00:00:36.481469 /PROF/CPU0/EM/ForcedActions       1783791 times
00:00:36.481471 /PROF/CPU0/EM/Halted                  220 times
00:00:36.481473 /PROF/CPU0/EM/RAWTotal                  0 times
00:00:36.481475 /PROF/CPU0/EM/REMTotal               1909 times
00:00:36.481478 /PROF/CPU0/EM/Total              120338124984 ticks/call (120338124984 ticks,       1 times, max 120338124984, min 120338124984)
00:00:36.481481 /PROF/CPU0/VM/Halt/Block           221585 ns/call (  2347477598 ticks,   10594 times, max   5561070, min     534)
00:00:36.481485 /PROF/CPU0/VM/Halt/BlockInsomnia        0 ns/call (           0 ticks,       0 times, max         0, min      -1)
00:00:36.481487 /PROF/CPU0/VM/Halt/BlockOnTime          0 ns/call (           0 ticks,       0 times, max         0, min      -1)
00:00:36.481490 /PROF/CPU0/VM/Halt/BlockOverslept        0 ns/call (           0 ticks,       0 times, max         0, min      -1)
00:00:36.481493 /PROF/CPU0/VM/Halt/Timers             856 ns/call (    20512518 ticks,   23946 times, max    107939, min     268)
00:00:36.481497 /PROF/CPU0/VM/Halt/Yield             3352 ns/call (       10056 ticks,       3 times, max      5470, min    1188)
00:00:36.481500 /Public/Net/E1k0/BytesReceived          0 bytes
00:00:36.481502 /Public/Net/E1k0/BytesTransmitted        0 bytes
00:00:36.481504 /REM/TbFlushCount                       0 times
00:00:36.481506 /REM/TbPhysInvldCount                   0 times
00:00:36.481508 /REM/TlbFlushCount                     15 times
00:00:36.481510 /SELM/LoadHidSel/GstReadErrors          0 times
00:00:36.481512 /SELM/LoadHidSel/NoGoodGuest            0 times
00:00:36.481514 /TM/CPU/00/cNsExecuting          27600418120 ns
00:00:36.481517 /TM/CPU/00/cNsHalted             2374530056 ns
00:00:36.481519 /TM/CPU/00/cNsOther              3529619351 ns
00:00:36.481521 /TM/CPU/00/cNsTotal              33504567527 ns
00:00:36.481524 /TM/CPU/00/cPeriodsExecuting      4727847 count
00:00:36.481526 /TM/CPU/00/cPeriodsHalted             220 count
00:00:36.481528 /TM/CPU/00/pctExecuting                98 %
00:00:36.481530 /TM/CPU/00/pctHalted                    0 %
00:00:36.481532 /TM/CPU/00/pctOther                     1 %
00:00:36.481535 /TM/CPU/pctExecuting                   98 %
00:00:36.481537 /TM/CPU/pctHalted                       0 %
00:00:36.481539 /TM/CPU/pctOther                        1 %
00:00:36.481541 /TM/MaxHzHint                           0 Hz
00:00:36.481544 /TM/R0/1nsSteps                         5 times
00:00:36.481546 /TM/R3/1nsSteps                        31 times
00:00:36.481548 /TM/TSC/offCPU0                         0 ticks
00:00:36.481550 /TM/VirtualSync/CurrentOffset       87915 ns
00:00:36.481553 /VUSB/0/cUrbsInPool                     0 count
00:00:36.481556 ********************* End of statistics **********************
00:00:36.481628 VUSB: detached 'HidMouse' from port 1
00:00:36.483788 NAT: zone(nm:mbuf_cluster, used:0)
00:00:36.484243 NAT: zone(nm:mbuf_packet, used:0)
00:00:36.484250 NAT: zone(nm:mbuf, used:0)
00:00:36.484253 NAT: zone(nm:mbuf_jumbo_pagesize, used:0)
00:00:36.484724 NAT: zone(nm:mbuf_jumbo_9k, used:0)
00:00:36.484946 NAT: zone(nm:mbuf_jumbo_16k, used:0)
00:00:36.485068 NAT: zone(nm:mbuf_ext_refcnt, used:0)
00:00:36.642859 Changing the VM state from 'DESTROYING' to 'TERMINATED'.
00:00:36.836158 UIMachineView::storeGuestSizeHint: Storing guest size-hint for screen 0 as 720x400
