VirtualBox VM 5.1.18 r114002 win.amd64 (Mar 15 2017 16:16:14) release log
00:00:06.879653 Log opened 2017-03-27T03:45:23.468606600Z
00:00:06.879657 Build Type: release
00:00:06.879669 OS Product: Windows 10
00:00:06.879674 OS Release: 10.0.14393
00:00:06.879676 OS Service Pack: 
00:00:06.992785 DMI Product Name: Inspiron N5110
00:00:07.005378 DMI Product Version: Not Specified
00:00:07.005402 Host RAM: 6050MB (5.9GB) total, 2462MB (2.4GB) available
00:00:07.005412 Executable: C:\Program Files\Oracle\VirtualBox\VirtualBox.exe
00:00:07.005415 Process ID: 6616
00:00:07.005417 Package type: WINDOWS_64BITS_GENERIC
00:00:07.009307 Installed Extension Packs:
00:00:07.009432   None installed!
00:00:07.011327 Console: Machine state changed to 'Starting'
00:00:07.012509 Qt version: 5.6.2
00:00:07.020963 GUI: UIMediumEnumerator: Medium-enumeration finished!
00:00:07.280144 SUP: Loaded VMMR0.r0 (C:\Program Files\Oracle\VirtualBox\VMMR0.r0) at 0xfffff809c6b10000 - ModuleInit at fffff809c6b33590 and ModuleTerm at fffff809c6b33a80 using the native ring-0 loader
00:00:07.280144 SUP: VMMR0EntryEx located at fffff809c6b36490 and VMMR0EntryFast at fffff809c6b341b0
00:00:07.280144 SUP: windbg> .reload /f C:\Program Files\Oracle\VirtualBox\VMMR0.r0=0xfffff809c6b10000
00:00:07.284322 Guest OS type: 'Linux26'
00:00:07.298685 File system of 'C:\Users\caev0\VirtualBox VMs\KitKat540x960x16\Snapshots' (snapshots) is unknown
00:00:07.298716 File system of 'C:\Users\caev0\VirtualBox VMs\KitKat540x960x16\KitKat540x960x16-disk1.vdi' is ntfs
00:00:07.340276 Shared clipboard service loaded
00:00:07.340326 Shared clipboard mode: Off
00:00:07.367734 Drag and drop service loaded
00:00:07.367785 Drag and drop mode: Off
00:00:07.423945 Guest Control service loaded
00:00:07.428232 ************************* CFGM dump *************************
00:00:07.428237 [/] (level 0)
00:00:07.428246   CSAMEnabled       <integer> = 0x0000000000000001 (1)
00:00:07.428253   CpuExecutionCap   <integer> = 0x0000000000000064 (100)
00:00:07.428258   EnablePAE         <integer> = 0x0000000000000000 (0)
00:00:07.428262   HMEnabled         <integer> = 0x0000000000000001 (1)
00:00:07.428266   MemBalloonSize    <integer> = 0x0000000000000000 (0)
00:00:07.428269   Name              <string>  = "KitKat540x960x16" (cb=17)
00:00:07.428274   NumCPUs           <integer> = 0x0000000000000001 (1)
00:00:07.428277   PATMEnabled       <integer> = 0x0000000000000001 (1)
00:00:07.428281   PageFusionAllowed <integer> = 0x0000000000000000 (0)
00:00:07.428284   RamHoleSize       <integer> = 0x0000000020000000 (536 870 912, 512 MB)
00:00:07.428291   RamSize           <integer> = 0x0000000040000000 (1 073 741 824, 1 024 MB)
00:00:07.428297   RawR0Enabled      <integer> = 0x0000000000000001 (1)
00:00:07.428301   RawR3Enabled      <integer> = 0x0000000000000001 (1)
00:00:07.428304   TimerMillies      <integer> = 0x000000000000000a (10)
00:00:07.428307   UUID              <bytes>   = "9d 83 5e 85 71 b9 91 44 a2 95 91 fb f6 82 f9 e8" (cb=16)
00:00:07.428318 
00:00:07.428319 [/CPUM/] (level 1)
00:00:07.428324   GuestCpuName       <string>  = "host" (cb=5)
00:00:07.428328   PortableCpuIdLevel <integer> = 0x0000000000000000 (0)
00:00:07.428331 
00:00:07.428332 [/DBGC/] (level 1)
00:00:07.428336   GlobalInitScript <string>  = "C:\Users\caev0\.VirtualBox/dbgc-init" (cb=37)
00:00:07.428339   HistoryFile      <string>  = "C:\Users\caev0\.VirtualBox/dbgc-history" (cb=40)
00:00:07.428343   LocalInitScript  <string>  = "C:\Users\caev0\VirtualBox VMs\KitKat540x960x16/dbgc-init" (cb=57)
00:00:07.428346 
00:00:07.428347 [/DBGF/] (level 1)
00:00:07.428350   Path <string>  = "C:\Users\caev0\VirtualBox VMs\KitKat540x960x16/debug/;C:\Users\caev0\VirtualBox VMs\KitKat540x960x16/;C:\Users\caev0\" (cb=118)
00:00:07.428354 
00:00:07.428355 [/Devices/] (level 1)
00:00:07.428358 
00:00:07.428359 [/Devices/8237A/] (level 2)
00:00:07.428363 
00:00:07.428364 [/Devices/8237A/0/] (level 3)
00:00:07.428369   Trusted <integer> = 0x0000000000000001 (1)
00:00:07.428372 
00:00:07.428373 [/Devices/GIMDev/] (level 2)
00:00:07.428377 
00:00:07.428378 [/Devices/GIMDev/0/] (level 3)
00:00:07.428382   Trusted <integer> = 0x0000000000000001 (1)
00:00:07.428385 
00:00:07.428386 [/Devices/VMMDev/] (level 2)
00:00:07.428389 
00:00:07.428390 [/Devices/VMMDev/0/] (level 3)
00:00:07.428394   PCIBusNo      <integer> = 0x0000000000000000 (0)
00:00:07.428398   PCIDeviceNo   <integer> = 0x0000000000000004 (4)
00:00:07.428401   PCIFunctionNo <integer> = 0x0000000000000000 (0)
00:00:07.428404   Trusted       <integer> = 0x0000000000000001 (1)
00:00:07.428407 
00:00:07.428408 [/Devices/VMMDev/0/Config/] (level 4)
00:00:07.428413   GuestCoreDumpDir <string>  = "C:\Users\caev0\VirtualBox VMs\KitKat540x960x16\Snapshots" (cb=57)
00:00:07.428416 
00:00:07.428417 [/Devices/VMMDev/0/LUN#0/] (level 4)
00:00:07.428422   Driver <string>  = "HGCM" (cb=5)
00:00:07.428424 
00:00:07.428425 [/Devices/VMMDev/0/LUN#0/Config/] (level 5)
00:00:07.428430   Object <integer> = 0x000000000400fb00 (67 173 120)
00:00:07.428435 
00:00:07.428436 [/Devices/VMMDev/0/LUN#999/] (level 4)
00:00:07.428440   Driver <string>  = "MainStatus" (cb=11)
00:00:07.428443 
00:00:07.428444 [/Devices/VMMDev/0/LUN#999/Config/] (level 5)
00:00:07.428448   First   <integer> = 0x0000000000000000 (0)
00:00:07.428452   Last    <integer> = 0x0000000000000000 (0)
00:00:07.428454   papLeds <integer> = 0x0000000003d6db88 (64 412 552)
00:00:07.428459 
00:00:07.428460 [/Devices/acpi/] (level 2)
00:00:07.428464 
00:00:07.428465 [/Devices/acpi/0/] (level 3)
00:00:07.428468   PCIBusNo      <integer> = 0x0000000000000000 (0)
00:00:07.428472   PCIDeviceNo   <integer> = 0x0000000000000007 (7)
00:00:07.428475   PCIFunctionNo <integer> = 0x0000000000000000 (0)
00:00:07.428477   Trusted       <integer> = 0x0000000000000001 (1)
00:00:07.428480 
00:00:07.428481 [/Devices/acpi/0/Config/] (level 4)
00:00:07.428486   CpuHotPlug          <integer> = 0x0000000000000000 (0)
00:00:07.428489   FdcEnabled          <integer> = 0x0000000000000000 (0)
00:00:07.428492   HostBusPciAddress   <integer> = 0x0000000000000000 (0)
00:00:07.428496   HpetEnabled         <integer> = 0x0000000000000000 (0)
00:00:07.428499   IOAPIC              <integer> = 0x0000000000000000 (0)
00:00:07.428502   IocPciAddress       <integer> = 0x0000000000010000 (65 536)
00:00:07.428506   NumCPUs             <integer> = 0x0000000000000001 (1)
00:00:07.428510   Parallel0IoPortBase <integer> = 0x0000000000000000 (0)
00:00:07.428513   Parallel0Irq        <integer> = 0x0000000000000000 (0)
00:00:07.428516   Parallel1IoPortBase <integer> = 0x0000000000000000 (0)
00:00:07.428519   Parallel1Irq        <integer> = 0x0000000000000000 (0)
00:00:07.428522   Serial0IoPortBase   <integer> = 0x0000000000000000 (0)
00:00:07.428525   Serial0Irq          <integer> = 0x0000000000000000 (0)
00:00:07.428528   Serial1IoPortBase   <integer> = 0x0000000000000000 (0)
00:00:07.428530   Serial1Irq          <integer> = 0x0000000000000000 (0)
00:00:07.428534   ShowCpu             <integer> = 0x0000000000000000 (0)
00:00:07.428537   ShowRtc             <integer> = 0x0000000000000000 (0)
00:00:07.428540   SmcEnabled          <integer> = 0x0000000000000000 (0)
00:00:07.428543 
00:00:07.428544 [/Devices/acpi/0/LUN#0/] (level 4)
00:00:07.428548   Driver <string>  = "ACPIHost" (cb=9)
00:00:07.428551 
00:00:07.428552 [/Devices/acpi/0/LUN#0/Config/] (level 5)
00:00:07.428556 
00:00:07.428557 [/Devices/ahci/] (level 2)
00:00:07.428560 
00:00:07.428561 [/Devices/ahci/0/] (level 3)
00:00:07.428566   PCIBusNo      <integer> = 0x0000000000000000 (0)
00:00:07.428569   PCIDeviceNo   <integer> = 0x000000000000000d (13)
00:00:07.428572   PCIFunctionNo <integer> = 0x0000000000000000 (0)
00:00:07.428575   Trusted       <integer> = 0x0000000000000001 (1)
00:00:07.428578 
00:00:07.428579 [/Devices/ahci/0/Config/] (level 4)
00:00:07.428583   Bootable  <integer> = 0x0000000000000001 (1)
00:00:07.428585   PortCount <integer> = 0x0000000000000001 (1)
00:00:07.428588 
00:00:07.428589 [/Devices/ahci/0/Config/Port0/] (level 5)
00:00:07.428594   Hotpluggable        <integer> = 0x0000000000000000 (0)
00:00:07.428597   NonRotationalMedium <integer> = 0x0000000000000000 (0)
00:00:07.428600 
00:00:07.428601 [/Devices/ahci/0/LUN#0/] (level 4)
00:00:07.428605   Driver <string>  = "VD" (cb=3)
00:00:07.428608 
00:00:07.428609 [/Devices/ahci/0/LUN#0/Config/] (level 5)
00:00:07.428613   BlockCache <integer> = 0x0000000000000001 (1)
00:00:07.428616   Format     <string>  = "VDI" (cb=4)
00:00:07.428618   Mountable  <integer> = 0x0000000000000000 (0)
00:00:07.428621   Path       <string>  = "C:\Users\caev0\VirtualBox VMs\KitKat540x960x16\KitKat540x960x16-disk1.vdi" (cb=74)
00:00:07.428624   Type       <string>  = "HardDisk" (cb=9)
00:00:07.428627   UseNewIo   <integer> = 0x0000000000000001 (1)
00:00:07.428630 
00:00:07.428631 [/Devices/ahci/0/LUN#999/] (level 4)
00:00:07.428635   Driver <string>  = "MainStatus" (cb=11)
00:00:07.428638 
00:00:07.428639 [/Devices/ahci/0/LUN#999/Config/] (level 5)
00:00:07.428643   DeviceInstance        <string>  = "ahci/0" (cb=7)
00:00:07.428646   First                 <integer> = 0x0000000000000000 (0)
00:00:07.428650   Last                  <integer> = 0x0000000000000000 (0)
00:00:07.428653   pConsole              <integer> = 0x0000000003d6d380 (64 410 496)
00:00:07.428659   papLeds               <integer> = 0x0000000003d6d788 (64 411 528)
00:00:07.428664   pmapMediumAttachments <integer> = 0x0000000003d6dba8 (64 412 584)
00:00:07.428668 
00:00:07.428669 [/Devices/apic/] (level 2)
00:00:07.428672 
00:00:07.428673 [/Devices/apic/0/] (level 3)
00:00:07.428677   Trusted <integer> = 0x0000000000000001 (1)
00:00:07.428680 
00:00:07.428681 [/Devices/apic/0/Config/] (level 4)
00:00:07.428685   IOAPIC  <integer> = 0x0000000000000000 (0)
00:00:07.428687   Mode    <integer> = 0x0000000000000003 (3)
00:00:07.428690   NumCPUs <integer> = 0x0000000000000001 (1)
00:00:07.428693 
00:00:07.428694 [/Devices/e1000/] (level 2)
00:00:07.428697 
00:00:07.428698 [/Devices/e1000/0/] (level 3)
00:00:07.428702   PCIBusNo      <integer> = 0x0000000000000000 (0)
00:00:07.428705   PCIDeviceNo   <integer> = 0x0000000000000003 (3)
00:00:07.428707   PCIFunctionNo <integer> = 0x0000000000000000 (0)
00:00:07.428710   Trusted       <integer> = 0x0000000000000001 (1)
00:00:07.428713 
00:00:07.428714 [/Devices/e1000/0/Config/] (level 4)
00:00:07.428718   AdapterType    <integer> = 0x0000000000000000 (0)
00:00:07.428721   CableConnected <integer> = 0x0000000000000001 (1)
00:00:07.428724   LineSpeed      <integer> = 0x0000000000000000 (0)
00:00:07.428727   MAC            <bytes>   = "08 00 27 88 27 ef" (cb=6)
00:00:07.428732 
00:00:07.428733 [/Devices/e1000/0/LUN#0/] (level 4)
00:00:07.428737   Driver <string>  = "NAT" (cb=4)
00:00:07.428739 
00:00:07.428740 [/Devices/e1000/0/LUN#0/Config/] (level 5)
00:00:07.428745   AliasMode       <integer> = 0x0000000000000000 (0)
00:00:07.428748   BootFile        <string>  = "KitKat540x960x16.pxe" (cb=21)
00:00:07.428751   DNSProxy        <integer> = 0x0000000000000000 (0)
00:00:07.428754   Network         <string>  = "10.0.2.0/24" (cb=12)
00:00:07.428757   PassDomain      <integer> = 0x0000000000000001 (1)
00:00:07.428760   TFTPPrefix      <string>  = "C:\Users\caev0\.VirtualBox\TFTP" (cb=32)
00:00:07.428763   UseHostResolver <integer> = 0x0000000000000000 (0)
00:00:07.428766 
00:00:07.428767 [/Devices/e1000/0/LUN#999/] (level 4)
00:00:07.428770   Driver <string>  = "MainStatus" (cb=11)
00:00:07.428773 
00:00:07.428774 [/Devices/e1000/0/LUN#999/Config/] (level 5)
00:00:07.428778   First   <integer> = 0x0000000000000000 (0)
00:00:07.428781   Last    <integer> = 0x0000000000000000 (0)
00:00:07.428784   papLeds <integer> = 0x0000000003d6da68 (64 412 264)
00:00:07.428788 
00:00:07.428789 [/Devices/i8254/] (level 2)
00:00:07.428792 
00:00:07.428793 [/Devices/i8254/0/] (level 3)
00:00:07.428796 
00:00:07.428797 [/Devices/i8254/0/Config/] (level 4)
00:00:07.428801 
00:00:07.428802 [/Devices/i8259/] (level 2)
00:00:07.428805 
00:00:07.428806 [/Devices/i8259/0/] (level 3)
00:00:07.428810   Trusted <integer> = 0x0000000000000001 (1)
00:00:07.428813 
00:00:07.428814 [/Devices/i8259/0/Config/] (level 4)
00:00:07.428818 
00:00:07.428819 [/Devices/ichac97/] (level 2)
00:00:07.428822 
00:00:07.428823 [/Devices/ichac97/0/] (level 3)
00:00:07.428826   PCIBusNo      <integer> = 0x0000000000000000 (0)
00:00:07.428830   PCIDeviceNo   <integer> = 0x0000000000000005 (5)
00:00:07.428832   PCIFunctionNo <integer> = 0x0000000000000000 (0)
00:00:07.428835   Trusted       <integer> = 0x0000000000000001 (1)
00:00:07.428838 
00:00:07.428839 [/Devices/ichac97/0/AudioConfig/] (level 4)
00:00:07.428843 
00:00:07.428844 [/Devices/ichac97/0/Config/] (level 4)
00:00:07.428848   Codec <string>  = "AD1980" (cb=7)
00:00:07.428851 
00:00:07.428852 [/Devices/ichac97/0/LUN#0/] (level 4)
00:00:07.428856   Driver <string>  = "AUDIO" (cb=6)
00:00:07.428858 
00:00:07.428859 [/Devices/ichac97/0/LUN#0/AttachedDriver/] (level 5)
00:00:07.428864   Driver <string>  = "DSoundAudio" (cb=12)
00:00:07.428866 
00:00:07.428867 [/Devices/ichac97/0/LUN#0/AttachedDriver/Config/] (level 6)
00:00:07.428872   StreamName <string>  = "KitKat540x960x16" (cb=17)
00:00:07.428875 
00:00:07.428876 [/Devices/ichac97/0/LUN#0/Config/] (level 5)
00:00:07.428880 
00:00:07.428881 [/Devices/ichac97/0/LUN#1/] (level 4)
00:00:07.428885   Driver <string>  = "AUDIO" (cb=6)
00:00:07.428887 
00:00:07.428888 [/Devices/ichac97/0/LUN#1/AttachedDriver/] (level 5)
00:00:07.428893   Driver <string>  = "AudioVRDE" (cb=10)
00:00:07.428895 
00:00:07.428896 [/Devices/ichac97/0/LUN#1/AttachedDriver/Config/] (level 6)
00:00:07.428901   AudioDriver      <string>  = "AudioVRDE" (cb=10)
00:00:07.428904   Object           <integer> = 0x0000000003d56a20 (64 317 984)
00:00:07.428908   ObjectVRDPServer <integer> = 0x0000000003dc1990 (64 756 112)
00:00:07.428912   StreamName       <string>  = "KitKat540x960x16" (cb=17)
00:00:07.428915 
00:00:07.428916 [/Devices/mc146818/] (level 2)
00:00:07.428920 
00:00:07.428921 [/Devices/mc146818/0/] (level 3)
00:00:07.428924 
00:00:07.428925 [/Devices/mc146818/0/Config/] (level 4)
00:00:07.428929   UseUTC <integer> = 0x0000000000000001 (1)
00:00:07.428932 
00:00:07.428933 [/Devices/parallel/] (level 2)
00:00:07.428936 
00:00:07.428937 [/Devices/pcarch/] (level 2)
00:00:07.428940 
00:00:07.428941 [/Devices/pcarch/0/] (level 3)
00:00:07.428945   Trusted <integer> = 0x0000000000000001 (1)
00:00:07.428947 
00:00:07.428948 [/Devices/pcarch/0/Config/] (level 4)
00:00:07.428952 
00:00:07.428953 [/Devices/pcbios/] (level 2)
00:00:07.428956 
00:00:07.428957 [/Devices/pcbios/0/] (level 3)
00:00:07.428961   Trusted <integer> = 0x0000000000000001 (1)
00:00:07.428963 
00:00:07.428964 [/Devices/pcbios/0/Config/] (level 4)
00:00:07.428970   APIC               <integer> = 0x0000000000000001 (1)
00:00:07.428973   BootDevice0        <string>  = "FLOPPY" (cb=7)
00:00:07.428976   BootDevice1        <string>  = "DVD" (cb=4)
00:00:07.428979   BootDevice2        <string>  = "IDE" (cb=4)
00:00:07.428982   BootDevice3        <string>  = "NONE" (cb=5)
00:00:07.428984   FloppyDevice       <string>  = "i82078" (cb=7)
00:00:07.428987   HardDiskDevice     <string>  = "piix3ide" (cb=9)
00:00:07.428990   IOAPIC             <integer> = 0x0000000000000000 (0)
00:00:07.428993   McfgBase           <integer> = 0x0000000000000000 (0)
00:00:07.428996   McfgLength         <integer> = 0x0000000000000000 (0)
00:00:07.428999   NumCPUs            <integer> = 0x0000000000000001 (1)
00:00:07.429002   PXEDebug           <integer> = 0x0000000000000000 (0)
00:00:07.429006   SataHardDiskDevice <string>  = "ahci" (cb=5)
00:00:07.429008   SataLUN1           <integer> = 0x0000000000000000 (0)
00:00:07.429011   UUID               <bytes>   = "9d 83 5e 85 71 b9 91 44 a2 95 91 fb f6 82 f9 e8" (cb=16)
00:00:07.429020 
00:00:07.429021 [/Devices/pcbios/0/Config/NetBoot/] (level 5)
00:00:07.429025 
00:00:07.429026 [/Devices/pcbios/0/Config/NetBoot/0/] (level 6)
00:00:07.429031   NIC           <integer> = 0x0000000000000000 (0)
00:00:07.429034   PCIBusNo      <integer> = 0x0000000000000000 (0)
00:00:07.429037   PCIDeviceNo   <integer> = 0x0000000000000003 (3)
00:00:07.429040   PCIFunctionNo <integer> = 0x0000000000000000 (0)
00:00:07.429042 
00:00:07.429044 [/Devices/pci/] (level 2)
00:00:07.429047 
00:00:07.429048 [/Devices/pci/0/] (level 3)
00:00:07.429051   Trusted <integer> = 0x0000000000000001 (1)
00:00:07.429054 
00:00:07.429059 [/Devices/pci/0/Config/] (level 4)
00:00:07.429062   IOAPIC <integer> = 0x0000000000000000 (0)
00:00:07.429065 
00:00:07.429066 [/Devices/pckbd/] (level 2)
00:00:07.429069 
00:00:07.429070 [/Devices/pckbd/0/] (level 3)
00:00:07.429074   Trusted <integer> = 0x0000000000000001 (1)
00:00:07.429076 
00:00:07.429077 [/Devices/pckbd/0/Config/] (level 4)
00:00:07.429081 
00:00:07.429082 [/Devices/pckbd/0/LUN#0/] (level 4)
00:00:07.429086   Driver <string>  = "KeyboardQueue" (cb=14)
00:00:07.429089 
00:00:07.429090 [/Devices/pckbd/0/LUN#0/AttachedDriver/] (level 5)
00:00:07.429094   Driver <string>  = "MainKeyboard" (cb=13)
00:00:07.429097 
00:00:07.429098 [/Devices/pckbd/0/LUN#0/AttachedDriver/Config/] (level 6)
00:00:07.429103   Object <integer> = 0x0000000001c90f80 (29 953 920)
00:00:07.429106 
00:00:07.429107 [/Devices/pckbd/0/LUN#0/Config/] (level 5)
00:00:07.429112   QueueSize <integer> = 0x0000000000000040 (64)
00:00:07.429115 
00:00:07.429116 [/Devices/pckbd/0/LUN#1/] (level 4)
00:00:07.429120   Driver <string>  = "MouseQueue" (cb=11)
00:00:07.429123 
00:00:07.429124 [/Devices/pckbd/0/LUN#1/AttachedDriver/] (level 5)
00:00:07.429128   Driver <string>  = "MainMouse" (cb=10)
00:00:07.429130 
00:00:07.429131 [/Devices/pckbd/0/LUN#1/AttachedDriver/Config/] (level 6)
00:00:07.429136   Object <integer> = 0x0000000003d6c370 (64 406 384)
00:00:07.429140 
00:00:07.429141 [/Devices/pckbd/0/LUN#1/Config/] (level 5)
00:00:07.429145   QueueSize <integer> = 0x0000000000000080 (128)
00:00:07.429149 
00:00:07.429150 [/Devices/pcnet/] (level 2)
00:00:07.429153 
00:00:07.429154 [/Devices/piix3ide/] (level 2)
00:00:07.429157 
00:00:07.429158 [/Devices/piix3ide/0/] (level 3)
00:00:07.429162   PCIBusNo      <integer> = 0x0000000000000000 (0)
00:00:07.429165   PCIDeviceNo   <integer> = 0x0000000000000001 (1)
00:00:07.429168   PCIFunctionNo <integer> = 0x0000000000000001 (1)
00:00:07.429170   Trusted       <integer> = 0x0000000000000001 (1)
00:00:07.429173 
00:00:07.429174 [/Devices/piix3ide/0/Config/] (level 4)
00:00:07.429178   Type <string>  = "PIIX4" (cb=6)
00:00:07.429180 
00:00:07.429181 [/Devices/piix3ide/0/Config/SecondaryMaster/] (level 5)
00:00:07.429186   NonRotationalMedium <integer> = 0x0000000000000000 (0)
00:00:07.429189 
00:00:07.429190 [/Devices/piix3ide/0/LUN#2/] (level 4)
00:00:07.429194   Driver <string>  = "VD" (cb=3)
00:00:07.429197 
00:00:07.429198 [/Devices/piix3ide/0/LUN#2/Config/] (level 5)
00:00:07.429202   EmptyDrive <integer> = 0x0000000000000001 (1)
00:00:07.429205   Mountable  <integer> = 0x0000000000000001 (1)
00:00:07.429207   Type       <string>  = "DVD" (cb=4)
00:00:07.429210 
00:00:07.429211 [/Devices/piix3ide/0/LUN#999/] (level 4)
00:00:07.429215   Driver <string>  = "MainStatus" (cb=11)
00:00:07.429218 
00:00:07.429219 [/Devices/piix3ide/0/LUN#999/Config/] (level 5)
00:00:07.429223   DeviceInstance        <string>  = "piix3ide/0" (cb=11)
00:00:07.429226   First                 <integer> = 0x0000000000000000 (0)
00:00:07.429230   Last                  <integer> = 0x0000000000000003 (3)
00:00:07.429233   pConsole              <integer> = 0x0000000003d6d380 (64 410 496)
00:00:07.429237   papLeds               <integer> = 0x0000000003d6d768 (64 411 496)
00:00:07.429242   pmapMediumAttachments <integer> = 0x0000000003d6dba8 (64 412 584)
00:00:07.429246 
00:00:07.429247 [/Devices/serial/] (level 2)
00:00:07.429250 
00:00:07.429251 [/Devices/usb-ohci/] (level 2)
00:00:07.429254 
00:00:07.429255 [/Devices/usb-ohci/0/] (level 3)
00:00:07.429259   PCIBusNo      <integer> = 0x0000000000000000 (0)
00:00:07.429262   PCIDeviceNo   <integer> = 0x0000000000000006 (6)
00:00:07.429264   PCIFunctionNo <integer> = 0x0000000000000000 (0)
00:00:07.429267   Trusted       <integer> = 0x0000000000000001 (1)
00:00:07.429270 
00:00:07.429271 [/Devices/usb-ohci/0/Config/] (level 4)
00:00:07.429275 
00:00:07.429276 [/Devices/usb-ohci/0/LUN#0/] (level 4)
00:00:07.429280   Driver <string>  = "VUSBRootHub" (cb=12)
00:00:07.429282 
00:00:07.429283 [/Devices/usb-ohci/0/LUN#0/Config/] (level 5)
00:00:07.429288 
00:00:07.429289 [/Devices/usb-ohci/0/LUN#999/] (level 4)
00:00:07.429293   Driver <string>  = "MainStatus" (cb=11)
00:00:07.429295 
00:00:07.429296 [/Devices/usb-ohci/0/LUN#999/Config/] (level 5)
00:00:07.429301   First   <integer> = 0x0000000000000000 (0)
00:00:07.429303   Last    <integer> = 0x0000000000000000 (0)
00:00:07.429306   papLeds <integer> = 0x0000000003d6db90 (64 412 560)
00:00:07.429310 
00:00:07.429311 [/Devices/vga/] (level 2)
00:00:07.429314 
00:00:07.429315 [/Devices/vga/0/] (level 3)
00:00:07.429318   PCIBusNo      <integer> = 0x0000000000000000 (0)
00:00:07.429321   PCIDeviceNo   <integer> = 0x0000000000000002 (2)
00:00:07.429324   PCIFunctionNo <integer> = 0x0000000000000000 (0)
00:00:07.429326   Trusted       <integer> = 0x0000000000000001 (1)
00:00:07.429329 
00:00:07.429330 [/Devices/vga/0/Config/] (level 4)
00:00:07.429334   CustomVideoModes <integer> = 0x0000000000000000 (0)
00:00:07.429337   FadeIn           <integer> = 0x0000000000000001 (1)
00:00:07.429340   FadeOut          <integer> = 0x0000000000000001 (1)
00:00:07.429343   HeightReduction  <integer> = 0x0000000000000000 (0)
00:00:07.429346   LogoFile         <string>  = "" (cb=1)
00:00:07.429348   LogoTime         <integer> = 0x0000000000000000 (0)
00:00:07.429351   MonitorCount     <integer> = 0x0000000000000001 (1)
00:00:07.429354   ShowBootMenu     <integer> = 0x0000000000000002 (2)
00:00:07.429357   VRamSize         <integer> = 0x0000000001000000 (16 777 216, 16 MB)
00:00:07.429362 
00:00:07.429363 [/Devices/vga/0/LUN#0/] (level 4)
00:00:07.429367   Driver <string>  = "MainDisplay" (cb=12)
00:00:07.429369 
00:00:07.429370 [/Devices/vga/0/LUN#0/Config/] (level 5)
00:00:07.429375   Object <integer> = 0x0000000003dbe8a0 (64 743 584)
00:00:07.429378 
00:00:07.429380 [/Devices/vga/0/LUN#999/] (level 4)
00:00:07.429383   Driver <string>  = "MainStatus" (cb=11)
00:00:07.429385 
00:00:07.429386 [/Devices/vga/0/LUN#999/Config/] (level 5)
00:00:07.429391   First   <integer> = 0x0000000000000000 (0)
00:00:07.429393   Last    <integer> = 0x0000000000000000 (0)
00:00:07.429396   papLeds <integer> = 0x0000000003d6dba0 (64 412 576)
00:00:07.429400 
00:00:07.429401 [/Devices/virtio-net/] (level 2)
00:00:07.429404 
00:00:07.429405 [/EM/] (level 1)
00:00:07.429408   TripleFaultReset <integer> = 0x0000000000000000 (0)
00:00:07.429411 
00:00:07.429412 [/GIM/] (level 1)
00:00:07.429415   Provider <string>  = "KVM" (cb=4)
00:00:07.429417 
00:00:07.429418 [/HM/] (level 1)
00:00:07.429422   64bitEnabled       <integer> = 0x0000000000000000 (0)
00:00:07.429425   EnableLargePages   <integer> = 0x0000000000000001 (1)
00:00:07.429427   EnableNestedPaging <integer> = 0x0000000000000001 (1)
00:00:07.429430   EnableUX           <integer> = 0x0000000000000001 (1)
00:00:07.429433   EnableVPID         <integer> = 0x0000000000000001 (1)
00:00:07.429436   Exclusive          <integer> = 0x0000000000000000 (0)
00:00:07.429439   HMForced           <integer> = 0x0000000000000000 (0)
00:00:07.429442 
00:00:07.429443 [/MM/] (level 1)
00:00:07.429446   CanUseLargerHeap <integer> = 0x0000000000000000 (0)
00:00:07.429449 
00:00:07.429450 [/PDM/] (level 1)
00:00:07.429453 
00:00:07.429454 [/PDM/AsyncCompletion/] (level 2)
00:00:07.429457 
00:00:07.429458 [/PDM/AsyncCompletion/File/] (level 3)
00:00:07.429462 
00:00:07.429463 [/PDM/AsyncCompletion/File/BwGroups/] (level 4)
00:00:07.429467 
00:00:07.429468 [/PDM/BlkCache/] (level 2)
00:00:07.429472   CacheSize <integer> = 0x0000000000500000 (5 242 880, 5 MB)
00:00:07.429477 
00:00:07.429478 [/PDM/Devices/] (level 2)
00:00:07.429481 
00:00:07.429482 [/PDM/Drivers/] (level 2)
00:00:07.429485 
00:00:07.429486 [/PDM/Drivers/VBoxC/] (level 3)
00:00:07.429489   Path <string>  = "VBoxC" (cb=6)
00:00:07.429491 
00:00:07.429493 [/PDM/NetworkShaper/] (level 2)
00:00:07.429496 
00:00:07.429497 [/PDM/NetworkShaper/BwGroups/] (level 3)
00:00:07.429501 
00:00:07.429502 [/TM/] (level 1)
00:00:07.429505   UTCOffset <integer> = 0x0000000000000000 (0)
00:00:07.429507 
00:00:07.429508 [/USB/] (level 1)
00:00:07.429511 
00:00:07.429512 [/USB/HidMouse/] (level 2)
00:00:07.429515 
00:00:07.429516 [/USB/HidMouse/0/] (level 3)
00:00:07.429520 
00:00:07.429521 [/USB/HidMouse/0/Config/] (level 4)
00:00:07.429525   Mode <string>  = "absolute" (cb=9)
00:00:07.429527 
00:00:07.429528 [/USB/HidMouse/0/LUN#0/] (level 4)
00:00:07.429532   Driver <string>  = "MouseQueue" (cb=11)
00:00:07.429534 
00:00:07.429535 [/USB/HidMouse/0/LUN#0/AttachedDriver/] (level 5)
00:00:07.429540   Driver <string>  = "MainMouse" (cb=10)
00:00:07.429542 
00:00:07.429543 [/USB/HidMouse/0/LUN#0/AttachedDriver/Config/] (level 6)
00:00:07.429548   Object <integer> = 0x0000000003d6c370 (64 406 384)
00:00:07.429551 
00:00:07.429553 [/USB/HidMouse/0/LUN#0/Config/] (level 5)
00:00:07.429557   QueueSize <integer> = 0x0000000000000080 (128)
00:00:07.429560 
00:00:07.429561 [/USB/USBProxy/] (level 2)
00:00:07.429564 
00:00:07.429565 [/USB/USBProxy/GlobalConfig/] (level 3)
00:00:07.429569 
00:00:07.429570 ********************* End of CFGM dump **********************
00:00:07.429585 VM: fHMEnabled=true  (configured) fRecompileUser=false fRecompileSupervisor=false
00:00:07.429590 VM: fRawRing1Enabled=false CSAM=true  PATM=true 
00:00:07.430028 HM: HMR3Init: VT-x w/ nested paging and unrestricted guest execution hw support
00:00:07.430193 MM: cbHyperHeap=0x100000 (1048576)
00:00:07.432965 CPUM: fXStateHostMask=0x7; initial: 0x7; host XCR0=0x7
00:00:07.435445 CPUM: Matched host CPU INTEL 0x6/0x2a/0x7 Intel_Core7_SandyBridge with CPU DB entry 'Intel Core i7-2635QM' (INTEL 0x6/0x2a/0x7 Intel_Core7_SandyBridge)
00:00:07.435673 CPUM: VCPU  0: Cached APIC base MSR = 0x0
00:00:07.437941 PGM: HCPhysInterPD=00000000ca457000 HCPhysInterPaePDPT=00000000ca453000 HCPhysInterPaePML4=00000000ca451000
00:00:07.437977 PGM: apInterPTs={00000000ca455000,00000000ca454000} apInterPaePTs={0000000128497000,0000000103018000} apInterPaePDs={000000019d719000,00000000b829a000,000000005f09b000,000000010161c000} pInterPaePDPT64=00000000ca452000
00:00:07.438004 PGM: Host paging mode: AMD64+PGE+NX
00:00:07.438030 PGM: PGMPool: cMaxPages=560 (u64MaxPages=545)
00:00:07.438046 PGM: pgmR3PoolInit: cMaxPages=0x230 cMaxUsers=0x460 cMaxPhysExts=0x460 fCacheEnable=true 
00:00:07.468265 TM: GIP - u32Mode=3 (Invariant) u32UpdateHz=93 u32UpdateIntervalNS=10752500 enmUseTscDelta=2 (Pratically Zero) fGetGipCpu=0xb cCpus=8
00:00:07.468328 TM: GIP - u64CpuHz=2 195 015 593 (0x82d547a9)  SUPGetCpuHzFromGip => 2 195 015 593
00:00:07.468349 TM: GIP - CPU: iCpuSet=0x0 idCpu=0x0 idApic=0x0 iGipCpu=0x7 i64TSCDelta=0 enmState=3 u64CpuHz=2195015440(*) cErrors=0
00:00:07.468368 TM: GIP - CPU: iCpuSet=0x1 idCpu=0x1 idApic=0x1 iGipCpu=0x4 i64TSCDelta=0 enmState=3 u64CpuHz=2195014844(*) cErrors=0
00:00:07.468385 TM: GIP - CPU: iCpuSet=0x2 idCpu=0x2 idApic=0x2 iGipCpu=0x2 i64TSCDelta=0 enmState=3 u64CpuHz=2195009527(*) cErrors=0
00:00:07.468400 TM: GIP - CPU: iCpuSet=0x3 idCpu=0x3 idApic=0x3 iGipCpu=0x0 i64TSCDelta=0 enmState=3 u64CpuHz=2195015593(*) cErrors=0
00:00:07.468415 TM: GIP - CPU: iCpuSet=0x4 idCpu=0x4 idApic=0x4 iGipCpu=0x5 i64TSCDelta=0 enmState=3 u64CpuHz=2195015106(*) cErrors=0
00:00:07.468430 TM: GIP - CPU: iCpuSet=0x5 idCpu=0x5 idApic=0x5 iGipCpu=0x3 i64TSCDelta=0 enmState=3 u64CpuHz=2195014388(*) cErrors=0
00:00:07.468445 TM: GIP - CPU: iCpuSet=0x6 idCpu=0x6 idApic=0x6 iGipCpu=0x1 i64TSCDelta=0 enmState=3 u64CpuHz=2195012435(*) cErrors=0
00:00:07.468460 TM: GIP - CPU: iCpuSet=0x7 idCpu=0x7 idApic=0x7 iGipCpu=0x6 i64TSCDelta=0 enmState=3 u64CpuHz=2195015488(*) cErrors=0
00:00:07.468763 TM: cTSCTicksPerSecond=2 195 015 593 (0x82d547a9) enmTSCMode=3 (Dynamic)
00:00:07.468771 TM: TSCTiedToExecution=false TSCNotTiedToHalt=false
00:00:07.470007 VMM: CoreCode: R3=000000000bdf0000 R0=ffffb181cdb53000 RC=a055b000 Phys=00000000ca299000 cb=0x1000
00:00:07.470702 IEM: TargetCpu=CURRENT, Microarch=Intel_Core7_SandyBridge
00:00:07.471010 GIM: Using provider 'KVM' (Implementation version: 0)
00:00:07.471045 CPUM: SetGuestCpuIdFeature: Enabled Hypervisor Present bit
00:00:07.471270 AIOMgr: Default manager type is 'Async'
00:00:07.471292 AIOMgr: Default file backend is 'NonBuffered'
00:00:07.471773 BlkCache: Cache successfully initialized. Cache size is 5242880 bytes
00:00:07.471800 BlkCache: Cache commit interval is 10000 ms
00:00:07.471814 BlkCache: Cache commit threshold is 2621440 bytes
00:00:08.430346 PcBios: [SMP] BIOS with 1 CPUs
00:00:08.430420 PcBios: Using the 386+ BIOS image.
00:00:08.434756 PcBios: fCheckShutdownStatusForSoftReset=true   fClearShutdownStatusOnHardReset=true 
00:00:08.472711 SUP: Loaded VBoxDDR0.r0 (C:\Program Files\Oracle\VirtualBox\VBoxDDR0.r0) at 0xfffff809c6c30000 - ModuleInit at 0000000000000000 and ModuleTerm at 0000000000000000 using the native ring-0 loader
00:00:08.512265 SUP: windbg> .reload /f C:\Program Files\Oracle\VirtualBox\VBoxDDR0.r0=0xfffff809c6c30000
00:00:08.514340 CPUM: SetGuestCpuIdFeature: Enabled xAPIC
00:00:08.514370 CPUM: SetGuestCpuIdFeature: Enabled x2APIC
00:00:08.515330 PIT: mode=3 count=0x10000 (65536) - 18.20 Hz (ch=0)
00:00:08.548336 Shared Folders service loaded
00:00:08.560900 VGA: Using the 386+ BIOS image.
00:00:08.565136 DrvVD: Flushes will be ignored
00:00:08.565178 DrvVD: Async flushes will be passed to the disk
00:00:08.566002 VD: VDInit finished
00:00:08.570002 AIOMgr: Endpoint for file 'C:\Users\caev0\VirtualBox VMs\KitKat540x960x16\KitKat540x960x16-disk1.vdi' (flags 000c0723) created successfully
00:00:08.610481 VD: Opening the disk took 45255491 ns
00:00:08.610663 AHCI: LUN#0: disk, PCHS=12483/16/63, total number of sectors 12582912
00:00:08.610696 AHCI: LUN#0: using async I/O
00:00:08.611484 AHCI#0: Reset the HBA
00:00:08.612183 PIIX3 ATA: LUN#0: no unit
00:00:08.612215 PIIX3 ATA: LUN#1: no unit
00:00:08.612375 DrvVD: Flushes will be ignored
00:00:08.612398 DrvVD: Async flushes will be passed to the disk
00:00:08.612767 PIIX3 ATA: LUN#2: CD/DVD, total number of sectors 0, passthrough disabled
00:00:08.612807 PIIX3 ATA: LUN#3: no unit
00:00:08.612902 PIIX3 ATA: Ctl#0: finished processing RESET
00:00:08.613019 PIIX3 ATA: Ctl#1: finished processing RESET
00:00:08.613274 E1000#0 Chip=82540EM LinkUpDelay=5000ms EthernetCRC=on GSO=enabled Itr=enabled ItrRx=enabled R0=enabled GC=enabled
00:00:08.662892 NAT: Guest address guess set to 10.0.2.15 by initialization
00:00:08.678819 NAT: DNS#0: 190.157.8.33
00:00:08.678867 NAT: DNS#1: 190.157.8.1
00:00:08.680819 Audio: Initializing DirectSound audio driver
00:00:08.680892 Audio: Using VBox 5.0.x audio code!
00:00:09.085100 DSound: Output: GUID: {DB401B1C-1A4E-44AC-8178-C8FD606F4104} [Altavoces (Dispositivo de High Definition Audio)] (Module: {0.0.0.00000000}.{db401b1c-1a4e-44ac-8178-c8fd606f4104})
00:00:09.511296 DSound: Input: GUID: {77BCE3A4-5646-490E-89CD-38839FC22A3A} [Micrófono (Dispositivo de High Definition Audio)] (Module: {0.0.1.00000000}.{77bce3a4-5646-490e-89cd-38839fc22a3a})
00:00:09.511352 DSound: Found 1 host playback devices
00:00:09.511373 DSound: Found 1 host capturing devices
00:00:09.513124 Audio: Host audio backend supports 1 output streams and 1 input streams at once
00:00:09.513215 Audio: Initializing VRDE driver
00:00:09.513238 Audio: Using VBox 5.0.x audio code!
00:00:09.513262 Audio: Host audio backend supports 1 output streams and 2 input streams at once
00:00:09.513298 AC97: Reset
00:00:09.514499 DSound: Guest "Line In" is using host device with GUID: {Default device}
00:00:09.552063 Audio: Skipping to create input stream "[LUN#0] ac97.mc", as the host audio backend reached its maximum of concurrent audio input streams
00:00:09.573407 VUSB: Attached 'HidMouse' to port 1
00:00:09.573624 PGM: The CPU physical address width is 36 bits
00:00:09.573649 PGM: PGMR3InitFinalize: 4 MB PSE mask 0000000fffffffff
00:00:09.574259 TM: TMR3InitFinalize: fTSCModeSwitchAllowed=true 
00:00:09.655157 VMM: Thread-context hooks unavailable
00:00:09.658720 HM: Using VT-x implementation 2.0
00:00:09.658724 HM: Host CR4                        = 0x406f8
00:00:09.658729 HM: Host EFER                       = 0xd01
00:00:09.658732 HM: MSR_IA32_SMM_MONITOR_CTL        = 0x0
00:00:09.658734 HM: MSR_IA32_FEATURE_CONTROL        = 0x5
00:00:09.658736 HM: MSR_IA32_VMX_BASIC_INFO         = 0xda040000000010
00:00:09.658740 HM:   VMCS id                         = 0x10
00:00:09.658742 HM:   VMCS size                       = 1024 bytes
00:00:09.658745 HM:   VMCS physical address limit     = None
00:00:09.658747 HM:   VMCS memory type                = 0x6
00:00:09.658750 HM:   Dual-monitor treatment support  = true 
00:00:09.658752 HM:   OUTS & INS instruction-info     = true 
00:00:09.658755 HM: Max resume loops                = 1024
00:00:09.658757 HM: MSR_IA32_VMX_PINBASED_CTLS      = 0x7f00000016
00:00:09.658760 HM:   EXT_INT_EXIT
00:00:09.658761 HM:   NMI_EXIT
00:00:09.658763 HM:   VIRTUAL_NMI
00:00:09.658764 HM:   PREEMPT_TIMER
00:00:09.658766 HM:   POSTED_INTR (must be cleared)
00:00:09.658767 HM: MSR_IA32_VMX_PROCBASED_CTLS     = 0xfff9fffe0401e172
00:00:09.658771 HM:   INT_WINDOW_EXIT
00:00:09.658773 HM:   USE_TSC_OFFSETTING
00:00:09.658774 HM:   HLT_EXIT
00:00:09.658775 HM:   INVLPG_EXIT
00:00:09.658777 HM:   MWAIT_EXIT
00:00:09.658778 HM:   RDPMC_EXIT
00:00:09.658780 HM:   RDTSC_EXIT
00:00:09.658781 HM:   CR3_LOAD_EXIT (must be set)
00:00:09.658782 HM:   CR3_STORE_EXIT (must be set)
00:00:09.658784 HM:   CR8_LOAD_EXIT
00:00:09.658785 HM:   CR8_STORE_EXIT
00:00:09.658787 HM:   USE_TPR_SHADOW
00:00:09.658788 HM:   NMI_WINDOW_EXIT
00:00:09.658789 HM:   MOV_DR_EXIT
00:00:09.658791 HM:   UNCOND_IO_EXIT
00:00:09.658792 HM:   USE_IO_BITMAPS
00:00:09.658794 HM:   MONITOR_TRAP_FLAG
00:00:09.658795 HM:   USE_MSR_BITMAPS
00:00:09.658797 HM:   MONITOR_EXIT
00:00:09.658798 HM:   PAUSE_EXIT
00:00:09.658803 HM:   USE_SECONDARY_EXEC_CTRL
00:00:09.658805 HM: MSR_IA32_VMX_PROCBASED_CTLS2    = 0xff00000000
00:00:09.658808 HM:   VIRT_APIC
00:00:09.658810 HM:   EPT
00:00:09.658811 HM:   DESCRIPTOR_TABLE_EXIT
00:00:09.658813 HM:   RDTSCP
00:00:09.658814 HM:   VIRT_X2APIC
00:00:09.658816 HM:   VPID
00:00:09.658821 HM:   WBINVD_EXIT
00:00:09.658822 HM:   UNRESTRICTED_GUEST
00:00:09.658824 HM:   APIC_REG_VIRT (must be cleared)
00:00:09.658826 HM:   VIRT_INTR_DELIVERY (must be cleared)
00:00:09.658827 HM:   PAUSE_LOOP_EXIT (must be cleared)
00:00:09.658829 HM:   RDRAND_EXIT (must be cleared)
00:00:09.658830 HM:   INVPCID (must be cleared)
00:00:09.658831 HM:   VMFUNC (must be cleared)
00:00:09.658833 HM:   VMCS_SHADOWING (must be cleared)
00:00:09.658834 HM:   ENCLS_EXIT (must be cleared)
00:00:09.658836 HM:   RDSEED_EXIT (must be cleared)
00:00:09.658837 HM:   PML (must be cleared)
00:00:09.658839 HM:   EPT_VE (must be cleared)
00:00:09.658840 HM:   CONCEAL_FROM_PT (must be cleared)
00:00:09.658842 HM:   XSAVES_XRSTORS (must be cleared)
00:00:09.658844 HM:   TSC_SCALING (must be cleared)
00:00:09.658845 HM: MSR_IA32_VMX_ENTRY_CTLS         = 0xffff000011ff
00:00:09.658848 HM:   LOAD_DEBUG (must be set)
00:00:09.658850 HM:   IA32E_MODE_GUEST
00:00:09.658851 HM:   ENTRY_SMM
00:00:09.658853 HM:   DEACTIVATE_DUALMON
00:00:09.658854 HM:   LOAD_GUEST_PERF_MSR
00:00:09.658856 HM:   LOAD_GUEST_PAT_MSR
00:00:09.658857 HM:   LOAD_GUEST_EFER_MSR
00:00:09.658859 HM: MSR_IA32_VMX_EXIT_CTLS          = 0x7fffff00036dff
00:00:09.658862 HM:   SAVE_DEBUG (must be set)
00:00:09.658864 HM:   HOST_ADDR_SPACE_SIZE
00:00:09.658865 HM:   LOAD_PERF_MSR
00:00:09.658866 HM:   ACK_EXT_INT
00:00:09.658868 HM:   SAVE_GUEST_PAT_MSR
00:00:09.658869 HM:   LOAD_HOST_PAT_MSR
00:00:09.658871 HM:   SAVE_GUEST_EFER_MSR
00:00:09.658872 HM:   LOAD_HOST_EFER_MSR
00:00:09.658874 HM:   SAVE_VMX_PREEMPT_TIMER
00:00:09.658875 HM: MSR_IA32_VMX_EPT_VPID_CAP       = 0xf0106114141
00:00:09.658878 HM:   RWX_X_ONLY
00:00:09.658880 HM:   PAGE_WALK_LENGTH_4
00:00:09.658881 HM:   EMT_UC
00:00:09.658883 HM:   EMT_WB
00:00:09.658884 HM:   PDE_2M
00:00:09.658885 HM:   INVEPT
00:00:09.658887 HM:   INVEPT_SINGLE_CONTEXT
00:00:09.658888 HM:   INVEPT_ALL_CONTEXTS
00:00:09.658889 HM:   INVVPID
00:00:09.658891 HM:   INVVPID_INDIV_ADDR
00:00:09.658892 HM:   INVVPID_SINGLE_CONTEXT
00:00:09.658894 HM:   INVVPID_ALL_CONTEXTS
00:00:09.658895 HM:   INVVPID_SINGLE_CONTEXT_RETAIN_GLOBALS
00:00:09.658897 HM: MSR_IA32_VMX_MISC               = 0x100401e5
00:00:09.658900 HM:   PREEMPT_TSC_BIT                 = 0x5
00:00:09.658902 HM:   STORE_EFERLMA_VMEXIT            = true 
00:00:09.658904 HM:   ACTIVITY_STATES                 = 0x7
00:00:09.658905 HM:   CR3_TARGET                      = 0x4
00:00:09.658907 HM:   MAX_MSR                         = 512
00:00:09.658909 HM:   RDMSR_SMBASE_MSR_SMM            = false
00:00:09.658913 HM:   SMM_MONITOR_CTL_B2              = true 
00:00:09.658915 HM:   VMWRITE_VMEXIT_INFO             = false
00:00:09.658917 HM:   MSEG_ID                         = 0x0
00:00:09.658918 HM: MSR_IA32_VMX_CR0_FIXED0         = 0x80000021
00:00:09.658921 HM: MSR_IA32_VMX_CR0_FIXED1         = 0xffffffff
00:00:09.658924 HM: MSR_IA32_VMX_CR4_FIXED0         = 0x2000
00:00:09.658926 HM: MSR_IA32_VMX_CR4_FIXED1         = 0x627ff
00:00:09.658928 HM: MSR_IA32_VMX_VMCS_ENUM          = 0x2a
00:00:09.658930 HM:   HIGHEST_INDEX                   = 0x15
00:00:09.658933 HM: APIC-access page physaddr       = 0x00000000ca298000
00:00:09.658936 HM: VCPU  0: MSR bitmap physaddr    = 0x00000000ca295000
00:00:09.658940 HM: VCPU  0: VMCS physaddr          = 0x00000000ca297000
00:00:09.658944 HM: Guest support: 32-bit only
00:00:09.658962 HM: Supports VMCS EFER fields       = true 
00:00:09.658965 HM: Enabled VMX
00:00:09.658970 CPUM: SetGuestCpuIdFeature: Enabled SYSENTER/EXIT
00:00:09.658972 HM: Enabled nested paging
00:00:09.658974 HM:   EPT flush type                = VMXFLUSHEPT_SINGLE_CONTEXT
00:00:09.658975 HM: Enabled unrestricted guest execution
00:00:09.658977 HM: Enabled large page support
00:00:09.658979 HM: Enabled VPID
00:00:09.658980 HM:   VPID flush type               = VMXFLUSHVPID_SINGLE_CONTEXT
00:00:09.658982 HM: Enabled VMX-preemption timer (cPreemptTimerShift=5)
00:00:09.658984 HM: VT-x/AMD-V init method: LOCAL
00:00:09.658993 CPUM: VCPU  0: Cached APIC base MSR = 0xfee00900
00:00:09.659033 VMM: fUsePeriodicPreemptionTimers=false
00:00:09.659190 CPUM: Logical host processors: 8 present, 8 max, 8 online, online mask: 00000000000000ff
00:00:09.659197 CPUM: Physical host cores: 4
00:00:09.659199 ************************* CPUID dump ************************
00:00:09.659215          Raw Standard CPUID Leaves
00:00:09.659216      Leaf/sub-leaf  eax      ebx      ecx      edx
00:00:09.659222 Gst: 00000000/0000  0000000d 756e6547 6c65746e 49656e69
00:00:09.659228 Hst:                0000000d 756e6547 6c65746e 49656e69
00:00:09.659233 Gst: 00000001/0000  000206a7 00000800 96b8220b 078bfbbf
00:00:09.659238 Hst:                000206a7 06100800 1fbae3bf bfebfbff
00:00:09.659243 Gst: 00000002/0000  76035a01 00f0b2ff 00000000 00ca0000
00:00:09.659247 Hst:                76035a01 00f0b2ff 00000000 00ca0000
00:00:09.659251 Gst: 00000003/0000  00000000 00000000 00000000 00000000
00:00:09.659254 Hst:                00000000 00000000 00000000 00000000
00:00:09.659257 Gst: 00000004/0000  00000121 01c0003f 0000003f 00000000
00:00:09.659261 Hst:                1c004121 01c0003f 0000003f 00000000
00:00:09.659265 Gst: 00000004/0001  00000122 01c0003f 0000003f 00000000
00:00:09.659269 Hst:                1c004122 01c0003f 0000003f 00000000
00:00:09.659273 Gst: 00000004/0002  00000143 01c0003f 000001ff 00000000
00:00:09.659276 Hst:                1c004143 01c0003f 000001ff 00000000
00:00:09.659280 Gst: 00000004/0003  00000163 02c0003f 00001fff 00000006
00:00:09.659284 Hst:                1c03c163 02c0003f 00001fff 00000006
00:00:09.659288 Gst: 00000004/0004  00000000 00000000 00000000 00000000
00:00:09.659291 Hst:                00000000 00000000 00000000 00000000
00:00:09.659293 Gst: 00000005/0000  00000040 00000040 00000000 00000000
00:00:09.659297 Hst:                00000040 00000040 00000003 00021120
00:00:09.659300 Gst: 00000006/0000  00000000 00000000 00000000 00000000
00:00:09.659304 Hst:                00000077 00000002 00000009 00000000
00:00:09.659306 Gst: 00000007/0000  00000000 00000000 00000000 00000000
00:00:09.659309 Hst:                00000000 00000000 00000000 00000000
00:00:09.659312 Gst: 00000008/0000  00000000 00000000 00000000 00000000
00:00:09.659315 Hst:                00000000 00000000 00000000 00000000
00:00:09.659318 Gst: 00000009/0000  00000000 00000000 00000000 00000000
00:00:09.659321 Hst:                00000000 00000000 00000000 00000000
00:00:09.659324 Gst: 0000000a/0000  00000000 00000000 00000000 00000000
00:00:09.659326 Hst:                07300403 00000000 00000000 00000603
00:00:09.659330 Gst: 0000000b/0000  00000000 00000001 00000100 00000000
00:00:09.659333 Hst:                00000001 00000002 00000100 00000006
00:00:09.659338 Gst: 0000000b/0001  00000001 00000001 00000201 00000000
00:00:09.659346 Hst:                00000004 00000008 00000201 00000006
00:00:09.659352 Gst: 0000000b/0002  00000000 00000000 00000002 00000000
00:00:09.659356 Hst:                00000000 00000000 00000002 00000006
00:00:09.659361 Gst: 0000000c/0000  00000000 00000000 00000000 00000000
00:00:09.659364 Hst:                00000000 00000000 00000000 00000000
00:00:09.659366 Gst: 0000000d/0000  00000007 00000340 00000340 00000000
00:00:09.659370 Hst:                00000007 00000340 00000340 00000000
00:00:09.659372 Gst: 0000000d/0001  00000000 00000000 00000000 00000000
00:00:09.659375 Hst:                00000001 00000000 00000000 00000000
00:00:09.659378 Gst: 0000000d/0002  00000100 00000240 00000000 00000000
00:00:09.659381 Hst:                00000100 00000240 00000000 00000000
00:00:09.659384 Gst: 0000000d/0003  00000000 00000000 00000000 00000000
00:00:09.659387 Hst:                00000000 00000000 00000000 00000000
00:00:09.659440                                Name: GenuineIntel
00:00:09.659444                            Supports: 0x00000000-0x0000000d
00:00:09.659458                              Family:  6 	Extended: 0 	Effective: 6
00:00:09.659463                               Model: 10 	Extended: 2 	Effective: 42
00:00:09.659467                            Stepping: 7
00:00:09.659470                                Type: 0 (primary)
00:00:09.659474                             APIC ID: 0x00
00:00:09.659477                        Logical CPUs: 0
00:00:09.659479                        CLFLUSH Size: 8
00:00:09.659482                            Brand ID: 0x00
00:00:09.659485 Features
00:00:09.659487   Mnemonic - Description                                  = guest (host)
00:00:09.659489   FPU - x87 FPU on Chip                                   = 1 (1)
00:00:09.659495   VME - Virtual 8086 Mode Enhancements                    = 1 (1)
00:00:09.659499   DE - Debugging extensions                               = 1 (1)
00:00:09.659503   PSE - Page Size Extension                               = 1 (1)
00:00:09.659507   TSC - Time Stamp Counter                                = 1 (1)
00:00:09.659512   MSR - Model Specific Registers                          = 1 (1)
00:00:09.659516   PAE - Physical Address Extension                        = 0 (1)
00:00:09.659520   MCE - Machine Check Exception                           = 1 (1)
00:00:09.659523   CX8 - CMPXCHG8B instruction                             = 1 (1)
00:00:09.659527   APIC - APIC On-Chip                                     = 1 (1)
00:00:09.659532   SEP - SYSENTER and SYSEXIT Present                      = 1 (1)
00:00:09.659536   MTRR - Memory Type Range Registers                      = 1 (1)
00:00:09.659540   PGE - PTE Global Bit                                    = 1 (1)
00:00:09.659544   MCA - Machine Check Architecture                        = 1 (1)
00:00:09.659548   CMOV - Conditional Move instructions                    = 1 (1)
00:00:09.659551   PAT - Page Attribute Table                              = 1 (1)
00:00:09.659555   PSE-36 - 36-bit Page Size Extension                     = 1 (1)
00:00:09.659559   PSN - Processor Serial Number                           = 0 (0)
00:00:09.659563   CLFSH - CLFLUSH instruction                             = 1 (1)
00:00:09.659567   DS - Debug Store                                        = 0 (1)
00:00:09.659572   ACPI - Thermal Mon. & Soft. Clock Ctrl.                 = 0 (1)
00:00:09.659575   MMX - Intel MMX Technology                              = 1 (1)
00:00:09.659579   FXSR - FXSAVE and FXRSTOR instructions                  = 1 (1)
00:00:09.659583   SSE - SSE support                                       = 1 (1)
00:00:09.659587   SSE2 - SSE2 support                                     = 1 (1)
00:00:09.659591   SS - Self Snoop                                         = 0 (1)
00:00:09.659596   HTT - Hyper-Threading Technology                        = 0 (1)
00:00:09.659600   TM - Therm. Monitor                                     = 0 (1)
00:00:09.659604   PBE - Pending Break Enabled                             = 0 (1)
00:00:09.659608   SSE3 - SSE3 support                                     = 1 (1)
00:00:09.659612   PCLMUL - PCLMULQDQ support (for AES-GCM)                = 1 (1)
00:00:09.659616   DTES64 - DS Area 64-bit Layout                          = 0 (1)
00:00:09.659620   MONITOR - MONITOR/MWAIT instructions                    = 1 (1)
00:00:09.659624   CPL-DS - CPL Qualified Debug Store                      = 0 (1)
00:00:09.659627   VMX - Virtual Machine Extensions                        = 0 (1)
00:00:09.659631   SMX - Safer Mode Extensions                             = 0 (0)
00:00:09.659635   EST - Enhanced SpeedStep Technology                     = 0 (1)
00:00:09.659639   TM2 - Terminal Monitor 2                                = 0 (1)
00:00:09.659643   SSSE3 - Supplemental Streaming SIMD Extensions 3        = 1 (1)
00:00:09.659646   CNTX-ID - L1 Context ID                                 = 0 (0)
00:00:09.659650   SDBG - Silicon Debug interface                          = 0 (0)
00:00:09.659654   FMA - Fused Multiply Add extensions                     = 0 (0)
00:00:09.659658   CX16 - CMPXCHG16B instruction                           = 1 (1)
00:00:09.659662   TPRUPDATE - xTPR Update Control                         = 0 (1)
00:00:09.659666   PDCM - Perf/Debug Capability MSR                        = 0 (1)
00:00:09.659670   PCID - Process Context Identifiers                      = 0 (1)
00:00:09.659674   DCA - Direct Cache Access                               = 0 (0)
00:00:09.659678   SSE4_1 - SSE4_1 support                                 = 1 (1)
00:00:09.659682   SSE4_2 - SSE4_2 support                                 = 1 (1)
00:00:09.659686   X2APIC - x2APIC support                                 = 1 (1)
00:00:09.659690   MOVBE - MOVBE instruction                               = 0 (0)
00:00:09.659694   POPCNT - POPCNT instruction                             = 1 (1)
00:00:09.659698   TSCDEADL - Time Stamp Counter Deadline                  = 0 (1)
00:00:09.659702   AES - AES instructions                                  = 1 (1)
00:00:09.659706   XSAVE - XSAVE instruction                               = 1 (1)
00:00:09.659710   OSXSAVE - OSXSAVE instruction                           = 0 (1)
00:00:09.659714   AVX - AVX support                                       = 1 (1)
00:00:09.659718   F16C - 16-bit floating point conversion instructions    = 0 (0)
00:00:09.659721   RDRAND - RDRAND instruction                             = 0 (0)
00:00:09.659725   HVP - Hypervisor Present (we're a guest)                = 1 (0)
00:00:09.659729 Structured Extended Feature Flags Enumeration (leaf 7):
00:00:09.659731   Mnemonic - Description                                  = guest (host)
00:00:09.659737   FSGSBASE - RDFSBASE/RDGSBASE/WRFSBASE/WRGSBASE instr.   = 0 (0)
00:00:09.659740   TSCADJUST - Supports MSR_IA32_TSC_ADJUST                = 0 (0)
00:00:09.659744   SGX - Supports Software Guard Extensions                = 0 (0)
00:00:09.659747   BMI1 - Advanced Bit Manipulation extension 1            = 0 (0)
00:00:09.659751   HLE - Hardware Lock Elision                             = 0 (0)
00:00:09.659755   AVX2 - Advanced Vector Extensions 2                     = 0 (0)
00:00:09.659759   FDP_EXCPTN_ONLY - FPU DP only updated on exceptions     = 0 (0)
00:00:09.659762   SMEP - Supervisor Mode Execution Prevention             = 0 (0)
00:00:09.659765   BMI2 - Advanced Bit Manipulation extension 2            = 0 (0)
00:00:09.659769   ERMS - Enhanced REP MOVSB/STOSB instructions            = 0 (0)
00:00:09.659772   INVPCID - INVPCID instruction                           = 0 (0)
00:00:09.659776   RTM - Restricted Transactional Memory                   = 0 (0)
00:00:09.659780   PQM - Platform Quality of Service Monitoring            = 0 (0)
00:00:09.659783   DEPFPU_CS_DS - Deprecates FPU CS, FPU DS values if set  = 0 (0)
00:00:09.659786   MPE - Intel Memory Protection Extensions                = 0 (0)
00:00:09.659790   PQE - Platform Quality of Service Enforcement           = 0 (0)
00:00:09.659793   AVX512F - AVX512 Foundation instructions                = 0 (0)
00:00:09.659796   RDSEED - RDSEED instruction                             = 0 (0)
00:00:09.659800   ADX - ADCX/ADOX instructions                            = 0 (0)
00:00:09.659804   SMAP - Supervisor Mode Access Prevention                = 0 (0)
00:00:09.659808   CLFLUSHOPT - CLFLUSHOPT (Cache Line Flush) instruction  = 0 (0)
00:00:09.659811   INTEL_PT - Intel Processor Trace                        = 0 (0)
00:00:09.659815   AVX512PF - AVX512 Prefetch instructions                 = 0 (0)
00:00:09.659819   AVX512ER - AVX512 Exponential & Reciprocal instructions = 0 (0)
00:00:09.659822   AVX512CD - AVX512 Conflict Detection instructions       = 0 (0)
00:00:09.659825   SHA - Secure Hash Algorithm extensions                  = 0 (0)
00:00:09.659829   PREFETCHWT1 - PREFETCHWT1 instruction                   = 0 (0)
00:00:09.659832   PKU - Protection Key for Usermode pages                 = 0 (0)
00:00:09.659836   OSPKU - CR4.PKU mirror                                  = 0 (0)
00:00:09.659841 Processor Extended State Enumeration (leaf 0xd):
00:00:09.659843    XSAVE area cur/max size by XCR0, guest: 0x340/0x340
00:00:09.659846     XSAVE area cur/max size by XCR0, host: 0x340/0x340
00:00:09.659849                    Valid XCR0 bits, guest: 0x00000000`00000007 ( x87 SSE YMM_Hi128 )
00:00:09.659856                     Valid XCR0 bits, host: 0x00000000`00000007 ( x87 SSE YMM_Hi128 )
00:00:09.659862                     XSAVE features, guest:
00:00:09.659866                      XSAVE features, host: XSAVEOPT
00:00:09.659869       XSAVE area cur size XCR0|XSS, guest: 0x0
00:00:09.659872        XSAVE area cur size XCR0|XSS, host: 0x0
00:00:09.659874                Valid IA32_XSS bits, guest: 0x00000000`00000000
00:00:09.659877                 Valid IA32_XSS bits, host: 0x00000000`00000000
00:00:09.659881   State #2, guest: off=0x0240, cb=0x0100 IA32_XSS-bit -- YMM_Hi128
00:00:09.659886   State #2, host:  off=0x0240, cb=0x0100 IA32_XSS-bit -- YMM_Hi128
00:00:09.659916          Raw Hypervisor CPUID Leaves
00:00:09.659918      Leaf/sub-leaf  eax      ebx      ecx      edx
00:00:09.659920 Gst: 40000000/0000  40000001 4b4d564b 564b4d56 0000004d
00:00:09.659925 Hst:                00000007 00000340 00000340 00000000
00:00:09.659928 Gst: 40000001/0000  01000089 00000000 00000000 00000000
00:00:09.659932 Hst:                00000007 00000340 00000340 00000000
00:00:09.659936          Raw Extended CPUID Leaves
00:00:09.659937      Leaf/sub-leaf  eax      ebx      ecx      edx
00:00:09.659939 Gst: 80000000/0000  80000008 00000000 00000000 00000000
00:00:09.659942 Hst:                80000008 00000000 00000000 00000000
00:00:09.659946 Gst: 80000001/0000  00000000 00000000 00000001 08000000
00:00:09.659949 Hst:                00000000 00000000 00000001 28100800
00:00:09.659953 Gst: 80000002/0000  20202020 6e492020 286c6574 43202952
00:00:09.659958 Hst:                20202020 6e492020 286c6574 43202952
00:00:09.659962 Gst: 80000003/0000  2865726f 20294d54 322d3769 51303736
00:00:09.659967 Hst:                2865726f 20294d54 322d3769 51303736
00:00:09.659972 Gst: 80000004/0000  5043204d 20402055 30322e32 007a4847
00:00:09.659976 Hst:                5043204d 20402055 30322e32 007a4847
00:00:09.659980 Gst: 80000005/0000  00000000 00000000 00000000 00000000
00:00:09.659983 Hst:                00000000 00000000 00000000 00000000
00:00:09.659986 Gst: 80000006/0000  00000000 00000000 01006040 00000000
00:00:09.659989 Hst:                00000000 00000000 01006040 00000000
00:00:09.659993 Gst: 80000007/0000  00000000 00000000 00000000 00000100
00:00:09.659996 Hst:                00000000 00000000 00000000 00000100
00:00:09.659999 Gst: 80000008/0000  00003024 00000000 00000000 00000000
00:00:09.660002 Hst:                00003024 00000000 00000000 00000000
00:00:09.660005 Ext Name:                        
00:00:09.660007 Ext Supports:                    0x80000000-0x80000008
00:00:09.660010 Family:                          0  	Extended: 0 	Effective: 0
00:00:09.660013 Model:                           0  	Extended: 0 	Effective: 0
00:00:09.660015 Stepping:                        0
00:00:09.660016 Brand ID:                        0x000
00:00:09.660023 Ext Features
00:00:09.660025   Mnemonic - Description                                  = guest (host)
00:00:09.660027   FPU - x87 FPU on Chip                                   = 0 (0)
00:00:09.660031   VME - Virtual 8086 Mode Enhancements                    = 0 (0)
00:00:09.660035   DE - Debugging extensions                               = 0 (0)
00:00:09.660039   PSE - Page Size Extension                               = 0 (0)
00:00:09.660043   TSC - Time Stamp Counter                                = 0 (0)
00:00:09.660047   MSR - K86 Model Specific Registers                      = 0 (0)
00:00:09.660051   PAE - Physical Address Extension                        = 0 (0)
00:00:09.660055   MCE - Machine Check Exception                           = 0 (0)
00:00:09.660059   CX8 - CMPXCHG8B instruction                             = 0 (0)
00:00:09.660062   APIC - APIC On-Chip                                     = 0 (0)
00:00:09.660067   SEP - SYSCALL/SYSRET                                    = 0 (1)
00:00:09.660071   MTRR - Memory Type Range Registers                      = 0 (0)
00:00:09.660075   PGE - PTE Global Bit                                    = 0 (0)
00:00:09.660079   MCA - Machine Check Architecture                        = 0 (0)
00:00:09.660083   CMOV - Conditional Move instructions                    = 0 (0)
00:00:09.660086   PAT - Page Attribute Table                              = 0 (0)
00:00:09.660090   PSE-36 - 36-bit Page Size Extension                     = 0 (0)
00:00:09.660094   NX - No-Execute/Execute-Disable                         = 0 (1)
00:00:09.660098   AXMMX - AMD Extensions to MMX instructions              = 0 (0)
00:00:09.660101   MMX - Intel MMX Technology                              = 0 (0)
00:00:09.660105   FXSR - FXSAVE and FXRSTOR Instructions                  = 0 (0)
00:00:09.660109   FFXSR - AMD fast FXSAVE and FXRSTOR instructions        = 0 (0)
00:00:09.660112   Page1GB - 1 GB large page                               = 0 (0)
00:00:09.660116   RDTSCP - RDTSCP instruction                             = 1 (1)
00:00:09.660120   LM - AMD64 Long Mode                                    = 0 (1)
00:00:09.660124   3DNOWEXT - AMD Extensions to 3DNow                      = 0 (0)
00:00:09.660128   3DNOW - AMD 3DNow                                       = 0 (0)
00:00:09.660132   LahfSahf - LAHF/SAHF support in 64-bit mode             = 1 (1)
00:00:09.660136   CmpLegacy - Core multi-processing legacy mode           = 0 (0)
00:00:09.660139   SVM - AMD VM extensions                                 = 0 (0)
00:00:09.660143   EXTAPIC - AMD Extended APIC registers                   = 0 (0)
00:00:09.660147   CR8L - AMD LOCK MOV CR0 means MOV CR8                   = 0 (0)
00:00:09.660150   ABM - AMD Advanced Bit Manipulation                     = 0 (0)
00:00:09.660154   SSE4A - SSE4A instructions                              = 0 (0)
00:00:09.660158   MISALIGNSSE - AMD Misaligned SSE mode                   = 0 (0)
00:00:09.660162   3DNOWPRF - AMD PREFETCH and PREFETCHW instructions      = 0 (0)
00:00:09.660165   OSVW - AMD OS Visible Workaround                        = 0 (0)
00:00:09.660169   IBS - Instruct Based Sampling                           = 0 (0)
00:00:09.660173   XOP - Extended Operation support                        = 0 (0)
00:00:09.660176   SKINIT - SKINIT, STGI, and DEV support                  = 0 (0)
00:00:09.660180   WDT - AMD Watchdog Timer support                        = 0 (0)
00:00:09.660184   LWP - Lightweight Profiling support                     = 0 (0)
00:00:09.660187   FMA4 - Four operand FMA instruction support             = 0 (0)
00:00:09.660191   NodeId - NodeId in MSR C001_100C                        = 0 (0)
00:00:09.660195   TBM - Trailing Bit Manipulation instructions            = 0 (0)
00:00:09.660198   TOPOEXT - Topology Extensions                           = 0 (0)
00:00:09.660203 Full Name:                       "      Intel(R) Core(TM) i7-2670QM CPU @ 2.20GHz"
00:00:09.660206 TLB 2/4M Instr/Uni:              res0     0 entries
00:00:09.660208 TLB 2/4M Data:                   res0     0 entries
00:00:09.660211 TLB 4K Instr/Uni:                res0     0 entries
00:00:09.660213 TLB 4K Data:                     res0     0 entries
00:00:09.660215 L1 Instr Cache Line Size:        0 bytes
00:00:09.660217 L1 Instr Cache Lines Per Tag:    0
00:00:09.660218 L1 Instr Cache Associativity:    res0  
00:00:09.660219 L1 Instr Cache Size:             0 KB
00:00:09.660221 L1 Data Cache Line Size:         0 bytes
00:00:09.660223 L1 Data Cache Lines Per Tag:     0
00:00:09.660224 L1 Data Cache Associativity:     res0  
00:00:09.660226 L1 Data Cache Size:              0 KB
00:00:09.660228 L2 TLB 2/4M Instr/Uni:           off       0 entries
00:00:09.660230 L2 TLB 2/4M Data:                off       0 entries
00:00:09.660233 L2 TLB 4K Instr/Uni:             off       0 entries
00:00:09.660234 L2 TLB 4K Data:                  off       0 entries
00:00:09.660237 L2 Cache Line Size:              0 bytes
00:00:09.660238 L2 Cache Lines Per Tag:          0
00:00:09.660239 L2 Cache Associativity:          off   
00:00:09.660241 L2 Cache Size:                   0 KB
00:00:09.660243 APM Features:                    TscInvariant
00:00:09.660246 Host Invariant-TSC support:      true 
00:00:09.660249 Physical Address Width:          36 bits
00:00:09.660251 Virtual Address Width:           48 bits
00:00:09.660252 Guest Physical Address Width:    0 bits
00:00:09.660254 Physical Core Count:             1
00:00:09.660257 
00:00:09.660259 ******************** End of CPUID dump **********************
00:00:09.739500 PcBios: SATA LUN#0 LCHS=783/255/63
00:00:09.739561 APIC: fPostedIntrsEnabled=false fVirtApicRegsEnabled=false fSupportsTscDeadline=false
00:00:09.739590 VMEmt: Halt method global1 (5)
00:00:09.739620 VMEmt: HaltedGlobal1 config: cNsSpinBlockThresholdCfg=50000
00:00:09.739641 Changing the VM state from 'CREATING' to 'CREATED'
00:00:09.742279 Changing the VM state from 'CREATED' to 'POWERING_ON'
00:00:09.742347 AIOMgr: Endpoints without assigned bandwidth groups:
00:00:09.742363 AIOMgr:     C:\Users\caev0\VirtualBox VMs\KitKat540x960x16\KitKat540x960x16-disk1.vdi
00:00:09.742851 Changing the VM state from 'POWERING_ON' to 'RUNNING'
00:00:09.742877 Console: Machine state changed to 'Running'
00:00:09.749846 VMMDev: Guest Log: BIOS: VirtualBox 5.1.18
00:00:09.755517 PIT: mode=2 count=0x10000 (65536) - 18.20 Hz (ch=0)
00:00:09.779217 Display::handleDisplayResize: uScreenId=0 pvVRAM=0000000000000000 w=720 h=400 bpp=0 cbLine=0x0 flags=0x1
00:00:09.779296 ERROR [COM]: aRC=VBOX_E_IPRT_ERROR (0x80bb0005) aIID={02326f63-bcb3-4481-96e0-30d1c2ee97f6} aComponent={DisplayWrap} aText={Could not take a screenshot (VERR_NOT_SUPPORTED)}, preserve=false aResultDetail=0
00:00:09.779542 GUI: UIFrameBufferPrivate::NotifyChange: Screen=0, Origin=0x0, Size=720x400, Sending to async-handler
00:00:09.779734 GUI: UIMachineView::sltHandleNotifyChange: Screen=0, Size=720x400
00:00:09.779797 GUI: UIFrameBufferPrivate::handleNotifyChange: Size=720x400
00:00:09.779825 GUI: UIFrameBufferPrivate::performResize: Size=720x400, Directly using source bitmap content
00:00:09.794315 PIIX3 ATA: Ctl#1: RESET, DevSel=0 AIOIf=0 CmdIf0=0x00 (-1 usec ago) CmdIf1=0x00 (-1 usec ago)
00:00:09.794506 PIIX3 ATA: Ctl#1: finished processing RESET
00:00:09.829757 AHCI#0: Reset the HBA
00:00:09.872842 AHCI#0: Port 0 reset
00:00:09.875117 VMMDev: Guest Log: BIOS: AHCI 0-P#0: PCHS=12483/16/63 LCHS=783/255/63 0x0000000000c00000 sectors
00:00:09.878046 PIT: mode=2 count=0x48d3 (18643) - 64.00 Hz (ch=0)
00:00:09.892408 Display::handleDisplayResize: uScreenId=0 pvVRAM=000000000c690000 w=640 h=480 bpp=32 cbLine=0xA00 flags=0x1
00:00:09.892569 GUI: UIFrameBufferPrivate::NotifyChange: Screen=0, Origin=0x0, Size=640x480, Sending to async-handler
00:00:09.897296 GUI: UIMachineViewNormal::resendSizeHint: Restoring guest size-hint for screen 0 to 800x600
00:00:09.900932 VMMDev: SetVideoModeHint: Got a video mode hint (800x600x32)@(0x0),(1;0) at 0
00:00:09.901110 GUI: UIMachineView::sltHandleNotifyChange: Screen=0, Size=640x480
00:00:09.901139 GUI: UIFrameBufferPrivate::handleNotifyChange: Size=640x480
00:00:09.901618 GUI: UIFrameBufferPrivate::performResize: Size=640x480, Directly using source bitmap content
00:00:09.931952 GUI: 2D video acceleration is disabled
00:00:09.932013 GUI: HID LEDs sync is enabled
00:00:09.934010 GUI: UIMachineLogicNormal::sltCheckForRequestedVisualStateType: Requested-state=0, Machine-state=5
00:00:12.370767 Display::handleDisplayResize: uScreenId=0 pvVRAM=0000000000000000 w=720 h=400 bpp=0 cbLine=0x0 flags=0x1
00:00:12.371043 GUI: UIFrameBufferPrivate::NotifyChange: Screen=0, Origin=0x0, Size=720x400, Sending to async-handler
00:00:12.371728 GUI: UIMachineView::sltHandleNotifyChange: Screen=0, Size=720x400
00:00:12.371792 GUI: UIFrameBufferPrivate::handleNotifyChange: Size=720x400
00:00:12.371861 GUI: UIFrameBufferPrivate::performResize: Size=720x400, Directly using source bitmap content
00:00:12.382907 PIT: mode=2 count=0x10000 (65536) - 18.20 Hz (ch=0)
00:00:12.383842 VMMDev: Guest Log: BIOS: Boot : bseqnr=1, bootseq=0231
00:00:12.384584 VMMDev: Guest Log: BIOS: Boot from Floppy 0 failed
00:00:12.385410 VMMDev: Guest Log: BIOS: Boot : bseqnr=2, bootseq=0023
00:00:12.386928 VMMDev: Guest Log: BIOS: CDROM boot failure code : 0003
00:00:12.387623 VMMDev: Guest Log: BIOS: Boot from CD-ROM failed
00:00:12.388496 VMMDev: Guest Log: BIOS: Boot : bseqnr=3, bootseq=0002
00:00:12.391104 VMMDev: Guest Log: BIOS: Booting from Hard Disk...
00:00:12.493179 VMMDev: Guest Log: int13_harddisk_ext: function 41, unmapped device for ELDL=81
00:00:12.494520 VMMDev: Guest Log: int13_harddisk: function 08, unmapped device for ELDL=81
00:00:12.529333 Display::handleDisplayResize: uScreenId=0 pvVRAM=000000000c690000 w=640 h=480 bpp=0 cbLine=0x140 flags=0x1
00:00:12.529512 GUI: UIFrameBufferPrivate::NotifyChange: Screen=0, Origin=0x0, Size=640x480, Sending to async-handler
00:00:12.529665 GUI: UIMachineView::sltHandleNotifyChange: Screen=0, Size=640x480
00:00:12.529708 GUI: UIFrameBufferPrivate::handleNotifyChange: Size=640x480
00:00:12.530260 GUI: UIFrameBufferPrivate::performResize: Size=640x480, Directly using source bitmap content
00:00:22.911098 Display::handleDisplayResize: uScreenId=0 pvVRAM=0000000000000000 w=720 h=400 bpp=0 cbLine=0x0 flags=0x1
00:00:22.911319 GUI: UIFrameBufferPrivate::NotifyChange: Screen=0, Origin=0x0, Size=720x400, Sending to async-handler
00:00:22.911512 GUI: UIMachineView::sltHandleNotifyChange: Screen=0, Size=720x400
00:00:22.911585 GUI: UIFrameBufferPrivate::handleNotifyChange: Size=720x400
00:00:22.912106 GUI: UIFrameBufferPrivate::performResize: Size=720x400, Directly using source bitmap content
00:00:23.521161 VMMDev: Guest Log: BIOS: KBD: unsupported int 16h function 03
00:00:23.522104 VMMDev: Guest Log: BIOS: AX=0305 BX=0000 CX=0000 DX=0000 
00:00:27.447164 Changing the VM state from 'RUNNING' to 'SUSPENDING'
00:00:27.500314 AIOMgr: Async flushes not supported
00:00:27.535321 AIOMgr: Endpoint for file 'C:\Users\caev0\VirtualBox VMs\KitKat540x960x16\KitKat540x960x16-disk1.vdi' (flags 000c0781) created successfully
00:00:27.687443 PDMR3Suspend: 240 198 550 ns run time
00:00:27.687497 Changing the VM state from 'SUSPENDING' to 'SUSPENDED'
00:00:27.687539 Console: Machine state changed to 'Paused'
00:00:29.336843 GUI: Request for close-action to power VM off.
00:00:29.336898 GUI: Passing request to power VM off from machine-logic to UI session.
00:00:29.336915 GUI: Powering VM down on UI session power off request...
00:00:29.337844 Console: Machine state changed to 'Stopping'
00:00:29.338389 Console::powerDown(): A request to power off the VM has been issued (mMachineState=Stopping, InUninit=0)
00:00:29.338438 Display::handleDisplayResize: uScreenId=0 pvVRAM=0000000000000000 w=720 h=400 bpp=32 cbLine=0x0 flags=0x1
00:00:29.338499 GUI: UIFrameBufferPrivate::NotifyChange: Screen=0, Origin=0x0, Size=720x400, Sending to async-handler
00:00:29.338996 Changing the VM state from 'SUSPENDED' to 'POWERING_OFF'
00:00:29.339056 ****************** Guest state at power off for VCpu 0 ******************
00:00:29.339091 Guest CPUM (VCPU 0) state: 
00:00:29.339124 eax=00007004 ebx=00000004 ecx=00000000 edx=00000070 esi=00000000 edi=00000000
00:00:29.339134 eip=00001724 esp=00008e40 ebp=00008e42 iopl=0         ov up ei nt zr na po cy
00:00:29.339143 cs={f000 base=00000000000f0000 limit=0000ffff flags=0000009f} dr0=00000000 dr1=00000000
00:00:29.339155 ds={f000 base=00000000000f0000 limit=0000ffff flags=00000093} dr2=00000000 dr3=00000000
00:00:29.339164 es={9000 base=0000000000090000 limit=0000ffff flags=00000093} dr4=00000000 dr5=00000000
00:00:29.339173 fs={9000 base=0000000000090000 limit=0000ffff flags=00000093} dr6=ffff0ff0 dr7=00000400
00:00:29.339182 gs={9000 base=0000000000090000 limit=0000ffff flags=00000093} cr0=00000010 cr2=00000000
00:00:29.339190 ss={9000 base=0000000000090000 limit=0000ffff flags=00000093} cr3=00000000 cr4=00000000
00:00:29.339199 gdtr=000000000000905c:0027  idtr=0000000000000000:ffff  eflags=00000a87
00:00:29.339207 ldtr={0000 base=00000000 limit=0000ffff flags=00000082}
00:00:29.339213 tr  ={0000 base=00000000 limit=0000ffff flags=0000008b}
00:00:29.339216 SysEnter={cs=0000 eip=00000000 esp=00000000}
00:00:29.339221 xcr=0000000000000001 xcr1=0000000000000000 xss=0000000000000000 (fXStateMask=0000000000000000)
00:00:29.339227 FCW=037f FSW=0000 FTW=0000 FOP=0000 MXCSR=00001f80 MXCSR_MASK=0000ffff
00:00:29.339232 FPUIP=00000000 CS=0000 Rsrvd1=0000  FPUDP=00000000 DS=0000 Rsvrd2=0000
00:00:29.339237 ST(0)=FPR0={0000'00000000'00000000} t0 +0.0000000000000000000000 * 2 ^ -16383 (*)
00:00:29.339246 ST(1)=FPR1={0000'00000000'00000000} t0 +0.0000000000000000000000 * 2 ^ -16383 (*)
00:00:29.339253 ST(2)=FPR2={0000'00000000'00000000} t0 +0.0000000000000000000000 * 2 ^ -16383 (*)
00:00:29.339259 ST(3)=FPR3={0000'00000000'00000000} t0 +0.0000000000000000000000 * 2 ^ -16383 (*)
00:00:29.339265 ST(4)=FPR4={0000'00000000'00000000} t0 +0.0000000000000000000000 * 2 ^ -16383 (*)
00:00:29.339271 ST(5)=FPR5={0000'00000000'00000000} t0 +0.0000000000000000000000 * 2 ^ -16383 (*)
00:00:29.339276 ST(6)=FPR6={0000'00000000'00000000} t0 +0.0000000000000000000000 * 2 ^ -16383 (*)
00:00:29.339282 ST(7)=FPR7={0000'00000000'00000000} t0 +0.0000000000000000000000 * 2 ^ -16383 (*)
00:00:29.339288 XMM0 =00000000'00000000'00000000'00000000  XMM1 =00000000'00000000'00000000'00000000
00:00:29.339295 XMM2 =00000000'00000000'00000000'00000000  XMM3 =00000000'00000000'00000000'00000000
00:00:29.339306 XMM4 =00000000'00000000'00000000'00000000  XMM5 =00000000'00000000'00000000'00000000
00:00:29.339313 XMM6 =00000000'00000000'00000000'00000000  XMM7 =00000000'00000000'00000000'00000000
00:00:29.339319 XMM8 =00000000'00000000'00000000'00000000  XMM9 =00000000'00000000'00000000'00000000
00:00:29.339325 XMM10=00000000'00000000'00000000'00000000  XMM11=00000000'00000000'00000000'00000000
00:00:29.339332 XMM12=00000000'00000000'00000000'00000000  XMM13=00000000'00000000'00000000'00000000
00:00:29.339338 XMM14=00000000'00000000'00000000'00000000  XMM15=00000000'00000000'00000000'00000000
00:00:29.339345 EFER         =0000000000000000
00:00:29.339347 PAT          =0007040600070406
00:00:29.339350 STAR         =0000000000000000
00:00:29.339352 CSTAR        =0000000000000000
00:00:29.339354 LSTAR        =0000000000000000
00:00:29.339356 SFMASK       =0000000000000000
00:00:29.339357 KERNELGSBASE =0000000000000000
00:00:29.339364 ***
00:00:29.339378 Guest paging mode (VCPU #0):  Real (changed 124871 times), A20 enabled (changed 2 times)
00:00:29.339384 Shadow paging mode (VCPU #0): EPT
00:00:29.339387 Host paging mode:              AMD64+G+NX
00:00:29.339390 ***
00:00:29.339396 Active Timers (pVM=0000000009810000)
00:00:29.339399 pTimerR3         offNext  offPrev  offSched Clock               Time             Expire HzHint State                     Description
00:00:29.339410 0000000009e749d0 00012760 00000000 00000000 Real           261492095          261490215      0 2-ACTIVE                  VGA Refresh Timer
00:00:29.339423 0000000009e87130 ffffff80 fffed8a0 00000000 Real           261492095          261490217      0 2-ACTIVE                  EMT Yielder
00:00:29.339434 0000000009e870b0 00000000 00000080 00000000 Real           261492095          261490354      0 2-ACTIVE                  CPU Load Timer
00:00:29.339445 0000000009e83500 00000000 00000000 00000000 Virt         17944842758        17705662892      0 2-ACTIVE                  DevIchAc97
00:00:29.339455 0000000009e6c230 000005e0 00000000 00000000 VrSy         17703536236        17743739344     18 2-ACTIVE                  i8254 Programmable Interval Timer
00:00:29.339465 0000000009e6c810 0001a3a0 fffffa20 00000000 VrSy         17703536236        17990000000      0 2-ACTIVE                  MC146818 RTC/CMOS - Second
00:00:29.339475 0000000009e86bb0 00000000 fffe5c60 00000000 VrSy         17703536236       599932015941      0 2-ACTIVE                  ACPI PM Timer
00:00:29.339486 ***
00:00:29.339492 ************** End of Guest state at power off ***************
00:00:29.348438 PDMR3PowerOff: 8 903 068 ns run time
00:00:29.348514 Changing the VM state from 'POWERING_OFF' to 'OFF'
00:00:29.353366 Changing the VM state from 'OFF' to 'DESTROYING'
00:00:29.353492 ************************* Statistics *************************
00:00:29.353902 /CPUM/MSR-Totals/Reads                  0 times
00:00:29.353946 /CPUM/MSR-Totals/ReadsRaisingGP         0 times
00:00:29.353969 /CPUM/MSR-Totals/ReadsUnknown           0 times
00:00:29.353987 /CPUM/MSR-Totals/Writes                 0 times
00:00:29.354008 /CPUM/MSR-Totals/WritesRaisingGP        0 times
00:00:29.354032 /CPUM/MSR-Totals/WritesToIgnoredBits        0 times
00:00:29.354051 /CPUM/MSR-Totals/WritesUnknown          0 times
00:00:29.354075 /Devices/E1k0/ReceiveBytes              0 bytes
00:00:29.354098 /Devices/E1k0/TransmitBytes             0 bytes
00:00:29.354117 /Devices/IDE0/ATA0/Unit0/AtapiDMA        0 times
00:00:29.354136 /Devices/IDE0/ATA0/Unit0/AtapiPIO        0 times
00:00:29.354154 /Devices/IDE0/ATA0/Unit0/DMA            0 times
00:00:29.354173 /Devices/IDE0/ATA0/Unit0/PIO            0 times
00:00:29.354192 /Devices/IDE0/ATA0/Unit0/ReadBytes        0 bytes
00:00:29.354211 /Devices/IDE0/ATA0/Unit0/WrittenBytes        0 bytes
00:00:29.354230 /Devices/IDE0/ATA0/Unit1/AtapiDMA        0 times
00:00:29.354248 /Devices/IDE0/ATA0/Unit1/AtapiPIO        0 times
00:00:29.354266 /Devices/IDE0/ATA0/Unit1/DMA            0 times
00:00:29.354300 /Devices/IDE0/ATA0/Unit1/PIO            0 times
00:00:29.354331 /Devices/IDE0/ATA0/Unit1/ReadBytes        0 bytes
00:00:29.354352 /Devices/IDE0/ATA0/Unit1/WrittenBytes        0 bytes
00:00:29.354372 /Devices/IDE0/ATA1/Unit0/AtapiDMA        0 times
00:00:29.354390 /Devices/IDE0/ATA1/Unit0/AtapiPIO        0 times
00:00:29.354408 /Devices/IDE0/ATA1/Unit0/DMA            0 times
00:00:29.354425 /Devices/IDE0/ATA1/Unit0/PIO            0 times
00:00:29.354443 /Devices/IDE0/ATA1/Unit0/ReadBytes        0 bytes
00:00:29.354463 /Devices/IDE0/ATA1/Unit0/WrittenBytes        0 bytes
00:00:29.354483 /Devices/IDE0/ATA1/Unit1/AtapiDMA        0 times
00:00:29.354502 /Devices/IDE0/ATA1/Unit1/AtapiPIO        0 times
00:00:29.354527 /Devices/IDE0/ATA1/Unit1/DMA            0 times
00:00:29.354547 /Devices/IDE0/ATA1/Unit1/PIO            0 times
00:00:29.354568 /Devices/IDE0/ATA1/Unit1/ReadBytes        0 bytes
00:00:29.354587 /Devices/IDE0/ATA1/Unit1/WrittenBytes        0 bytes
00:00:29.354607 /Devices/SATA0/Port0/DMA              241 times
00:00:29.354630 /Devices/SATA0/Port0/ReadBytes    7691776 bytes
00:00:29.354670 /Devices/VMMDev/BalloonChunks           0 count
00:00:29.354694 /FT/Checkpoint/Network                  0 times
00:00:29.354715 /FT/Checkpoint/Storage                  0 times
00:00:29.354736 /FT/Received/Mem                        0 bytes
00:00:29.354757 /FT/Received/State                      0 bytes
00:00:29.354777 /FT/Sent/Mem                            0 bytes
00:00:29.354798 /FT/Sent/State                          0 bytes
00:00:29.354818 /FT/Sync/DeltaMem                       0 times
00:00:29.354840 /FT/Sync/DeltaVM                        0 times
00:00:29.354862 /FT/Sync/Full                           0 times
00:00:29.354886 /GMM/VM/Allocated/cBasePages         3166 pages
00:00:29.354907 /GMM/VM/Allocated/cFixedPages           0 pages
00:00:29.354929 /GMM/VM/Allocated/cShadowPages          0 pages
00:00:29.354947 /GMM/VM/Reserved/cBasePages        262302 pages
00:00:29.354947 /GMM/VM/Reserved/cFixedPages         5124 pages
00:00:29.354947 /GMM/VM/Reserved/cShadowPages           1 pages
00:00:29.354947 /GMM/VM/cBalloonedPages                 0 pages
00:00:29.355038 /GMM/VM/cMaxBalloonedPages              0 pages
00:00:29.355059 /GMM/VM/cPrivatePages                3166 pages
00:00:29.355081 /GMM/VM/cReqActuallyBalloonedPages        0 pages
00:00:29.355101 /GMM/VM/cReqBalloonedPages              0 pages
00:00:29.355122 /GMM/VM/cReqDeflatePages                0 pages
00:00:29.355142 /GMM/VM/cShareableModules               0 count
00:00:29.355162 /GMM/VM/cSharedPages                    0 pages
00:00:29.355184 /GMM/VM/enmPolicy                       1 
00:00:29.355206 /GMM/VM/enmPriority                     2 
00:00:29.355228 /GMM/VM/fBallooningEnabled       false    
00:00:29.355248 /GMM/VM/fMayAllocate             true     
00:00:29.355270 /GMM/VM/fSharedPagingEnabled     false    
00:00:29.355290 /GMM/cAllocatedPages                 3166 pages
00:00:29.355311 /GMM/cBalloonedPages                    0 pages
00:00:29.355332 /GMM/cChunks                            7 count
00:00:29.355354 /GMM/cDuplicatePages                    0 pages
00:00:29.355375 /GMM/cFreedChunks                       0 count
00:00:29.355396 /GMM/cLeftBehindSharedPages             0 pages
00:00:29.355416 /GMM/cMaxPages                   4294967295 pages
00:00:29.355439 /GMM/cOverCommittedPages                0 pages
00:00:29.355461 /GMM/cReservedPages                267427 pages
00:00:29.355482 /GMM/cShareableModules                  0 count
00:00:29.355503 /GMM/cSharedPages                       0 pages
00:00:29.355527 /GVMM/EMTs                              1 calls
00:00:29.355548 /GVMM/HostCPUs                          8 calls
00:00:29.355568 /GVMM/HostCpus/0                        0 
00:00:29.355589 /GVMM/HostCpus/0/CurTimerHz             0 Hz
00:00:29.355608 /GVMM/HostCpus/0/DesiredHz              0 Hz
00:00:29.355628 /GVMM/HostCpus/0/PPTChanges             0 times
00:00:29.355658 /GVMM/HostCpus/0/PPTStarts              0 times
00:00:29.355685 /GVMM/HostCpus/0/idxCpuSet              0 
00:00:29.355705 /GVMM/HostCpus/1                        1 
00:00:29.355725 /GVMM/HostCpus/1/CurTimerHz             0 Hz
00:00:29.355744 /GVMM/HostCpus/1/DesiredHz              0 Hz
00:00:29.355763 /GVMM/HostCpus/1/PPTChanges             0 times
00:00:29.355783 /GVMM/HostCpus/1/PPTStarts              0 times
00:00:29.355803 /GVMM/HostCpus/1/idxCpuSet              1 
00:00:29.355822 /GVMM/HostCpus/2                        2 
00:00:29.355841 /GVMM/HostCpus/2/CurTimerHz             0 Hz
00:00:29.355860 /GVMM/HostCpus/2/DesiredHz              0 Hz
00:00:29.355878 /GVMM/HostCpus/2/PPTChanges             0 times
00:00:29.355897 /GVMM/HostCpus/2/PPTStarts              0 times
00:00:29.355915 /GVMM/HostCpus/2/idxCpuSet              2 
00:00:29.355933 /GVMM/HostCpus/3                        3 
00:00:29.355953 /GVMM/HostCpus/3/CurTimerHz             0 Hz
00:00:29.355973 /GVMM/HostCpus/3/DesiredHz              0 Hz
00:00:29.355991 /GVMM/HostCpus/3/PPTChanges             0 times
00:00:29.356009 /GVMM/HostCpus/3/PPTStarts              0 times
00:00:29.356033 /GVMM/HostCpus/3/idxCpuSet              3 
00:00:29.356054 /GVMM/HostCpus/4                        4 
00:00:29.356075 /GVMM/HostCpus/4/CurTimerHz             0 Hz
00:00:29.356096 /GVMM/HostCpus/4/DesiredHz              0 Hz
00:00:29.356116 /GVMM/HostCpus/4/PPTChanges             0 times
00:00:29.356137 /GVMM/HostCpus/4/PPTStarts              0 times
00:00:29.356156 /GVMM/HostCpus/4/idxCpuSet              4 
00:00:29.356176 /GVMM/HostCpus/5                        5 
00:00:29.356196 /GVMM/HostCpus/5/CurTimerHz             0 Hz
00:00:29.356215 /GVMM/HostCpus/5/DesiredHz              0 Hz
00:00:29.356233 /GVMM/HostCpus/5/PPTChanges             0 times
00:00:29.356253 /GVMM/HostCpus/5/PPTStarts              0 times
00:00:29.356274 /GVMM/HostCpus/5/idxCpuSet              5 
00:00:29.356295 /GVMM/HostCpus/6                        6 
00:00:29.356317 /GVMM/HostCpus/6/CurTimerHz             0 Hz
00:00:29.356337 /GVMM/HostCpus/6/DesiredHz              0 Hz
00:00:29.356357 /GVMM/HostCpus/6/PPTChanges             0 times
00:00:29.356377 /GVMM/HostCpus/6/PPTStarts              0 times
00:00:29.356397 /GVMM/HostCpus/6/idxCpuSet              6 
00:00:29.356417 /GVMM/HostCpus/7                        7 
00:00:29.356437 /GVMM/HostCpus/7/CurTimerHz             0 Hz
00:00:29.356455 /GVMM/HostCpus/7/DesiredHz              0 Hz
00:00:29.356474 /GVMM/HostCpus/7/PPTChanges             0 times
00:00:29.356493 /GVMM/HostCpus/7/PPTStarts              0 times
00:00:29.356514 /GVMM/HostCpus/7/idxCpuSet              7 
00:00:29.356539 /GVMM/Sum/HaltBlocking                675 calls
00:00:29.356563 /GVMM/Sum/HaltCalls                  5304 calls
00:00:29.356585 /GVMM/Sum/HaltNotBlocking            4629 calls
00:00:29.356607 /GVMM/Sum/HaltTimeouts                495 calls
00:00:29.356629 /GVMM/Sum/HaltWakeUps                   0 calls
00:00:29.356650 /GVMM/Sum/PokeCalls                   264 calls
00:00:29.356672 /GVMM/Sum/PokeNotBusy                 260 calls
00:00:29.356686 /GVMM/Sum/PollCalls                     7 calls
00:00:29.356698 /GVMM/Sum/PollHalts                     0 calls
00:00:29.356710 /GVMM/Sum/PollWakeUps                   0 calls
00:00:29.356722 /GVMM/Sum/WakeUpCalls                 197 calls
00:00:29.356734 /GVMM/Sum/WakeUpNotHalted             167 calls
00:00:29.356746 /GVMM/Sum/WakeUpWakeUps                 0 calls
00:00:29.356758 /GVMM/VM/HaltBlocking                 675 calls
00:00:29.356770 /GVMM/VM/HaltCalls                   5304 calls
00:00:29.356782 /GVMM/VM/HaltNotBlocking             4629 calls
00:00:29.356794 /GVMM/VM/HaltTimeouts                 495 calls
00:00:29.356806 /GVMM/VM/HaltWakeUps                    0 calls
00:00:29.356818 /GVMM/VM/PokeCalls                    264 calls
00:00:29.356830 /GVMM/VM/PokeNotBusy                  260 calls
00:00:29.356841 /GVMM/VM/PollCalls                      7 calls
00:00:29.356862 /GVMM/VM/PollHalts                      0 calls
00:00:29.356880 /GVMM/VM/PollWakeUps                    0 calls
00:00:29.356892 /GVMM/VM/WakeUpCalls                  197 calls
00:00:29.356905 /GVMM/VM/WakeUpNotHalted              167 calls
00:00:29.356917 /GVMM/VM/WakeUpWakeUps                  0 calls
00:00:29.356929 /GVMM/VMs                               1 calls
00:00:29.356942 /HM/CPU0/Exit/HostNmiInGC               0 times
00:00:29.356954 /HM/CPU0/Switch/Preempting              0 times
00:00:29.356966 /IEM/CPU0/CodeTlb-Misses                0 count
00:00:29.356979 /IEM/CPU0/CodeTlb-PhysRev        ffffffffffff9c00 
00:00:29.356993 /IEM/CPU0/CodeTlb-Revision       fffff38000000000 
00:00:29.357006 /IEM/CPU0/CodeTlb-SlowReads             0 
00:00:29.357022 /IEM/CPU0/DataTlb-Misses                0 count
00:00:29.357036 /IEM/CPU0/DataTlb-PhysRev        ffffffffffff9c00 
00:00:29.357050 /IEM/CPU0/DataTlb-Revision       fffff38000000000 
00:00:29.357063 /IEM/CPU0/cInstructions            680809 count
00:00:29.357075 /IEM/CPU0/cLongJumps                    0 bytes
00:00:29.357088 /IEM/CPU0/cPendingCommit                0 bytes
00:00:29.357099 /IEM/CPU0/cPotentialExits          775239 count
00:00:29.357112 /IEM/CPU0/cRetAspectNotImplemented        0 count
00:00:29.357124 /IEM/CPU0/cRetErrStatuses               0 count
00:00:29.357136 /IEM/CPU0/cRetInfStatuses               0 count
00:00:29.357148 /IEM/CPU0/cRetInstrNotImplemented        0 count
00:00:29.357160 /IEM/CPU0/cbWritten                860166 bytes
00:00:29.357172 /MM/HyperHeap/cbFree               844048 bytes
00:00:29.357185 /MM/HyperHeap/cbHeap              1048256 bytes
00:00:29.357197 /PDM/BlkCache/cbCached                  0 bytes
00:00:29.357209 /PDM/BlkCache/cbCachedFru               0 bytes
00:00:29.357220 /PDM/BlkCache/cbCachedMruIn             0 bytes
00:00:29.357232 /PDM/BlkCache/cbCachedMruOut            0 bytes
00:00:29.357244 /PDM/BlkCache/cbMax               5242880 bytes
00:00:29.357257 /PDM/CritSects/8237A#0Auto/ContentionR3        0 times
00:00:29.357269 /PDM/CritSects/8237A#0Auto/ContentionRZLock        0 times
00:00:29.357281 /PDM/CritSects/8237A#0Auto/ContentionRZUnlock        0 times
00:00:29.357293 /PDM/CritSects/AHCI#0/ContentionR3        0 times
00:00:29.357304 /PDM/CritSects/AHCI#0/ContentionRZLock        0 times
00:00:29.357316 /PDM/CritSects/AHCI#0/ContentionRZUnlock        0 times
00:00:29.357328 /PDM/CritSects/ATA#0-Ctl/ContentionR3        0 times
00:00:29.357340 /PDM/CritSects/ATA#0-Ctl/ContentionRZLock        0 times
00:00:29.357351 /PDM/CritSects/ATA#0-Ctl/ContentionRZUnlock        0 times
00:00:29.357363 /PDM/CritSects/ATA#0-Req/ContentionR3        0 times
00:00:29.357374 /PDM/CritSects/ATA#0-Req/ContentionRZLock        0 times
00:00:29.357386 /PDM/CritSects/ATA#0-Req/ContentionRZUnlock        0 times
00:00:29.357397 /PDM/CritSects/ATA#1-Ctl/ContentionR3        0 times
00:00:29.357409 /PDM/CritSects/ATA#1-Ctl/ContentionRZLock        2 times
00:00:29.357420 /PDM/CritSects/ATA#1-Ctl/ContentionRZUnlock        0 times
00:00:29.357432 /PDM/CritSects/ATA#1-Req/ContentionR3        0 times
00:00:29.357443 /PDM/CritSects/ATA#1-Req/ContentionRZLock        0 times
00:00:29.357455 /PDM/CritSects/ATA#1-Req/ContentionRZUnlock        0 times
00:00:29.357466 /PDM/CritSects/E1000#0/ContentionR3        0 times
00:00:29.357477 /PDM/CritSects/E1000#0/ContentionRZLock        0 times
00:00:29.357488 /PDM/CritSects/E1000#0/ContentionRZUnlock        0 times
00:00:29.357499 /PDM/CritSects/E1000#0RX/ContentionR3        0 times
00:00:29.357511 /PDM/CritSects/E1000#0RX/ContentionRZLock        0 times
00:00:29.357525 /PDM/CritSects/E1000#0RX/ContentionRZUnlock        0 times
00:00:29.357542 /PDM/CritSects/E1000#0TX/ContentionR3        0 times
00:00:29.357559 /PDM/CritSects/E1000#0TX/ContentionRZLock        0 times
00:00:29.357579 /PDM/CritSects/E1000#0TX/ContentionRZUnlock        0 times
00:00:29.357597 /PDM/CritSects/EM-REM/ContentionR3        0 times
00:00:29.357620 /PDM/CritSects/EM-REM/ContentionRZLock        0 times
00:00:29.357638 /PDM/CritSects/EM-REM/ContentionRZUnlock        0 times
00:00:29.357651 /PDM/CritSects/FTM/ContentionR3         0 times
00:00:29.357663 /PDM/CritSects/FTM/ContentionRZLock        0 times
00:00:29.357675 /PDM/CritSects/FTM/ContentionRZUnlock        0 times
00:00:29.357686 /PDM/CritSects/GIMDev#0Auto/ContentionR3        0 times
00:00:29.357698 /PDM/CritSects/GIMDev#0Auto/ContentionRZLock        0 times
00:00:29.357709 /PDM/CritSects/GIMDev#0Auto/ContentionRZUnlock        0 times
00:00:29.357721 /PDM/CritSects/MM-HYPER/ContentionR3        0 times
00:00:29.357732 /PDM/CritSects/MM-HYPER/ContentionRZLock        0 times
00:00:29.357744 /PDM/CritSects/MM-HYPER/ContentionRZUnlock        0 times
00:00:29.357756 /PDM/CritSects/NOP/ContentionR3         0 times
00:00:29.357767 /PDM/CritSects/NOP/ContentionRZLock        0 times
00:00:29.357778 /PDM/CritSects/NOP/ContentionRZUnlock        0 times
00:00:29.357790 /PDM/CritSects/OHCI#0Irq/ContentionR3        0 times
00:00:29.357801 /PDM/CritSects/OHCI#0Irq/ContentionRZLock        0 times
00:00:29.357812 /PDM/CritSects/OHCI#0Irq/ContentionRZUnlock        0 times
00:00:29.357823 /PDM/CritSects/PDM/ContentionR3         0 times
00:00:29.357835 /PDM/CritSects/PDM/ContentionRZLock        0 times
00:00:29.357846 /PDM/CritSects/PDM/ContentionRZUnlock        0 times
00:00:29.357857 /PDM/CritSects/PGM/ContentionR3         0 times
00:00:29.357869 /PDM/CritSects/PGM/ContentionRZLock        0 times
00:00:29.357880 /PDM/CritSects/PGM/ContentionRZUnlock        0 times
00:00:29.357891 /PDM/CritSects/REM-Register/ContentionR3        0 times
00:00:29.357903 /PDM/CritSects/REM-Register/ContentionRZLock        0 times
00:00:29.357914 /PDM/CritSects/REM-Register/ContentionRZUnlock        0 times
00:00:29.357926 /PDM/CritSects/TM Timer Lock/ContentionR3        0 times
00:00:29.357938 /PDM/CritSects/TM Timer Lock/ContentionRZLock        0 times
00:00:29.357949 /PDM/CritSects/TM Timer Lock/ContentionRZUnlock        0 times
00:00:29.357961 /PDM/CritSects/TM VirtualSync Lock/ContentionR3        0 times
00:00:29.357972 /PDM/CritSects/TM VirtualSync Lock/ContentionRZLock        0 times
00:00:29.357983 /PDM/CritSects/TM VirtualSync Lock/ContentionRZUnlock        0 times
00:00:29.357995 /PDM/CritSects/VGA#0/ContentionR3        0 times
00:00:29.358006 /PDM/CritSects/VGA#0/ContentionRZLock        0 times
00:00:29.358018 /PDM/CritSects/VGA#0/ContentionRZUnlock        0 times
00:00:29.358033 /PDM/CritSects/VGA#0_IRQ/ContentionR3        0 times
00:00:29.358045 /PDM/CritSects/VGA#0_IRQ/ContentionRZLock        0 times
00:00:29.358056 /PDM/CritSects/VGA#0_IRQ/ContentionRZUnlock        0 times
00:00:29.358068 /PDM/CritSects/VMMDev#0/ContentionR3        0 times
00:00:29.358079 /PDM/CritSects/VMMDev#0/ContentionRZLock        0 times
00:00:29.358091 /PDM/CritSects/VMMDev#0/ContentionRZUnlock        0 times
00:00:29.358102 /PDM/CritSects/acpi#0/ContentionR3        0 times
00:00:29.358114 /PDM/CritSects/acpi#0/ContentionRZLock        0 times
00:00:29.358126 /PDM/CritSects/acpi#0/ContentionRZUnlock        0 times
00:00:29.358137 /PDM/CritSects/ichac97#0Auto/ContentionR3        0 times
00:00:29.358149 /PDM/CritSects/ichac97#0Auto/ContentionRZLock        0 times
00:00:29.358160 /PDM/CritSects/ichac97#0Auto/ContentionRZUnlock        0 times
00:00:29.358171 /PDM/CritSects/mc146818#0Auto/ContentionR3        0 times
00:00:29.358183 /PDM/CritSects/mc146818#0Auto/ContentionRZLock        0 times
00:00:29.358195 /PDM/CritSects/mc146818#0Auto/ContentionRZUnlock        0 times
00:00:29.358206 /PDM/CritSects/pcarch#0Auto/ContentionR3        0 times
00:00:29.358218 /PDM/CritSects/pcarch#0Auto/ContentionRZLock        0 times
00:00:29.358229 /PDM/CritSects/pcarch#0Auto/ContentionRZUnlock        0 times
00:00:29.358241 /PDM/CritSects/pcbios#0Auto/ContentionR3        0 times
00:00:29.358252 /PDM/CritSects/pcbios#0Auto/ContentionRZLock        0 times
00:00:29.358267 /PDM/CritSects/pcbios#0Auto/ContentionRZUnlock        0 times
00:00:29.358293 /PDM/CritSects/pckbd#0Auto/ContentionR3        0 times
00:00:29.358314 /PDM/CritSects/pckbd#0Auto/ContentionRZLock        0 times
00:00:29.358330 /PDM/CritSects/pckbd#0Auto/ContentionRZUnlock        0 times
00:00:29.358348 /PDM/CritSects/pit#0/ContentionR3        0 times
00:00:29.358364 /PDM/CritSects/pit#0/ContentionRZLock        0 times
00:00:29.358382 /PDM/CritSects/pit#0/ContentionRZUnlock        0 times
00:00:29.358399 /PDM/CritSects/usb-ohci#0Auto/ContentionR3        0 times
00:00:29.358425 GUI: UIMachineView::sltHandleNotifyChange: Screen=0, Size=720x400
00:00:29.358481 /PDM/CritSects/usb-ohci#0Auto/ContentionRZLock        0 times
00:00:29.358553 /PDM/CritSects/usb-ohci#0Auto/ContentionRZUnlock        0 times
00:00:29.358581 /PDM/CritSectsRw/IOM Lock/ContentionR3EnterExcl        0 times
00:00:29.358602 /PDM/CritSectsRw/IOM Lock/ContentionR3EnterShared        0 times
00:00:29.358625 /PDM/CritSectsRw/IOM Lock/ContentionRZEnterExcl        0 times
00:00:29.358642 /PDM/CritSectsRw/IOM Lock/ContentionRZEnterShared        0 times
00:00:29.358665 /PDM/CritSectsRw/IOM Lock/ContentionRZLeaveExcl        0 times
00:00:29.358684 /PDM/CritSectsRw/IOM Lock/ContentionRZLeaveShared        0 times
00:00:29.358707 /PDM/CritSectsRw/IOM Lock/R3EnterExcl      204 times
00:00:29.358727 /PDM/CritSectsRw/IOM Lock/R3EnterShared     9925 times
00:00:29.358747 /PDM/CritSectsRw/IOM Lock/RZEnterExcl        0 times
00:00:29.358766 /PDM/CritSectsRw/IOM Lock/RZEnterShared  2577161 times
00:00:29.358786 /PDM/Queue/AHCI-Xmit/AllocFailures        0 times
00:00:29.358803 /PDM/Queue/AHCI-Xmit/Flush              0 calls
00:00:29.358822 /PDM/Queue/AHCI-Xmit/FlushLeftovers        0 times
00:00:29.358841 /PDM/Queue/AHCI-Xmit/Insert             0 calls
00:00:29.358861 /PDM/Queue/AHCI-Xmit/cItems            60 count
00:00:29.358881 /PDM/Queue/AHCI-Xmit/cbItem            32 bytes
00:00:29.358901 /PDM/Queue/DevHlp/AllocFailures         0 times
00:00:29.358919 /PDM/Queue/DevHlp/Flush                 0 calls
00:00:29.358939 /PDM/Queue/DevHlp/FlushLeftovers        0 times
00:00:29.358957 /PDM/Queue/DevHlp/Insert                0 calls
00:00:29.358975 /PDM/Queue/DevHlp/cItems                8 count
00:00:29.358994 /PDM/Queue/DevHlp/cbItem               64 bytes
00:00:29.359015 /PDM/Queue/E1000-Rcv/AllocFailures        0 times
00:00:29.359039 /PDM/Queue/E1000-Rcv/Flush              0 calls
00:00:29.359060 /PDM/Queue/E1000-Rcv/FlushLeftovers        0 times
00:00:29.359080 /PDM/Queue/E1000-Rcv/Insert             0 calls
00:00:29.359100 /PDM/Queue/E1000-Rcv/cItems             1 count
00:00:29.359121 /PDM/Queue/E1000-Rcv/cbItem            24 bytes
00:00:29.359142 /PDM/Queue/E1000-Xmit/AllocFailures        0 times
00:00:29.359163 /PDM/Queue/E1000-Xmit/Flush             0 calls
00:00:29.359183 /PDM/Queue/E1000-Xmit/FlushLeftovers        0 times
00:00:29.359202 /PDM/Queue/E1000-Xmit/Insert            0 calls
00:00:29.359220 /PDM/Queue/E1000-Xmit/cItems            1 count
00:00:29.359239 /PDM/Queue/E1000-Xmit/cbItem           24 bytes
00:00:29.359259 /PDM/Queue/Keyboard/AllocFailures        0 times
00:00:29.359286 /PDM/Queue/Keyboard/Flush               0 calls
00:00:29.359304 /PDM/Queue/Keyboard/FlushLeftovers        0 times
00:00:29.359328 /PDM/Queue/Keyboard/Insert              0 calls
00:00:29.359346 /PDM/Queue/Keyboard/cItems             64 count
00:00:29.359365 /PDM/Queue/Keyboard/cbItem             32 bytes
00:00:29.359384 /PDM/Queue/Mouse/AllocFailures          0 times
00:00:29.359403 /PDM/Queue/Mouse/Flush                  0 calls
00:00:29.359424 /PDM/Queue/Mouse/FlushLeftovers         0 times
00:00:29.359441 /PDM/Queue/Mouse/Insert                 0 calls
00:00:29.359459 /PDM/Queue/Mouse/cItems               128 count
00:00:29.359479 /PDM/Queue/Mouse/cbItem                48 bytes
00:00:29.359498 /PDM/Queue/Mouse_1/AllocFailures        0 times
00:00:29.359517 /PDM/Queue/Mouse_1/Flush                0 calls
00:00:29.359541 /PDM/Queue/Mouse_1/FlushLeftovers        0 times
00:00:29.359575 /PDM/Queue/Mouse_1/Insert               0 calls
00:00:29.359607 /PDM/Queue/Mouse_1/cItems             128 count
00:00:29.359629 /PDM/Queue/Mouse_1/cbItem              48 bytes
00:00:29.359650 /PGM/CPU0/cA20Changes                   2 times
00:00:29.359672 /PGM/CPU0/cGuestModeChanges        124871 times
00:00:29.359694 /PGM/ChunkR3Map/Mapped                  7 count
00:00:29.359716 /PGM/ChunkR3Map/Unmapped                0 count
00:00:29.359737 /PGM/ChunkR3Map/c                       7 count
00:00:29.359758 /PGM/ChunkR3Map/cMax             4294967295 count
00:00:29.359780 /PGM/LargePage/Recheck                  0 times
00:00:29.359800 /PGM/LargePage/Refused                  2 times
00:00:29.359819 /PGM/LargePage/Reused                   0 times
00:00:29.359842 /PGM/Page/cAllPages                267334 count
00:00:29.359864 /PGM/Page/cBalloonedPages               0 count
00:00:29.359883 /PGM/Page/cHandyPages                  96 count
00:00:29.359908 /PGM/Page/cLargePages                   0 count
00:00:29.359921 /PGM/Page/cLargePagesDisabled           0 count
00:00:29.359933 /PGM/Page/cMonitoredPages               0 count
00:00:29.359945 /PGM/Page/cPrivatePages              8194 count
00:00:29.359957 /PGM/Page/cPureMmioPages               36 count
00:00:29.359968 /PGM/Page/cReadLockedPages              0 count
00:00:29.359980 /PGM/Page/cReusedSharedPages            0 count
00:00:29.359991 /PGM/Page/cSharedPages                  0 count
00:00:29.360003 /PGM/Page/cWriteLockedPages             0 count
00:00:29.360015 /PGM/Page/cWrittenToPages               0 count
00:00:29.360030 /PGM/Page/cZeroPages               259104 count
00:00:29.360043 /PGM/ShMod/Check                        0 ticks/call (           0 ticks,       0 times, max         0, min      -1)
00:00:29.360060 /PGM/cRelocations                       0 times
00:00:29.360072 /PROF/CPU0/EM/Capped                    0 ticks/call (           0 ticks,       0 times, max         0, min      -1)
00:00:29.360087 /PROF/CPU0/EM/ForcedActions         14351 times
00:00:29.360099 /PROF/CPU0/EM/Halted                  230 times
00:00:29.360112 /PROF/CPU0/EM/RAWTotal                  0 times
00:00:29.360123 /PROF/CPU0/EM/REMTotal                  0 times
00:00:29.360135 /PROF/CPU0/EM/Total              39389191825 ticks/call ( 39389191825 ticks,       1 times, max 39389191825, min 39389191825)
00:00:29.360174 /PROF/CPU0/VM/Halt/Block           422906 ns/call (  2239715224 ticks,    5296 times, max   5941411, min    1297)
00:00:29.360194 /PROF/CPU0/VM/Halt/BlockInsomnia        0 ns/call (           0 ticks,       0 times, max         0, min      -1)
00:00:29.360209 /PROF/CPU0/VM/Halt/BlockOnTime          0 ns/call (           0 ticks,       0 times, max         0, min      -1)
00:00:29.360222 /PROF/CPU0/VM/Halt/BlockOverslept        0 ns/call (           0 ticks,       0 times, max         0, min      -1)
00:00:29.360236 /PROF/CPU0/VM/Halt/Timers            2848 ns/call (    28457185 ticks,    9989 times, max    364050, min       2)
00:00:29.360253 /PROF/CPU0/VM/Halt/Yield             7249 ns/call (       50749 ticks,       7 times, max      7898, min    6595)
00:00:29.360269 /Public/Net/E1k0/BytesReceived          0 bytes
00:00:29.360280 /Public/Net/E1k0/BytesTransmitted        0 bytes
00:00:29.360292 /REM/TbFlushCount                       0 times
00:00:29.360322 /REM/TbPhysInvldCount                   0 times
00:00:29.360335 /REM/TlbFlushCount                      1 times
00:00:29.360348 /SELM/LoadHidSel/GstReadErrors          0 times
00:00:29.360360 /SELM/LoadHidSel/NoGoodGuest            0 times
00:00:29.360372 /TM/CPU/00/cNsExecuting          6314496886 ns
00:00:29.360385 /TM/CPU/00/cNsHalted             2275606122 ns
00:00:29.360398 /TM/CPU/00/cNsOther              9354745793 ns
00:00:29.360410 /TM/CPU/00/cNsTotal              17944848801 ns
00:00:29.360423 /TM/CPU/00/cPeriodsExecuting      1935369 count
00:00:29.360436 /TM/CPU/00/cPeriodsHalted             230 count
00:00:29.360448 /TM/CPU/00/pctExecuting                60 %
00:00:29.360470 /TM/CPU/00/pctHalted                    0 %
00:00:29.360488 /TM/CPU/00/pctOther                    39 %
00:00:29.360501 /TM/CPU/pctExecuting                   60 %
00:00:29.360513 /TM/CPU/pctHalted                       0 %
00:00:29.360527 /TM/CPU/pctOther                       39 %
00:00:29.360540 /TM/MaxHzHint                           0 Hz
00:00:29.360552 /TM/R0/1nsSteps                      4179 times
00:00:29.360565 /TM/R3/1nsSteps                      4071 times
00:00:29.360578 /TM/TSC/offCPU0                         0 ticks
00:00:29.360590 /TM/VirtualSync/CurrentOffset      464104 ns
00:00:29.360603 /VUSB/0/cUrbsInPool                     0 count
00:00:29.360617 ********************* End of statistics **********************
00:00:29.360864 VUSB: Detached 'HidMouse' from port 1
00:00:29.369472 NAT: Zone(nm:mbuf_cluster, used:0)
00:00:29.371241 NAT: Zone(nm:mbuf_packet, used:0)
00:00:29.371277 NAT: Zone(nm:mbuf, used:0)
00:00:29.371602 NAT: Zone(nm:mbuf_jumbo_pagesize, used:0)
00:00:29.373197 NAT: Zone(nm:mbuf_jumbo_9k, used:0)
00:00:29.374097 NAT: Zone(nm:mbuf_jumbo_16k, used:0)
00:00:29.374607 NAT: Zone(nm:mbuf_ext_refcnt, used:0)
00:00:29.377093 GIM: KVM: Resetting MSRs
00:00:29.379232 Changing the VM state from 'DESTROYING' to 'TERMINATED'
00:00:29.383668 Console: Machine state changed to 'PoweredOff'
00:00:29.700102 GUI: Passing request to close Runtime UI from machine-logic to UI session.
