VirtualBox VM 5.1.18 r114002 win.amd64 (Mar 15 2017 16:16:14) release log
00:00:07.003420 Log opened 2017-03-27T03:34:33.531433500Z
00:00:07.003426 Build Type: release
00:00:07.003442 OS Product: Windows 10
00:00:07.003448 OS Release: 10.0.14393
00:00:07.003452 OS Service Pack: 
00:00:07.236020 DMI Product Name: Inspiron N5110
00:00:07.248826 DMI Product Version: Not Specified
00:00:07.248851 Host RAM: 6050MB (5.9GB) total, 2408MB (2.3GB) available
00:00:07.248861 Executable: C:\Program Files\Oracle\VirtualBox\VirtualBox.exe
00:00:07.248863 Process ID: 8052
00:00:07.248865 Package type: WINDOWS_64BITS_GENERIC
00:00:07.252008 Installed Extension Packs:
00:00:07.252133   None installed!
00:00:07.254015 Console: Machine state changed to 'Starting'
00:00:07.255100 Qt version: 5.6.2
00:00:07.262848 GUI: UIMediumEnumerator: Medium-enumeration finished!
00:00:07.534013 SUP: Loaded VMMR0.r0 (C:\Program Files\Oracle\VirtualBox\VMMR0.r0) at 0xfffff809c6640000 - ModuleInit at fffff809c6663590 and ModuleTerm at fffff809c6663a80 using the native ring-0 loader
00:00:07.534072 SUP: VMMR0EntryEx located at fffff809c6666490 and VMMR0EntryFast at fffff809c66641b0
00:00:07.534091 SUP: windbg> .reload /f C:\Program Files\Oracle\VirtualBox\VMMR0.r0=0xfffff809c6640000
00:00:07.537777 Guest OS type: 'Linux26'
00:00:07.551435 File system of 'C:\Users\caev0\VirtualBox VMs\KitKat480x800x16\Snapshots' (snapshots) is unknown
00:00:07.551468 File system of 'C:\Users\caev0\VirtualBox VMs\KitKat480x800x16\KitKat480x800x16-disk1.vdi' is ntfs
00:00:07.593660 Shared clipboard service loaded
00:00:07.593713 Shared clipboard mode: Off
00:00:07.623757 Drag and drop service loaded
00:00:07.623791 Drag and drop mode: Off
00:00:07.684690 Guest Control service loaded
00:00:07.688671 ************************* CFGM dump *************************
00:00:07.688677 [/] (level 0)
00:00:07.688685   CSAMEnabled       <integer> = 0x0000000000000001 (1)
00:00:07.688692   CpuExecutionCap   <integer> = 0x0000000000000064 (100)
00:00:07.688697   EnablePAE         <integer> = 0x0000000000000000 (0)
00:00:07.688701   HMEnabled         <integer> = 0x0000000000000001 (1)
00:00:07.688704   MemBalloonSize    <integer> = 0x0000000000000000 (0)
00:00:07.688707   Name              <string>  = "KitKat480x800x16" (cb=17)
00:00:07.688712   NumCPUs           <integer> = 0x0000000000000001 (1)
00:00:07.688715   PATMEnabled       <integer> = 0x0000000000000001 (1)
00:00:07.688718   PageFusionAllowed <integer> = 0x0000000000000000 (0)
00:00:07.688721   RamHoleSize       <integer> = 0x0000000020000000 (536 870 912, 512 MB)
00:00:07.688728   RamSize           <integer> = 0x0000000040000000 (1 073 741 824, 1 024 MB)
00:00:07.688734   RawR0Enabled      <integer> = 0x0000000000000001 (1)
00:00:07.688737   RawR3Enabled      <integer> = 0x0000000000000001 (1)
00:00:07.688740   TimerMillies      <integer> = 0x000000000000000a (10)
00:00:07.688743   UUID              <bytes>   = "2b b1 3c 87 ff d4 16 41 b8 16 94 d1 62 66 07 84" (cb=16)
00:00:07.688754 
00:00:07.688756 [/CPUM/] (level 1)
00:00:07.688760   GuestCpuName       <string>  = "host" (cb=5)
00:00:07.688763   PortableCpuIdLevel <integer> = 0x0000000000000000 (0)
00:00:07.688766 
00:00:07.688767 [/DBGC/] (level 1)
00:00:07.688771   GlobalInitScript <string>  = "C:\Users\caev0\.VirtualBox/dbgc-init" (cb=37)
00:00:07.688774   HistoryFile      <string>  = "C:\Users\caev0\.VirtualBox/dbgc-history" (cb=40)
00:00:07.688777   LocalInitScript  <string>  = "C:\Users\caev0\VirtualBox VMs\KitKat480x800x16/dbgc-init" (cb=57)
00:00:07.688780 
00:00:07.688781 [/DBGF/] (level 1)
00:00:07.688785   Path <string>  = "C:\Users\caev0\VirtualBox VMs\KitKat480x800x16/debug/;C:\Users\caev0\VirtualBox VMs\KitKat480x800x16/;C:\Users\caev0\" (cb=118)
00:00:07.688788 
00:00:07.688789 [/Devices/] (level 1)
00:00:07.688792 
00:00:07.688794 [/Devices/8237A/] (level 2)
00:00:07.688797 
00:00:07.688798 [/Devices/8237A/0/] (level 3)
00:00:07.688803   Trusted <integer> = 0x0000000000000001 (1)
00:00:07.688806 
00:00:07.688807 [/Devices/GIMDev/] (level 2)
00:00:07.688811 
00:00:07.688812 [/Devices/GIMDev/0/] (level 3)
00:00:07.688816   Trusted <integer> = 0x0000000000000001 (1)
00:00:07.688819 
00:00:07.688820 [/Devices/VMMDev/] (level 2)
00:00:07.688823 
00:00:07.688824 [/Devices/VMMDev/0/] (level 3)
00:00:07.688828   PCIBusNo      <integer> = 0x0000000000000000 (0)
00:00:07.688831   PCIDeviceNo   <integer> = 0x0000000000000004 (4)
00:00:07.688834   PCIFunctionNo <integer> = 0x0000000000000000 (0)
00:00:07.688837   Trusted       <integer> = 0x0000000000000001 (1)
00:00:07.688840 
00:00:07.688841 [/Devices/VMMDev/0/Config/] (level 4)
00:00:07.688845   GuestCoreDumpDir <string>  = "C:\Users\caev0\VirtualBox VMs\KitKat480x800x16\Snapshots" (cb=57)
00:00:07.688849 
00:00:07.688850 [/Devices/VMMDev/0/LUN#0/] (level 4)
00:00:07.688854   Driver <string>  = "HGCM" (cb=5)
00:00:07.688856 
00:00:07.688857 [/Devices/VMMDev/0/LUN#0/Config/] (level 5)
00:00:07.688862   Object <integer> = 0x00000000046ef510 (74 380 560)
00:00:07.688867 
00:00:07.688868 [/Devices/VMMDev/0/LUN#999/] (level 4)
00:00:07.688872   Driver <string>  = "MainStatus" (cb=11)
00:00:07.688874 
00:00:07.688875 [/Devices/VMMDev/0/LUN#999/Config/] (level 5)
00:00:07.688880   First   <integer> = 0x0000000000000000 (0)
00:00:07.688883   Last    <integer> = 0x0000000000000000 (0)
00:00:07.688886   papLeds <integer> = 0x000000000449c1c8 (71 942 600)
00:00:07.688890 
00:00:07.688892 [/Devices/acpi/] (level 2)
00:00:07.688895 
00:00:07.688896 [/Devices/acpi/0/] (level 3)
00:00:07.688900   PCIBusNo      <integer> = 0x0000000000000000 (0)
00:00:07.688903   PCIDeviceNo   <integer> = 0x0000000000000007 (7)
00:00:07.688905   PCIFunctionNo <integer> = 0x0000000000000000 (0)
00:00:07.688908   Trusted       <integer> = 0x0000000000000001 (1)
00:00:07.688911 
00:00:07.688912 [/Devices/acpi/0/Config/] (level 4)
00:00:07.688916   CpuHotPlug          <integer> = 0x0000000000000000 (0)
00:00:07.688920   FdcEnabled          <integer> = 0x0000000000000000 (0)
00:00:07.688923   HostBusPciAddress   <integer> = 0x0000000000000000 (0)
00:00:07.688926   HpetEnabled         <integer> = 0x0000000000000000 (0)
00:00:07.688929   IOAPIC              <integer> = 0x0000000000000000 (0)
00:00:07.688932   IocPciAddress       <integer> = 0x0000000000010000 (65 536)
00:00:07.688936   NumCPUs             <integer> = 0x0000000000000001 (1)
00:00:07.688939   Parallel0IoPortBase <integer> = 0x0000000000000000 (0)
00:00:07.688942   Parallel0Irq        <integer> = 0x0000000000000000 (0)
00:00:07.688945   Parallel1IoPortBase <integer> = 0x0000000000000000 (0)
00:00:07.688948   Parallel1Irq        <integer> = 0x0000000000000000 (0)
00:00:07.688951   Serial0IoPortBase   <integer> = 0x0000000000000000 (0)
00:00:07.688954   Serial0Irq          <integer> = 0x0000000000000000 (0)
00:00:07.688957   Serial1IoPortBase   <integer> = 0x0000000000000000 (0)
00:00:07.688960   Serial1Irq          <integer> = 0x0000000000000000 (0)
00:00:07.688963   ShowCpu             <integer> = 0x0000000000000000 (0)
00:00:07.688966   ShowRtc             <integer> = 0x0000000000000000 (0)
00:00:07.688969   SmcEnabled          <integer> = 0x0000000000000000 (0)
00:00:07.688972 
00:00:07.688973 [/Devices/acpi/0/LUN#0/] (level 4)
00:00:07.688977   Driver <string>  = "ACPIHost" (cb=9)
00:00:07.688979 
00:00:07.688980 [/Devices/acpi/0/LUN#0/Config/] (level 5)
00:00:07.688985 
00:00:07.688986 [/Devices/ahci/] (level 2)
00:00:07.688989 
00:00:07.688990 [/Devices/ahci/0/] (level 3)
00:00:07.688994   PCIBusNo      <integer> = 0x0000000000000000 (0)
00:00:07.688997   PCIDeviceNo   <integer> = 0x000000000000000d (13)
00:00:07.689000   PCIFunctionNo <integer> = 0x0000000000000000 (0)
00:00:07.689003   Trusted       <integer> = 0x0000000000000001 (1)
00:00:07.689006 
00:00:07.689007 [/Devices/ahci/0/Config/] (level 4)
00:00:07.689011   Bootable  <integer> = 0x0000000000000001 (1)
00:00:07.689014   PortCount <integer> = 0x0000000000000001 (1)
00:00:07.689023 
00:00:07.689024 [/Devices/ahci/0/Config/Port0/] (level 5)
00:00:07.689029   Hotpluggable        <integer> = 0x0000000000000000 (0)
00:00:07.689032   NonRotationalMedium <integer> = 0x0000000000000000 (0)
00:00:07.689035 
00:00:07.689036 [/Devices/ahci/0/LUN#0/] (level 4)
00:00:07.689040   Driver <string>  = "VD" (cb=3)
00:00:07.689043 
00:00:07.689044 [/Devices/ahci/0/LUN#0/Config/] (level 5)
00:00:07.689049   BlockCache <integer> = 0x0000000000000001 (1)
00:00:07.689051   Format     <string>  = "VDI" (cb=4)
00:00:07.689054   Mountable  <integer> = 0x0000000000000000 (0)
00:00:07.689057   Path       <string>  = "C:\Users\caev0\VirtualBox VMs\KitKat480x800x16\KitKat480x800x16-disk1.vdi" (cb=74)
00:00:07.689060   Type       <string>  = "HardDisk" (cb=9)
00:00:07.689063   UseNewIo   <integer> = 0x0000000000000001 (1)
00:00:07.689065 
00:00:07.689066 [/Devices/ahci/0/LUN#999/] (level 4)
00:00:07.689070   Driver <string>  = "MainStatus" (cb=11)
00:00:07.689073 
00:00:07.689074 [/Devices/ahci/0/LUN#999/Config/] (level 5)
00:00:07.689079   DeviceInstance        <string>  = "ahci/0" (cb=7)
00:00:07.689082   First                 <integer> = 0x0000000000000000 (0)
00:00:07.689085   Last                  <integer> = 0x0000000000000000 (0)
00:00:07.689088   pConsole              <integer> = 0x000000000449b9c0 (71 940 544)
00:00:07.689093   papLeds               <integer> = 0x000000000449bdc8 (71 941 576)
00:00:07.689098   pmapMediumAttachments <integer> = 0x000000000449c1e8 (71 942 632)
00:00:07.689102 
00:00:07.689103 [/Devices/apic/] (level 2)
00:00:07.689106 
00:00:07.689107 [/Devices/apic/0/] (level 3)
00:00:07.689111   Trusted <integer> = 0x0000000000000001 (1)
00:00:07.689114 
00:00:07.689115 [/Devices/apic/0/Config/] (level 4)
00:00:07.689119   IOAPIC  <integer> = 0x0000000000000000 (0)
00:00:07.689122   Mode    <integer> = 0x0000000000000003 (3)
00:00:07.689125   NumCPUs <integer> = 0x0000000000000001 (1)
00:00:07.689127 
00:00:07.689128 [/Devices/e1000/] (level 2)
00:00:07.689132 
00:00:07.689133 [/Devices/e1000/0/] (level 3)
00:00:07.689136   PCIBusNo      <integer> = 0x0000000000000000 (0)
00:00:07.689139   PCIDeviceNo   <integer> = 0x0000000000000003 (3)
00:00:07.689142   PCIFunctionNo <integer> = 0x0000000000000000 (0)
00:00:07.689145   Trusted       <integer> = 0x0000000000000001 (1)
00:00:07.689148 
00:00:07.689149 [/Devices/e1000/0/Config/] (level 4)
00:00:07.689153   AdapterType    <integer> = 0x0000000000000000 (0)
00:00:07.689156   CableConnected <integer> = 0x0000000000000001 (1)
00:00:07.689158   LineSpeed      <integer> = 0x0000000000000000 (0)
00:00:07.689161   MAC            <bytes>   = "08 00 27 f7 e8 ad" (cb=6)
00:00:07.689167 
00:00:07.689168 [/Devices/e1000/0/LUN#0/] (level 4)
00:00:07.689172   Driver <string>  = "NAT" (cb=4)
00:00:07.689175 
00:00:07.689176 [/Devices/e1000/0/LUN#0/Config/] (level 5)
00:00:07.689181   AliasMode       <integer> = 0x0000000000000000 (0)
00:00:07.689184   BootFile        <string>  = "KitKat480x800x16.pxe" (cb=21)
00:00:07.689187   DNSProxy        <integer> = 0x0000000000000000 (0)
00:00:07.689190   Network         <string>  = "10.0.2.0/24" (cb=12)
00:00:07.689193   PassDomain      <integer> = 0x0000000000000001 (1)
00:00:07.689196   TFTPPrefix      <string>  = "C:\Users\caev0\.VirtualBox\TFTP" (cb=32)
00:00:07.689199   UseHostResolver <integer> = 0x0000000000000000 (0)
00:00:07.689202 
00:00:07.689203 [/Devices/e1000/0/LUN#999/] (level 4)
00:00:07.689207   Driver <string>  = "MainStatus" (cb=11)
00:00:07.689209 
00:00:07.689210 [/Devices/e1000/0/LUN#999/Config/] (level 5)
00:00:07.689215   First   <integer> = 0x0000000000000000 (0)
00:00:07.689218   Last    <integer> = 0x0000000000000000 (0)
00:00:07.689220   papLeds <integer> = 0x000000000449c0a8 (71 942 312)
00:00:07.689224 
00:00:07.689225 [/Devices/i8254/] (level 2)
00:00:07.689228 
00:00:07.689229 [/Devices/i8254/0/] (level 3)
00:00:07.689233 
00:00:07.689234 [/Devices/i8254/0/Config/] (level 4)
00:00:07.689238 
00:00:07.689239 [/Devices/i8259/] (level 2)
00:00:07.689242 
00:00:07.689243 [/Devices/i8259/0/] (level 3)
00:00:07.689247   Trusted <integer> = 0x0000000000000001 (1)
00:00:07.689249 
00:00:07.689250 [/Devices/i8259/0/Config/] (level 4)
00:00:07.689254 
00:00:07.689255 [/Devices/ichac97/] (level 2)
00:00:07.689258 
00:00:07.689259 [/Devices/ichac97/0/] (level 3)
00:00:07.689263   PCIBusNo      <integer> = 0x0000000000000000 (0)
00:00:07.689266   PCIDeviceNo   <integer> = 0x0000000000000005 (5)
00:00:07.689267   PCIFunctionNo <integer> = 0x0000000000000000 (0)
00:00:07.689267   Trusted       <integer> = 0x0000000000000001 (1)
00:00:07.689267 
00:00:07.689267 [/Devices/ichac97/0/AudioConfig/] (level 4)
00:00:07.689267 
00:00:07.689267 [/Devices/ichac97/0/Config/] (level 4)
00:00:07.689267   Codec <string>  = "AD1980" (cb=7)
00:00:07.689267 
00:00:07.689267 [/Devices/ichac97/0/LUN#0/] (level 4)
00:00:07.689267   Driver <string>  = "AUDIO" (cb=6)
00:00:07.689267 
00:00:07.689267 [/Devices/ichac97/0/LUN#0/AttachedDriver/] (level 5)
00:00:07.689267   Driver <string>  = "DSoundAudio" (cb=12)
00:00:07.689267 
00:00:07.689267 [/Devices/ichac97/0/LUN#0/AttachedDriver/Config/] (level 6)
00:00:07.689267   StreamName <string>  = "KitKat480x800x16" (cb=17)
00:00:07.689267 
00:00:07.689267 [/Devices/ichac97/0/LUN#0/Config/] (level 5)
00:00:07.689267 
00:00:07.689267 [/Devices/ichac97/0/LUN#1/] (level 4)
00:00:07.689267   Driver <string>  = "AUDIO" (cb=6)
00:00:07.689267 
00:00:07.689267 [/Devices/ichac97/0/LUN#1/AttachedDriver/] (level 5)
00:00:07.689267   Driver <string>  = "AudioVRDE" (cb=10)
00:00:07.689267 
00:00:07.689267 [/Devices/ichac97/0/LUN#1/AttachedDriver/Config/] (level 6)
00:00:07.689267   AudioDriver      <string>  = "AudioVRDE" (cb=10)
00:00:07.689267   Object           <integer> = 0x0000000004436040 (71 524 416)
00:00:07.689267   ObjectVRDPServer <integer> = 0x000000000449e590 (71 951 760)
00:00:07.689267   StreamName       <string>  = "KitKat480x800x16" (cb=17)
00:00:07.689267 
00:00:07.689267 [/Devices/mc146818/] (level 2)
00:00:07.689267 
00:00:07.689267 [/Devices/mc146818/0/] (level 3)
00:00:07.689267 
00:00:07.689267 [/Devices/mc146818/0/Config/] (level 4)
00:00:07.689267   UseUTC <integer> = 0x0000000000000001 (1)
00:00:07.689267 
00:00:07.689267 [/Devices/parallel/] (level 2)
00:00:07.689267 
00:00:07.689267 [/Devices/pcarch/] (level 2)
00:00:07.689267 
00:00:07.689267 [/Devices/pcarch/0/] (level 3)
00:00:07.689267   Trusted <integer> = 0x0000000000000001 (1)
00:00:07.689267 
00:00:07.689267 [/Devices/pcarch/0/Config/] (level 4)
00:00:07.689267 
00:00:07.689267 [/Devices/pcbios/] (level 2)
00:00:07.689267 
00:00:07.689267 [/Devices/pcbios/0/] (level 3)
00:00:07.689267   Trusted <integer> = 0x0000000000000001 (1)
00:00:07.689267 
00:00:07.689267 [/Devices/pcbios/0/Config/] (level 4)
00:00:07.689267   APIC               <integer> = 0x0000000000000001 (1)
00:00:07.689267   BootDevice0        <string>  = "FLOPPY" (cb=7)
00:00:07.689267   BootDevice1        <string>  = "DVD" (cb=4)
00:00:07.689267   BootDevice2        <string>  = "IDE" (cb=4)
00:00:07.689267   BootDevice3        <string>  = "NONE" (cb=5)
00:00:07.689267   FloppyDevice       <string>  = "i82078" (cb=7)
00:00:07.689267   HardDiskDevice     <string>  = "piix3ide" (cb=9)
00:00:07.689267   IOAPIC             <integer> = 0x0000000000000000 (0)
00:00:07.689267   McfgBase           <integer> = 0x0000000000000000 (0)
00:00:07.689267   McfgLength         <integer> = 0x0000000000000000 (0)
00:00:07.689267   NumCPUs            <integer> = 0x0000000000000001 (1)
00:00:07.689267   PXEDebug           <integer> = 0x0000000000000000 (0)
00:00:07.689267   SataHardDiskDevice <string>  = "ahci" (cb=5)
00:00:07.689267   SataLUN1           <integer> = 0x0000000000000000 (0)
00:00:07.689267   UUID               <bytes>   = "2b b1 3c 87 ff d4 16 41 b8 16 94 d1 62 66 07 84" (cb=16)
00:00:07.689267 
00:00:07.689267 [/Devices/pcbios/0/Config/NetBoot/] (level 5)
00:00:07.689267 
00:00:07.689267 [/Devices/pcbios/0/Config/NetBoot/0/] (level 6)
00:00:07.689267   NIC           <integer> = 0x0000000000000000 (0)
00:00:07.689267   PCIBusNo      <integer> = 0x0000000000000000 (0)
00:00:07.689267   PCIDeviceNo   <integer> = 0x0000000000000003 (3)
00:00:07.689267   PCIFunctionNo <integer> = 0x0000000000000000 (0)
00:00:07.689267 
00:00:07.689267 [/Devices/pci/] (level 2)
00:00:07.689267 
00:00:07.689267 [/Devices/pci/0/] (level 3)
00:00:07.689267   Trusted <integer> = 0x0000000000000001 (1)
00:00:07.689267 
00:00:07.689267 [/Devices/pci/0/Config/] (level 4)
00:00:07.689267   IOAPIC <integer> = 0x0000000000000000 (0)
00:00:07.689267 
00:00:07.689268 [/Devices/pckbd/] (level 2)
00:00:07.689268 
00:00:07.689268 [/Devices/pckbd/0/] (level 3)
00:00:07.689268   Trusted <integer> = 0x0000000000000001 (1)
00:00:07.689268 
00:00:07.689268 [/Devices/pckbd/0/Config/] (level 4)
00:00:07.689528 
00:00:07.689529 [/Devices/pckbd/0/LUN#0/] (level 4)
00:00:07.689533   Driver <string>  = "KeyboardQueue" (cb=14)
00:00:07.689536 
00:00:07.689537 [/Devices/pckbd/0/LUN#0/AttachedDriver/] (level 5)
00:00:07.689542   Driver <string>  = "MainKeyboard" (cb=13)
00:00:07.689544 
00:00:07.689545 [/Devices/pckbd/0/LUN#0/AttachedDriver/Config/] (level 6)
00:00:07.689550   Object <integer> = 0x0000000002412d80 (37 825 920)
00:00:07.689554 
00:00:07.689555 [/Devices/pckbd/0/LUN#0/Config/] (level 5)
00:00:07.689559   QueueSize <integer> = 0x0000000000000040 (64)
00:00:07.689563 
00:00:07.689564 [/Devices/pckbd/0/LUN#1/] (level 4)
00:00:07.689568   Driver <string>  = "MouseQueue" (cb=11)
00:00:07.689571 
00:00:07.689572 [/Devices/pckbd/0/LUN#1/AttachedDriver/] (level 5)
00:00:07.689576   Driver <string>  = "MainMouse" (cb=10)
00:00:07.689579 
00:00:07.689580 [/Devices/pckbd/0/LUN#1/AttachedDriver/Config/] (level 6)
00:00:07.689585   Object <integer> = 0x0000000002425a10 (37 902 864)
00:00:07.689588 
00:00:07.689590 [/Devices/pckbd/0/LUN#1/Config/] (level 5)
00:00:07.689594   QueueSize <integer> = 0x0000000000000080 (128)
00:00:07.689597 
00:00:07.689599 [/Devices/pcnet/] (level 2)
00:00:07.689602 
00:00:07.689603 [/Devices/piix3ide/] (level 2)
00:00:07.689606 
00:00:07.689607 [/Devices/piix3ide/0/] (level 3)
00:00:07.689611   PCIBusNo      <integer> = 0x0000000000000000 (0)
00:00:07.689614   PCIDeviceNo   <integer> = 0x0000000000000001 (1)
00:00:07.689617   PCIFunctionNo <integer> = 0x0000000000000001 (1)
00:00:07.689620   Trusted       <integer> = 0x0000000000000001 (1)
00:00:07.689623 
00:00:07.689624 [/Devices/piix3ide/0/Config/] (level 4)
00:00:07.689628   Type <string>  = "PIIX4" (cb=6)
00:00:07.689630 
00:00:07.689631 [/Devices/piix3ide/0/Config/SecondaryMaster/] (level 5)
00:00:07.689636   NonRotationalMedium <integer> = 0x0000000000000000 (0)
00:00:07.689639 
00:00:07.689640 [/Devices/piix3ide/0/LUN#2/] (level 4)
00:00:07.689645   Driver <string>  = "VD" (cb=3)
00:00:07.689647 
00:00:07.689648 [/Devices/piix3ide/0/LUN#2/Config/] (level 5)
00:00:07.689653   EmptyDrive <integer> = 0x0000000000000001 (1)
00:00:07.689655   Mountable  <integer> = 0x0000000000000001 (1)
00:00:07.689658   Type       <string>  = "DVD" (cb=4)
00:00:07.689661 
00:00:07.689662 [/Devices/piix3ide/0/LUN#999/] (level 4)
00:00:07.689666   Driver <string>  = "MainStatus" (cb=11)
00:00:07.689668 
00:00:07.689669 [/Devices/piix3ide/0/LUN#999/Config/] (level 5)
00:00:07.689674   DeviceInstance        <string>  = "piix3ide/0" (cb=11)
00:00:07.689677   First                 <integer> = 0x0000000000000000 (0)
00:00:07.689681   Last                  <integer> = 0x0000000000000003 (3)
00:00:07.689684   pConsole              <integer> = 0x000000000449b9c0 (71 940 544)
00:00:07.689689   papLeds               <integer> = 0x000000000449bda8 (71 941 544)
00:00:07.689693   pmapMediumAttachments <integer> = 0x000000000449c1e8 (71 942 632)
00:00:07.689697 
00:00:07.689698 [/Devices/serial/] (level 2)
00:00:07.689701 
00:00:07.689702 [/Devices/usb-ohci/] (level 2)
00:00:07.689705 
00:00:07.689706 [/Devices/usb-ohci/0/] (level 3)
00:00:07.689710   PCIBusNo      <integer> = 0x0000000000000000 (0)
00:00:07.689713   PCIDeviceNo   <integer> = 0x0000000000000006 (6)
00:00:07.689716   PCIFunctionNo <integer> = 0x0000000000000000 (0)
00:00:07.689718   Trusted       <integer> = 0x0000000000000001 (1)
00:00:07.689721 
00:00:07.689722 [/Devices/usb-ohci/0/Config/] (level 4)
00:00:07.689726 
00:00:07.689727 [/Devices/usb-ohci/0/LUN#0/] (level 4)
00:00:07.689731   Driver <string>  = "VUSBRootHub" (cb=12)
00:00:07.689734 
00:00:07.689735 [/Devices/usb-ohci/0/LUN#0/Config/] (level 5)
00:00:07.689739 
00:00:07.689740 [/Devices/usb-ohci/0/LUN#999/] (level 4)
00:00:07.689744   Driver <string>  = "MainStatus" (cb=11)
00:00:07.689746 
00:00:07.689747 [/Devices/usb-ohci/0/LUN#999/Config/] (level 5)
00:00:07.689752   First   <integer> = 0x0000000000000000 (0)
00:00:07.689755   Last    <integer> = 0x0000000000000000 (0)
00:00:07.689757   papLeds <integer> = 0x000000000449c1d0 (71 942 608)
00:00:07.689761 
00:00:07.689762 [/Devices/vga/] (level 2)
00:00:07.689765 
00:00:07.689766 [/Devices/vga/0/] (level 3)
00:00:07.689770   PCIBusNo      <integer> = 0x0000000000000000 (0)
00:00:07.689773   PCIDeviceNo   <integer> = 0x0000000000000002 (2)
00:00:07.689775   PCIFunctionNo <integer> = 0x0000000000000000 (0)
00:00:07.689778   Trusted       <integer> = 0x0000000000000001 (1)
00:00:07.689781 
00:00:07.689782 [/Devices/vga/0/Config/] (level 4)
00:00:07.689786   CustomVideoMode1 <string>  = "480x800x16" (cb=11)
00:00:07.689789   CustomVideoModes <integer> = 0x0000000000000001 (1)
00:00:07.689791   FadeIn           <integer> = 0x0000000000000001 (1)
00:00:07.689794   FadeOut          <integer> = 0x0000000000000001 (1)
00:00:07.689797   HeightReduction  <integer> = 0x0000000000000000 (0)
00:00:07.689800   LogoFile         <string>  = "" (cb=1)
00:00:07.689803   LogoTime         <integer> = 0x0000000000000000 (0)
00:00:07.689806   MonitorCount     <integer> = 0x0000000000000001 (1)
00:00:07.689808   ShowBootMenu     <integer> = 0x0000000000000002 (2)
00:00:07.689811   VRamSize         <integer> = 0x0000000001000000 (16 777 216, 16 MB)
00:00:07.689817 
00:00:07.689818 [/Devices/vga/0/LUN#0/] (level 4)
00:00:07.689822   Driver <string>  = "MainDisplay" (cb=12)
00:00:07.689824 
00:00:07.689825 [/Devices/vga/0/LUN#0/Config/] (level 5)
00:00:07.689829   Object <integer> = 0x00000000044506c0 (71 632 576)
00:00:07.689833 
00:00:07.689834 [/Devices/vga/0/LUN#999/] (level 4)
00:00:07.689838   Driver <string>  = "MainStatus" (cb=11)
00:00:07.689840 
00:00:07.689841 [/Devices/vga/0/LUN#999/Config/] (level 5)
00:00:07.689846   First   <integer> = 0x0000000000000000 (0)
00:00:07.689848   Last    <integer> = 0x0000000000000000 (0)
00:00:07.689851   papLeds <integer> = 0x000000000449c1e0 (71 942 624)
00:00:07.689855 
00:00:07.689856 [/Devices/virtio-net/] (level 2)
00:00:07.689859 
00:00:07.689860 [/EM/] (level 1)
00:00:07.689863   TripleFaultReset <integer> = 0x0000000000000000 (0)
00:00:07.689866 
00:00:07.689867 [/GIM/] (level 1)
00:00:07.689871   Provider <string>  = "KVM" (cb=4)
00:00:07.689873 
00:00:07.689874 [/HM/] (level 1)
00:00:07.689878   64bitEnabled       <integer> = 0x0000000000000000 (0)
00:00:07.689881   EnableLargePages   <integer> = 0x0000000000000001 (1)
00:00:07.689884   EnableNestedPaging <integer> = 0x0000000000000001 (1)
00:00:07.689886   EnableUX           <integer> = 0x0000000000000001 (1)
00:00:07.689889   EnableVPID         <integer> = 0x0000000000000001 (1)
00:00:07.689893   Exclusive          <integer> = 0x0000000000000000 (0)
00:00:07.689896   HMForced           <integer> = 0x0000000000000000 (0)
00:00:07.689899 
00:00:07.689900 [/MM/] (level 1)
00:00:07.689903   CanUseLargerHeap <integer> = 0x0000000000000000 (0)
00:00:07.689905 
00:00:07.689906 [/PDM/] (level 1)
00:00:07.689909 
00:00:07.689910 [/PDM/AsyncCompletion/] (level 2)
00:00:07.689914 
00:00:07.689915 [/PDM/AsyncCompletion/File/] (level 3)
00:00:07.689918 
00:00:07.689920 [/PDM/AsyncCompletion/File/BwGroups/] (level 4)
00:00:07.689924 
00:00:07.689925 [/PDM/BlkCache/] (level 2)
00:00:07.689928   CacheSize <integer> = 0x0000000000500000 (5 242 880, 5 MB)
00:00:07.689933 
00:00:07.689934 [/PDM/Devices/] (level 2)
00:00:07.689937 
00:00:07.689938 [/PDM/Drivers/] (level 2)
00:00:07.689941 
00:00:07.689942 [/PDM/Drivers/VBoxC/] (level 3)
00:00:07.689946   Path <string>  = "VBoxC" (cb=6)
00:00:07.689948 
00:00:07.689949 [/PDM/NetworkShaper/] (level 2)
00:00:07.689953 
00:00:07.689954 [/PDM/NetworkShaper/BwGroups/] (level 3)
00:00:07.689958 
00:00:07.689959 [/TM/] (level 1)
00:00:07.689962   UTCOffset <integer> = 0x0000000000000000 (0)
00:00:07.689964 
00:00:07.689965 [/USB/] (level 1)
00:00:07.689968 
00:00:07.689969 [/USB/HidMouse/] (level 2)
00:00:07.689972 
00:00:07.689973 [/USB/HidMouse/0/] (level 3)
00:00:07.689977 
00:00:07.689978 [/USB/HidMouse/0/Config/] (level 4)
00:00:07.689982   Mode <string>  = "absolute" (cb=9)
00:00:07.689984 
00:00:07.689985 [/USB/HidMouse/0/LUN#0/] (level 4)
00:00:07.689989   Driver <string>  = "MouseQueue" (cb=11)
00:00:07.689991 
00:00:07.689992 [/USB/HidMouse/0/LUN#0/AttachedDriver/] (level 5)
00:00:07.689997   Driver <string>  = "MainMouse" (cb=10)
00:00:07.689999 
00:00:07.690000 [/USB/HidMouse/0/LUN#0/AttachedDriver/Config/] (level 6)
00:00:07.690005   Object <integer> = 0x0000000002425a10 (37 902 864)
00:00:07.690009 
00:00:07.690010 [/USB/HidMouse/0/LUN#0/Config/] (level 5)
00:00:07.690014   QueueSize <integer> = 0x0000000000000080 (128)
00:00:07.690021 
00:00:07.690023 [/USB/USBProxy/] (level 2)
00:00:07.690026 
00:00:07.690027 [/USB/USBProxy/GlobalConfig/] (level 3)
00:00:07.690031 
00:00:07.690032 ********************* End of CFGM dump **********************
00:00:07.690047 VM: fHMEnabled=true  (configured) fRecompileUser=false fRecompileSupervisor=false
00:00:07.690052 VM: fRawRing1Enabled=false CSAM=true  PATM=true 
00:00:07.690381 HM: HMR3Init: VT-x w/ nested paging and unrestricted guest execution hw support
00:00:07.690549 MM: cbHyperHeap=0x100000 (1048576)
00:00:07.693463 CPUM: fXStateHostMask=0x7; initial: 0x7; host XCR0=0x7
00:00:07.696089 CPUM: Matched host CPU INTEL 0x6/0x2a/0x7 Intel_Core7_SandyBridge with CPU DB entry 'Intel Core i7-2635QM' (INTEL 0x6/0x2a/0x7 Intel_Core7_SandyBridge)
00:00:07.696342 CPUM: VCPU  0: Cached APIC base MSR = 0x0
00:00:07.698673 PGM: HCPhysInterPD=00000000ca457000 HCPhysInterPaePDPT=00000000ca453000 HCPhysInterPaePML4=00000000ca451000
00:00:07.698710 PGM: apInterPTs={00000000ca455000,00000000ca454000} apInterPaePTs={0000000106d1d000,00000001a769e000} apInterPaePDs={00000000c379f000,000000002e720000,0000000054721000,00000000a1e22000} pInterPaePDPT64=00000000ca452000
00:00:07.698737 PGM: Host paging mode: AMD64+PGE+NX
00:00:07.698762 PGM: PGMPool: cMaxPages=560 (u64MaxPages=545)
00:00:07.698778 PGM: pgmR3PoolInit: cMaxPages=0x230 cMaxUsers=0x460 cMaxPhysExts=0x460 fCacheEnable=true 
00:00:07.730319 TM: GIP - u32Mode=3 (Invariant) u32UpdateHz=93 u32UpdateIntervalNS=10752500 enmUseTscDelta=2 (Pratically Zero) fGetGipCpu=0xb cCpus=8
00:00:07.730380 TM: GIP - u64CpuHz=2 195 015 593 (0x82d547a9)  SUPGetCpuHzFromGip => 2 195 015 593
00:00:07.730402 TM: GIP - CPU: iCpuSet=0x0 idCpu=0x0 idApic=0x0 iGipCpu=0x7 i64TSCDelta=0 enmState=3 u64CpuHz=2195015440(*) cErrors=0
00:00:07.730421 TM: GIP - CPU: iCpuSet=0x1 idCpu=0x1 idApic=0x1 iGipCpu=0x4 i64TSCDelta=0 enmState=3 u64CpuHz=2195014844(*) cErrors=0
00:00:07.730437 TM: GIP - CPU: iCpuSet=0x2 idCpu=0x2 idApic=0x2 iGipCpu=0x2 i64TSCDelta=0 enmState=3 u64CpuHz=2195009527(*) cErrors=0
00:00:07.730453 TM: GIP - CPU: iCpuSet=0x3 idCpu=0x3 idApic=0x3 iGipCpu=0x0 i64TSCDelta=0 enmState=3 u64CpuHz=2195015593(*) cErrors=0
00:00:07.730468 TM: GIP - CPU: iCpuSet=0x4 idCpu=0x4 idApic=0x4 iGipCpu=0x5 i64TSCDelta=0 enmState=3 u64CpuHz=2195015106(*) cErrors=0
00:00:07.730484 TM: GIP - CPU: iCpuSet=0x5 idCpu=0x5 idApic=0x5 iGipCpu=0x3 i64TSCDelta=0 enmState=3 u64CpuHz=2195014388(*) cErrors=0
00:00:07.730499 TM: GIP - CPU: iCpuSet=0x6 idCpu=0x6 idApic=0x6 iGipCpu=0x1 i64TSCDelta=0 enmState=3 u64CpuHz=2195012435(*) cErrors=0
00:00:07.730707 TM: GIP - CPU: iCpuSet=0x7 idCpu=0x7 idApic=0x7 iGipCpu=0x6 i64TSCDelta=0 enmState=3 u64CpuHz=2195015488(*) cErrors=0
00:00:07.730894 TM: cTSCTicksPerSecond=2 195 015 593 (0x82d547a9) enmTSCMode=3 (Dynamic)
00:00:07.730902 TM: TSCTiedToExecution=false TSCNotTiedToHalt=false
00:00:07.732076 VMM: CoreCode: R3=000000000c020000 R0=ffffb181ce6c8000 RC=a055b000 Phys=00000000ca299000 cb=0x1000
00:00:07.732815 IEM: TargetCpu=CURRENT, Microarch=Intel_Core7_SandyBridge
00:00:07.733100 GIM: Using provider 'KVM' (Implementation version: 0)
00:00:07.733134 CPUM: SetGuestCpuIdFeature: Enabled Hypervisor Present bit
00:00:07.733352 AIOMgr: Default manager type is 'Async'
00:00:07.733375 AIOMgr: Default file backend is 'NonBuffered'
00:00:07.733757 BlkCache: Cache successfully initialized. Cache size is 5242880 bytes
00:00:07.733782 BlkCache: Cache commit interval is 10000 ms
00:00:07.733795 BlkCache: Cache commit threshold is 2621440 bytes
00:00:08.732967 PcBios: [SMP] BIOS with 1 CPUs
00:00:08.733047 PcBios: Using the 386+ BIOS image.
00:00:08.736956 PcBios: fCheckShutdownStatusForSoftReset=true   fClearShutdownStatusOnHardReset=true 
00:00:08.776427 SUP: Loaded VBoxDDR0.r0 (C:\Program Files\Oracle\VirtualBox\VBoxDDR0.r0) at 0xfffff809c6760000 - ModuleInit at 0000000000000000 and ModuleTerm at 0000000000000000 using the native ring-0 loader
00:00:08.776472 SUP: windbg> .reload /f C:\Program Files\Oracle\VirtualBox\VBoxDDR0.r0=0xfffff809c6760000
00:00:08.778466 CPUM: SetGuestCpuIdFeature: Enabled xAPIC
00:00:08.778495 CPUM: SetGuestCpuIdFeature: Enabled x2APIC
00:00:08.779456 PIT: mode=3 count=0x10000 (65536) - 18.20 Hz (ch=0)
00:00:08.814245 Shared Folders service loaded
00:00:08.826965 VGA: Using the 386+ BIOS image.
00:00:08.831368 DrvVD: Flushes will be ignored
00:00:08.831404 DrvVD: Async flushes will be passed to the disk
00:00:08.832338 VD: VDInit finished
00:00:08.837282 AIOMgr: Endpoint for file 'C:\Users\caev0\VirtualBox VMs\KitKat480x800x16\KitKat480x800x16-disk1.vdi' (flags 000c0723) created successfully
00:00:08.839128 VD: Opening the disk took 7677707 ns
00:00:08.839247 AHCI: LUN#0: disk, PCHS=12483/16/63, total number of sectors 12582912
00:00:08.839281 AHCI: LUN#0: using async I/O
00:00:08.839814 AHCI#0: Reset the HBA
00:00:08.840465 PIIX3 ATA: LUN#0: no unit
00:00:08.840497 PIIX3 ATA: LUN#1: no unit
00:00:08.840660 DrvVD: Flushes will be ignored
00:00:08.840694 DrvVD: Async flushes will be passed to the disk
00:00:08.841036 PIIX3 ATA: LUN#2: CD/DVD, total number of sectors 0, passthrough disabled
00:00:08.841076 PIIX3 ATA: LUN#3: no unit
00:00:08.841141 PIIX3 ATA: Ctl#0: finished processing RESET
00:00:08.841207 PIIX3 ATA: Ctl#1: finished processing RESET
00:00:08.841393 E1000#0 Chip=82540EM LinkUpDelay=5000ms EthernetCRC=on GSO=enabled Itr=enabled ItrRx=enabled R0=enabled GC=enabled
00:00:08.892185 NAT: Guest address guess set to 10.0.2.15 by initialization
00:00:08.908101 NAT: DNS#0: 190.157.8.33
00:00:08.908151 NAT: DNS#1: 190.157.8.1
00:00:08.909696 Audio: Initializing DirectSound audio driver
00:00:08.909746 Audio: Using VBox 5.0.x audio code!
00:00:09.349834 DSound: Output: GUID: {DB401B1C-1A4E-44AC-8178-C8FD606F4104} [Altavoces (Dispositivo de High Definition Audio)] (Module: {0.0.0.00000000}.{db401b1c-1a4e-44ac-8178-c8fd606f4104})
00:00:09.803175 DSound: Input: GUID: {77BCE3A4-5646-490E-89CD-38839FC22A3A} [Micrófono (Dispositivo de High Definition Audio)] (Module: {0.0.1.00000000}.{77bce3a4-5646-490e-89cd-38839fc22a3a})
00:00:09.803229 DSound: Found 1 host playback devices
00:00:09.803246 DSound: Found 1 host capturing devices
00:00:09.805094 Audio: Host audio backend supports 1 output streams and 1 input streams at once
00:00:09.805182 Audio: Initializing VRDE driver
00:00:09.805206 Audio: Using VBox 5.0.x audio code!
00:00:09.805230 Audio: Host audio backend supports 1 output streams and 2 input streams at once
00:00:09.805265 AC97: Reset
00:00:09.806728 DSound: Guest "Line In" is using host device with GUID: {Default device}
00:00:09.845757 Audio: Skipping to create input stream "[LUN#0] ac97.mc", as the host audio backend reached its maximum of concurrent audio input streams
00:00:09.870132 VUSB: Attached 'HidMouse' to port 1
00:00:09.870343 PGM: The CPU physical address width is 36 bits
00:00:09.870369 PGM: PGMR3InitFinalize: 4 MB PSE mask 0000000fffffffff
00:00:09.870968 TM: TMR3InitFinalize: fTSCModeSwitchAllowed=true 
00:00:09.952702 VMM: Thread-context hooks unavailable
00:00:09.956297 HM: Using VT-x implementation 2.0
00:00:09.956300 HM: Host CR4                        = 0x406f8
00:00:09.956306 HM: Host EFER                       = 0xd01
00:00:09.956308 HM: MSR_IA32_SMM_MONITOR_CTL        = 0x0
00:00:09.956311 HM: MSR_IA32_FEATURE_CONTROL        = 0x5
00:00:09.956313 HM: MSR_IA32_VMX_BASIC_INFO         = 0xda040000000010
00:00:09.956316 HM:   VMCS id                         = 0x10
00:00:09.956319 HM:   VMCS size                       = 1024 bytes
00:00:09.956322 HM:   VMCS physical address limit     = None
00:00:09.956324 HM:   VMCS memory type                = 0x6
00:00:09.956326 HM:   Dual-monitor treatment support  = true 
00:00:09.956329 HM:   OUTS & INS instruction-info     = true 
00:00:09.956331 HM: Max resume loops                = 1024
00:00:09.956333 HM: MSR_IA32_VMX_PINBASED_CTLS      = 0x7f00000016
00:00:09.956336 HM:   EXT_INT_EXIT
00:00:09.956338 HM:   NMI_EXIT
00:00:09.956339 HM:   VIRTUAL_NMI
00:00:09.956341 HM:   PREEMPT_TIMER
00:00:09.956342 HM:   POSTED_INTR (must be cleared)
00:00:09.956344 HM: MSR_IA32_VMX_PROCBASED_CTLS     = 0xfff9fffe0401e172
00:00:09.956348 HM:   INT_WINDOW_EXIT
00:00:09.956349 HM:   USE_TSC_OFFSETTING
00:00:09.956351 HM:   HLT_EXIT
00:00:09.956352 HM:   INVLPG_EXIT
00:00:09.956353 HM:   MWAIT_EXIT
00:00:09.956355 HM:   RDPMC_EXIT
00:00:09.956356 HM:   RDTSC_EXIT
00:00:09.956358 HM:   CR3_LOAD_EXIT (must be set)
00:00:09.956359 HM:   CR3_STORE_EXIT (must be set)
00:00:09.956361 HM:   CR8_LOAD_EXIT
00:00:09.956362 HM:   CR8_STORE_EXIT
00:00:09.956363 HM:   USE_TPR_SHADOW
00:00:09.956365 HM:   NMI_WINDOW_EXIT
00:00:09.956366 HM:   MOV_DR_EXIT
00:00:09.956368 HM:   UNCOND_IO_EXIT
00:00:09.956369 HM:   USE_IO_BITMAPS
00:00:09.956370 HM:   MONITOR_TRAP_FLAG
00:00:09.956372 HM:   USE_MSR_BITMAPS
00:00:09.956373 HM:   MONITOR_EXIT
00:00:09.956375 HM:   PAUSE_EXIT
00:00:09.956380 HM:   USE_SECONDARY_EXEC_CTRL
00:00:09.956382 HM: MSR_IA32_VMX_PROCBASED_CTLS2    = 0xff00000000
00:00:09.956385 HM:   VIRT_APIC
00:00:09.956387 HM:   EPT
00:00:09.956388 HM:   DESCRIPTOR_TABLE_EXIT
00:00:09.956390 HM:   RDTSCP
00:00:09.956391 HM:   VIRT_X2APIC
00:00:09.956392 HM:   VPID
00:00:09.956398 HM:   WBINVD_EXIT
00:00:09.956399 HM:   UNRESTRICTED_GUEST
00:00:09.956401 HM:   APIC_REG_VIRT (must be cleared)
00:00:09.956402 HM:   VIRT_INTR_DELIVERY (must be cleared)
00:00:09.956404 HM:   PAUSE_LOOP_EXIT (must be cleared)
00:00:09.956405 HM:   RDRAND_EXIT (must be cleared)
00:00:09.956407 HM:   INVPCID (must be cleared)
00:00:09.956408 HM:   VMFUNC (must be cleared)
00:00:09.956410 HM:   VMCS_SHADOWING (must be cleared)
00:00:09.956411 HM:   ENCLS_EXIT (must be cleared)
00:00:09.956413 HM:   RDSEED_EXIT (must be cleared)
00:00:09.956414 HM:   PML (must be cleared)
00:00:09.956416 HM:   EPT_VE (must be cleared)
00:00:09.956417 HM:   CONCEAL_FROM_PT (must be cleared)
00:00:09.956419 HM:   XSAVES_XRSTORS (must be cleared)
00:00:09.956420 HM:   TSC_SCALING (must be cleared)
00:00:09.956422 HM: MSR_IA32_VMX_ENTRY_CTLS         = 0xffff000011ff
00:00:09.956425 HM:   LOAD_DEBUG (must be set)
00:00:09.956427 HM:   IA32E_MODE_GUEST
00:00:09.956428 HM:   ENTRY_SMM
00:00:09.956430 HM:   DEACTIVATE_DUALMON
00:00:09.956431 HM:   LOAD_GUEST_PERF_MSR
00:00:09.956433 HM:   LOAD_GUEST_PAT_MSR
00:00:09.956434 HM:   LOAD_GUEST_EFER_MSR
00:00:09.956435 HM: MSR_IA32_VMX_EXIT_CTLS          = 0x7fffff00036dff
00:00:09.956439 HM:   SAVE_DEBUG (must be set)
00:00:09.956440 HM:   HOST_ADDR_SPACE_SIZE
00:00:09.956442 HM:   LOAD_PERF_MSR
00:00:09.956443 HM:   ACK_EXT_INT
00:00:09.956445 HM:   SAVE_GUEST_PAT_MSR
00:00:09.956446 HM:   LOAD_HOST_PAT_MSR
00:00:09.956448 HM:   SAVE_GUEST_EFER_MSR
00:00:09.956449 HM:   LOAD_HOST_EFER_MSR
00:00:09.956451 HM:   SAVE_VMX_PREEMPT_TIMER
00:00:09.956452 HM: MSR_IA32_VMX_EPT_VPID_CAP       = 0xf0106114141
00:00:09.956455 HM:   RWX_X_ONLY
00:00:09.956457 HM:   PAGE_WALK_LENGTH_4
00:00:09.956458 HM:   EMT_UC
00:00:09.956459 HM:   EMT_WB
00:00:09.956461 HM:   PDE_2M
00:00:09.956462 HM:   INVEPT
00:00:09.956463 HM:   INVEPT_SINGLE_CONTEXT
00:00:09.956465 HM:   INVEPT_ALL_CONTEXTS
00:00:09.956466 HM:   INVVPID
00:00:09.956468 HM:   INVVPID_INDIV_ADDR
00:00:09.956469 HM:   INVVPID_SINGLE_CONTEXT
00:00:09.956471 HM:   INVVPID_ALL_CONTEXTS
00:00:09.956472 HM:   INVVPID_SINGLE_CONTEXT_RETAIN_GLOBALS
00:00:09.956474 HM: MSR_IA32_VMX_MISC               = 0x100401e5
00:00:09.956476 HM:   PREEMPT_TSC_BIT                 = 0x5
00:00:09.956479 HM:   STORE_EFERLMA_VMEXIT            = true 
00:00:09.956481 HM:   ACTIVITY_STATES                 = 0x7
00:00:09.956483 HM:   CR3_TARGET                      = 0x4
00:00:09.956484 HM:   MAX_MSR                         = 512
00:00:09.956486 HM:   RDMSR_SMBASE_MSR_SMM            = false
00:00:09.956489 HM:   SMM_MONITOR_CTL_B2              = true 
00:00:09.956491 HM:   VMWRITE_VMEXIT_INFO             = false
00:00:09.956493 HM:   MSEG_ID                         = 0x0
00:00:09.956494 HM: MSR_IA32_VMX_CR0_FIXED0         = 0x80000021
00:00:09.956497 HM: MSR_IA32_VMX_CR0_FIXED1         = 0xffffffff
00:00:09.956500 HM: MSR_IA32_VMX_CR4_FIXED0         = 0x2000
00:00:09.956502 HM: MSR_IA32_VMX_CR4_FIXED1         = 0x627ff
00:00:09.956504 HM: MSR_IA32_VMX_VMCS_ENUM          = 0x2a
00:00:09.956507 HM:   HIGHEST_INDEX                   = 0x15
00:00:09.956509 HM: APIC-access page physaddr       = 0x00000000ca298000
00:00:09.956512 HM: VCPU  0: MSR bitmap physaddr    = 0x00000000ca295000
00:00:09.956516 HM: VCPU  0: VMCS physaddr          = 0x00000000ca297000
00:00:09.956520 HM: Guest support: 32-bit only
00:00:09.956537 HM: Supports VMCS EFER fields       = true 
00:00:09.956540 HM: Enabled VMX
00:00:09.956546 CPUM: SetGuestCpuIdFeature: Enabled SYSENTER/EXIT
00:00:09.956548 HM: Enabled nested paging
00:00:09.956550 HM:   EPT flush type                = VMXFLUSHEPT_SINGLE_CONTEXT
00:00:09.956551 HM: Enabled unrestricted guest execution
00:00:09.956553 HM: Enabled large page support
00:00:09.956555 HM: Enabled VPID
00:00:09.956556 HM:   VPID flush type               = VMXFLUSHVPID_SINGLE_CONTEXT
00:00:09.956558 HM: Enabled VMX-preemption timer (cPreemptTimerShift=5)
00:00:09.956561 HM: VT-x/AMD-V init method: LOCAL
00:00:09.956577 CPUM: VCPU  0: Cached APIC base MSR = 0xfee00900
00:00:09.956788 VMM: fUsePeriodicPreemptionTimers=false
00:00:09.956965 CPUM: Logical host processors: 8 present, 8 max, 8 online, online mask: 00000000000000ff
00:00:09.956972 CPUM: Physical host cores: 4
00:00:09.956974 ************************* CPUID dump ************************
00:00:09.956992          Raw Standard CPUID Leaves
00:00:09.956993      Leaf/sub-leaf  eax      ebx      ecx      edx
00:00:09.956999 Gst: 00000000/0000  0000000d 756e6547 6c65746e 49656e69
00:00:09.957005 Hst:                0000000d 756e6547 6c65746e 49656e69
00:00:09.957010 Gst: 00000001/0000  000206a7 00000800 96b8220b 078bfbbf
00:00:09.957014 Hst:                000206a7 00100800 1fbae3bf bfebfbff
00:00:09.957019 Gst: 00000002/0000  76035a01 00f0b2ff 00000000 00ca0000
00:00:09.957023 Hst:                76035a01 00f0b2ff 00000000 00ca0000
00:00:09.957027 Gst: 00000003/0000  00000000 00000000 00000000 00000000
00:00:09.957030 Hst:                00000000 00000000 00000000 00000000
00:00:09.957033 Gst: 00000004/0000  00000121 01c0003f 0000003f 00000000
00:00:09.957037 Hst:                1c004121 01c0003f 0000003f 00000000
00:00:09.957041 Gst: 00000004/0001  00000122 01c0003f 0000003f 00000000
00:00:09.957045 Hst:                1c004122 01c0003f 0000003f 00000000
00:00:09.957049 Gst: 00000004/0002  00000143 01c0003f 000001ff 00000000
00:00:09.957052 Hst:                1c004143 01c0003f 000001ff 00000000
00:00:09.957056 Gst: 00000004/0003  00000163 02c0003f 00001fff 00000006
00:00:09.957059 Hst:                1c03c163 02c0003f 00001fff 00000006
00:00:09.957063 Gst: 00000004/0004  00000000 00000000 00000000 00000000
00:00:09.957066 Hst:                00000000 00000000 00000000 00000000
00:00:09.957069 Gst: 00000005/0000  00000040 00000040 00000000 00000000
00:00:09.957072 Hst:                00000040 00000040 00000003 00021120
00:00:09.957076 Gst: 00000006/0000  00000000 00000000 00000000 00000000
00:00:09.957079 Hst:                00000077 00000002 00000009 00000000
00:00:09.957081 Gst: 00000007/0000  00000000 00000000 00000000 00000000
00:00:09.957084 Hst:                00000000 00000000 00000000 00000000
00:00:09.957087 Gst: 00000008/0000  00000000 00000000 00000000 00000000
00:00:09.957090 Hst:                00000000 00000000 00000000 00000000
00:00:09.957093 Gst: 00000009/0000  00000000 00000000 00000000 00000000
00:00:09.957096 Hst:                00000000 00000000 00000000 00000000
00:00:09.957099 Gst: 0000000a/0000  00000000 00000000 00000000 00000000
00:00:09.957101 Hst:                07300403 00000000 00000000 00000603
00:00:09.957105 Gst: 0000000b/0000  00000000 00000001 00000100 00000000
00:00:09.957108 Hst:                00000001 00000002 00000100 00000000
00:00:09.957111 Gst: 0000000b/0001  00000001 00000001 00000201 00000000
00:00:09.957114 Hst:                00000004 00000008 00000201 00000000
00:00:09.957117 Gst: 0000000b/0002  00000000 00000000 00000002 00000000
00:00:09.957119 Hst:                00000000 00000000 00000002 00000000
00:00:09.957122 Gst: 0000000c/0000  00000000 00000000 00000000 00000000
00:00:09.957125 Hst:                00000000 00000000 00000000 00000000
00:00:09.957128 Gst: 0000000d/0000  00000007 00000340 00000340 00000000
00:00:09.957131 Hst:                00000007 00000340 00000340 00000000
00:00:09.957134 Gst: 0000000d/0001  00000000 00000000 00000000 00000000
00:00:09.957137 Hst:                00000001 00000000 00000000 00000000
00:00:09.957139 Gst: 0000000d/0002  00000100 00000240 00000000 00000000
00:00:09.957142 Hst:                00000100 00000240 00000000 00000000
00:00:09.957146 Gst: 0000000d/0003  00000000 00000000 00000000 00000000
00:00:09.957148 Hst:                00000000 00000000 00000000 00000000
00:00:09.957202                                Name: GenuineIntel
00:00:09.957206                            Supports: 0x00000000-0x0000000d
00:00:09.957217                              Family:  6 	Extended: 0 	Effective: 6
00:00:09.957222                               Model: 10 	Extended: 2 	Effective: 42
00:00:09.957227                            Stepping: 7
00:00:09.957230                                Type: 0 (primary)
00:00:09.957234                             APIC ID: 0x00
00:00:09.957237                        Logical CPUs: 0
00:00:09.957240                        CLFLUSH Size: 8
00:00:09.957242                            Brand ID: 0x00
00:00:09.957246 Features
00:00:09.957247   Mnemonic - Description                                  = guest (host)
00:00:09.957249   FPU - x87 FPU on Chip                                   = 1 (1)
00:00:09.957255   VME - Virtual 8086 Mode Enhancements                    = 1 (1)
00:00:09.957266   DE - Debugging extensions                               = 1 (1)
00:00:09.957270   PSE - Page Size Extension                               = 1 (1)
00:00:09.957274   TSC - Time Stamp Counter                                = 1 (1)
00:00:09.957279   MSR - Model Specific Registers                          = 1 (1)
00:00:09.957282   PAE - Physical Address Extension                        = 0 (1)
00:00:09.957286   MCE - Machine Check Exception                           = 1 (1)
00:00:09.957290   CX8 - CMPXCHG8B instruction                             = 1 (1)
00:00:09.957295   APIC - APIC On-Chip                                     = 1 (1)
00:00:09.957299   SEP - SYSENTER and SYSEXIT Present                      = 1 (1)
00:00:09.957303   MTRR - Memory Type Range Registers                      = 1 (1)
00:00:09.957307   PGE - PTE Global Bit                                    = 1 (1)
00:00:09.957311   MCA - Machine Check Architecture                        = 1 (1)
00:00:09.957315   CMOV - Conditional Move instructions                    = 1 (1)
00:00:09.957319   PAT - Page Attribute Table                              = 1 (1)
00:00:09.957323   PSE-36 - 36-bit Page Size Extension                     = 1 (1)
00:00:09.957327   PSN - Processor Serial Number                           = 0 (0)
00:00:09.957331   CLFSH - CLFLUSH instruction                             = 1 (1)
00:00:09.957335   DS - Debug Store                                        = 0 (1)
00:00:09.957340   ACPI - Thermal Mon. & Soft. Clock Ctrl.                 = 0 (1)
00:00:09.957343   MMX - Intel MMX Technology                              = 1 (1)
00:00:09.957348   FXSR - FXSAVE and FXRSTOR instructions                  = 1 (1)
00:00:09.957351   SSE - SSE support                                       = 1 (1)
00:00:09.957356   SSE2 - SSE2 support                                     = 1 (1)
00:00:09.957360   SS - Self Snoop                                         = 0 (1)
00:00:09.957364   HTT - Hyper-Threading Technology                        = 0 (1)
00:00:09.957368   TM - Therm. Monitor                                     = 0 (1)
00:00:09.957373   PBE - Pending Break Enabled                             = 0 (1)
00:00:09.957377   SSE3 - SSE3 support                                     = 1 (1)
00:00:09.957381   PCLMUL - PCLMULQDQ support (for AES-GCM)                = 1 (1)
00:00:09.957385   DTES64 - DS Area 64-bit Layout                          = 0 (1)
00:00:09.957389   MONITOR - MONITOR/MWAIT instructions                    = 1 (1)
00:00:09.957393   CPL-DS - CPL Qualified Debug Store                      = 0 (1)
00:00:09.957396   VMX - Virtual Machine Extensions                        = 0 (1)
00:00:09.957400   SMX - Safer Mode Extensions                             = 0 (0)
00:00:09.957404   EST - Enhanced SpeedStep Technology                     = 0 (1)
00:00:09.957408   TM2 - Terminal Monitor 2                                = 0 (1)
00:00:09.957412   SSSE3 - Supplemental Streaming SIMD Extensions 3        = 1 (1)
00:00:09.957415   CNTX-ID - L1 Context ID                                 = 0 (0)
00:00:09.957420   SDBG - Silicon Debug interface                          = 0 (0)
00:00:09.957424   FMA - Fused Multiply Add extensions                     = 0 (0)
00:00:09.957427   CX16 - CMPXCHG16B instruction                           = 1 (1)
00:00:09.957431   TPRUPDATE - xTPR Update Control                         = 0 (1)
00:00:09.957435   PDCM - Perf/Debug Capability MSR                        = 0 (1)
00:00:09.957439   PCID - Process Context Identifiers                      = 0 (1)
00:00:09.957443   DCA - Direct Cache Access                               = 0 (0)
00:00:09.957447   SSE4_1 - SSE4_1 support                                 = 1 (1)
00:00:09.957451   SSE4_2 - SSE4_2 support                                 = 1 (1)
00:00:09.957455   X2APIC - x2APIC support                                 = 1 (1)
00:00:09.957460   MOVBE - MOVBE instruction                               = 0 (0)
00:00:09.957464   POPCNT - POPCNT instruction                             = 1 (1)
00:00:09.957468   TSCDEADL - Time Stamp Counter Deadline                  = 0 (1)
00:00:09.957472   AES - AES instructions                                  = 1 (1)
00:00:09.957476   XSAVE - XSAVE instruction                               = 1 (1)
00:00:09.957480   OSXSAVE - OSXSAVE instruction                           = 0 (1)
00:00:09.957484   AVX - AVX support                                       = 1 (1)
00:00:09.957489   F16C - 16-bit floating point conversion instructions    = 0 (0)
00:00:09.957492   RDRAND - RDRAND instruction                             = 0 (0)
00:00:09.957496   HVP - Hypervisor Present (we're a guest)                = 1 (0)
00:00:09.957500 Structured Extended Feature Flags Enumeration (leaf 7):
00:00:09.957502   Mnemonic - Description                                  = guest (host)
00:00:09.957508   FSGSBASE - RDFSBASE/RDGSBASE/WRFSBASE/WRGSBASE instr.   = 0 (0)
00:00:09.957512   TSCADJUST - Supports MSR_IA32_TSC_ADJUST                = 0 (0)
00:00:09.957516   SGX - Supports Software Guard Extensions                = 0 (0)
00:00:09.957519   BMI1 - Advanced Bit Manipulation extension 1            = 0 (0)
00:00:09.957523   HLE - Hardware Lock Elision                             = 0 (0)
00:00:09.957527   AVX2 - Advanced Vector Extensions 2                     = 0 (0)
00:00:09.957531   FDP_EXCPTN_ONLY - FPU DP only updated on exceptions     = 0 (0)
00:00:09.957534   SMEP - Supervisor Mode Execution Prevention             = 0 (0)
00:00:09.957538   BMI2 - Advanced Bit Manipulation extension 2            = 0 (0)
00:00:09.957541   ERMS - Enhanced REP MOVSB/STOSB instructions            = 0 (0)
00:00:09.957545   INVPCID - INVPCID instruction                           = 0 (0)
00:00:09.957548   RTM - Restricted Transactional Memory                   = 0 (0)
00:00:09.957552   PQM - Platform Quality of Service Monitoring            = 0 (0)
00:00:09.957556   DEPFPU_CS_DS - Deprecates FPU CS, FPU DS values if set  = 0 (0)
00:00:09.957559   MPE - Intel Memory Protection Extensions                = 0 (0)
00:00:09.957562   PQE - Platform Quality of Service Enforcement           = 0 (0)
00:00:09.957565   AVX512F - AVX512 Foundation instructions                = 0 (0)
00:00:09.957569   RDSEED - RDSEED instruction                             = 0 (0)
00:00:09.957573   ADX - ADCX/ADOX instructions                            = 0 (0)
00:00:09.957577   SMAP - Supervisor Mode Access Prevention                = 0 (0)
00:00:09.957581   CLFLUSHOPT - CLFLUSHOPT (Cache Line Flush) instruction  = 0 (0)
00:00:09.957584   INTEL_PT - Intel Processor Trace                        = 0 (0)
00:00:09.957588   AVX512PF - AVX512 Prefetch instructions                 = 0 (0)
00:00:09.957591   AVX512ER - AVX512 Exponential & Reciprocal instructions = 0 (0)
00:00:09.957594   AVX512CD - AVX512 Conflict Detection instructions       = 0 (0)
00:00:09.957598   SHA - Secure Hash Algorithm extensions                  = 0 (0)
00:00:09.957601   PREFETCHWT1 - PREFETCHWT1 instruction                   = 0 (0)
00:00:09.957605   PKU - Protection Key for Usermode pages                 = 0 (0)
00:00:09.957609   OSPKU - CR4.PKU mirror                                  = 0 (0)
00:00:09.957614 Processor Extended State Enumeration (leaf 0xd):
00:00:09.957616    XSAVE area cur/max size by XCR0, guest: 0x340/0x340
00:00:09.957619     XSAVE area cur/max size by XCR0, host: 0x340/0x340
00:00:09.957622                    Valid XCR0 bits, guest: 0x00000000`00000007 ( x87 SSE YMM_Hi128 )
00:00:09.957629                     Valid XCR0 bits, host: 0x00000000`00000007 ( x87 SSE YMM_Hi128 )
00:00:09.957636                     XSAVE features, guest:
00:00:09.957639                      XSAVE features, host: XSAVEOPT
00:00:09.957643       XSAVE area cur size XCR0|XSS, guest: 0x0
00:00:09.957645        XSAVE area cur size XCR0|XSS, host: 0x0
00:00:09.957648                Valid IA32_XSS bits, guest: 0x00000000`00000000
00:00:09.957651                 Valid IA32_XSS bits, host: 0x00000000`00000000
00:00:09.957654   State #2, guest: off=0x0240, cb=0x0100 IA32_XSS-bit -- YMM_Hi128
00:00:09.957661   State #2, host:  off=0x0240, cb=0x0100 IA32_XSS-bit -- YMM_Hi128
00:00:09.957691          Raw Hypervisor CPUID Leaves
00:00:09.957693      Leaf/sub-leaf  eax      ebx      ecx      edx
00:00:09.957694 Gst: 40000000/0000  40000001 4b4d564b 564b4d56 0000004d
00:00:09.957700 Hst:                00000007 00000340 00000340 00000000
00:00:09.957703 Gst: 40000001/0000  01000089 00000000 00000000 00000000
00:00:09.957706 Hst:                00000007 00000340 00000340 00000000
00:00:09.957710          Raw Extended CPUID Leaves
00:00:09.957711      Leaf/sub-leaf  eax      ebx      ecx      edx
00:00:09.957713 Gst: 80000000/0000  80000008 00000000 00000000 00000000
00:00:09.957717 Hst:                80000008 00000000 00000000 00000000
00:00:09.957720 Gst: 80000001/0000  00000000 00000000 00000001 08000000
00:00:09.957724 Hst:                00000000 00000000 00000001 28100800
00:00:09.957728 Gst: 80000002/0000  20202020 6e492020 286c6574 43202952
00:00:09.957733 Hst:                20202020 6e492020 286c6574 43202952
00:00:09.957737 Gst: 80000003/0000  2865726f 20294d54 322d3769 51303736
00:00:09.957742 Hst:                2865726f 20294d54 322d3769 51303736
00:00:09.957746 Gst: 80000004/0000  5043204d 20402055 30322e32 007a4847
00:00:09.957751 Hst:                5043204d 20402055 30322e32 007a4847
00:00:09.957755 Gst: 80000005/0000  00000000 00000000 00000000 00000000
00:00:09.957758 Hst:                00000000 00000000 00000000 00000000
00:00:09.957765 Gst: 80000006/0000  00000000 00000000 01006040 00000000
00:00:09.957768 Hst:                00000000 00000000 01006040 00000000
00:00:09.957772 Gst: 80000007/0000  00000000 00000000 00000000 00000100
00:00:09.957775 Hst:                00000000 00000000 00000000 00000100
00:00:09.957778 Gst: 80000008/0000  00003024 00000000 00000000 00000000
00:00:09.957781 Hst:                00003024 00000000 00000000 00000000
00:00:09.957784 Ext Name:                        
00:00:09.957786 Ext Supports:                    0x80000000-0x80000008
00:00:09.957789 Family:                          0  	Extended: 0 	Effective: 0
00:00:09.957792 Model:                           0  	Extended: 0 	Effective: 0
00:00:09.957794 Stepping:                        0
00:00:09.957796 Brand ID:                        0x000
00:00:09.957803 Ext Features
00:00:09.957804   Mnemonic - Description                                  = guest (host)
00:00:09.957806   FPU - x87 FPU on Chip                                   = 0 (0)
00:00:09.957811   VME - Virtual 8086 Mode Enhancements                    = 0 (0)
00:00:09.957815   DE - Debugging extensions                               = 0 (0)
00:00:09.957819   PSE - Page Size Extension                               = 0 (0)
00:00:09.957823   TSC - Time Stamp Counter                                = 0 (0)
00:00:09.957827   MSR - K86 Model Specific Registers                      = 0 (0)
00:00:09.957831   PAE - Physical Address Extension                        = 0 (0)
00:00:09.957835   MCE - Machine Check Exception                           = 0 (0)
00:00:09.957839   CX8 - CMPXCHG8B instruction                             = 0 (0)
00:00:09.957843   APIC - APIC On-Chip                                     = 0 (0)
00:00:09.957847   SEP - SYSCALL/SYSRET                                    = 0 (1)
00:00:09.957851   MTRR - Memory Type Range Registers                      = 0 (0)
00:00:09.957855   PGE - PTE Global Bit                                    = 0 (0)
00:00:09.957859   MCA - Machine Check Architecture                        = 0 (0)
00:00:09.957863   CMOV - Conditional Move instructions                    = 0 (0)
00:00:09.957867   PAT - Page Attribute Table                              = 0 (0)
00:00:09.957871   PSE-36 - 36-bit Page Size Extension                     = 0 (0)
00:00:09.957875   NX - No-Execute/Execute-Disable                         = 0 (1)
00:00:09.957879   AXMMX - AMD Extensions to MMX instructions              = 0 (0)
00:00:09.957882   MMX - Intel MMX Technology                              = 0 (0)
00:00:09.957886   FXSR - FXSAVE and FXRSTOR Instructions                  = 0 (0)
00:00:09.957890   FFXSR - AMD fast FXSAVE and FXRSTOR instructions        = 0 (0)
00:00:09.957893   Page1GB - 1 GB large page                               = 0 (0)
00:00:09.957897   RDTSCP - RDTSCP instruction                             = 1 (1)
00:00:09.957901   LM - AMD64 Long Mode                                    = 0 (1)
00:00:09.957906   3DNOWEXT - AMD Extensions to 3DNow                      = 0 (0)
00:00:09.957909   3DNOW - AMD 3DNow                                       = 0 (0)
00:00:09.957914   LahfSahf - LAHF/SAHF support in 64-bit mode             = 1 (1)
00:00:09.957917   CmpLegacy - Core multi-processing legacy mode           = 0 (0)
00:00:09.957921   SVM - AMD VM extensions                                 = 0 (0)
00:00:09.957925   EXTAPIC - AMD Extended APIC registers                   = 0 (0)
00:00:09.957929   CR8L - AMD LOCK MOV CR0 means MOV CR8                   = 0 (0)
00:00:09.957932   ABM - AMD Advanced Bit Manipulation                     = 0 (0)
00:00:09.957936   SSE4A - SSE4A instructions                              = 0 (0)
00:00:09.957940   MISALIGNSSE - AMD Misaligned SSE mode                   = 0 (0)
00:00:09.957944   3DNOWPRF - AMD PREFETCH and PREFETCHW instructions      = 0 (0)
00:00:09.957947   OSVW - AMD OS Visible Workaround                        = 0 (0)
00:00:09.957951   IBS - Instruct Based Sampling                           = 0 (0)
00:00:09.957955   XOP - Extended Operation support                        = 0 (0)
00:00:09.957958   SKINIT - SKINIT, STGI, and DEV support                  = 0 (0)
00:00:09.957962   WDT - AMD Watchdog Timer support                        = 0 (0)
00:00:09.957966   LWP - Lightweight Profiling support                     = 0 (0)
00:00:09.957970   FMA4 - Four operand FMA instruction support             = 0 (0)
00:00:09.957973   NodeId - NodeId in MSR C001_100C                        = 0 (0)
00:00:09.957977   TBM - Trailing Bit Manipulation instructions            = 0 (0)
00:00:09.957981   TOPOEXT - Topology Extensions                           = 0 (0)
00:00:09.957986 Full Name:                       "      Intel(R) Core(TM) i7-2670QM CPU @ 2.20GHz"
00:00:09.957988 TLB 2/4M Instr/Uni:              res0     0 entries
00:00:09.957991 TLB 2/4M Data:                   res0     0 entries
00:00:09.957993 TLB 4K Instr/Uni:                res0     0 entries
00:00:09.957995 TLB 4K Data:                     res0     0 entries
00:00:09.957998 L1 Instr Cache Line Size:        0 bytes
00:00:09.957999 L1 Instr Cache Lines Per Tag:    0
00:00:09.958001 L1 Instr Cache Associativity:    res0  
00:00:09.958002 L1 Instr Cache Size:             0 KB
00:00:09.958004 L1 Data Cache Line Size:         0 bytes
00:00:09.958006 L1 Data Cache Lines Per Tag:     0
00:00:09.958007 L1 Data Cache Associativity:     res0  
00:00:09.958008 L1 Data Cache Size:              0 KB
00:00:09.958011 L2 TLB 2/4M Instr/Uni:           off       0 entries
00:00:09.958013 L2 TLB 2/4M Data:                off       0 entries
00:00:09.958015 L2 TLB 4K Instr/Uni:             off       0 entries
00:00:09.958017 L2 TLB 4K Data:                  off       0 entries
00:00:09.958019 L2 Cache Line Size:              0 bytes
00:00:09.958021 L2 Cache Lines Per Tag:          0
00:00:09.958022 L2 Cache Associativity:          off   
00:00:09.958023 L2 Cache Size:                   0 KB
00:00:09.958025 APM Features:                    TscInvariant
00:00:09.958029 Host Invariant-TSC support:      true 
00:00:09.958031 Physical Address Width:          36 bits
00:00:09.958033 Virtual Address Width:           48 bits
00:00:09.958034 Guest Physical Address Width:    0 bits
00:00:09.958036 Physical Core Count:             1
00:00:09.958039 
00:00:09.958041 ******************** End of CPUID dump **********************
00:00:10.037259 PcBios: SATA LUN#0 LCHS=783/255/63
00:00:10.037347 APIC: fPostedIntrsEnabled=false fVirtApicRegsEnabled=false fSupportsTscDeadline=false
00:00:10.037381 VMEmt: Halt method global1 (5)
00:00:10.037413 VMEmt: HaltedGlobal1 config: cNsSpinBlockThresholdCfg=50000
00:00:10.037434 Changing the VM state from 'CREATING' to 'CREATED'
00:00:10.040107 Changing the VM state from 'CREATED' to 'POWERING_ON'
00:00:10.040209 AIOMgr: Endpoints without assigned bandwidth groups:
00:00:10.040225 AIOMgr:     C:\Users\caev0\VirtualBox VMs\KitKat480x800x16\KitKat480x800x16-disk1.vdi
00:00:10.040574 Changing the VM state from 'POWERING_ON' to 'RUNNING'
00:00:10.040642 Console: Machine state changed to 'Running'
00:00:10.048084 VMMDev: Guest Log: BIOS: VirtualBox 5.1.18
00:00:10.054030 PIT: mode=2 count=0x10000 (65536) - 18.20 Hz (ch=0)
00:00:10.065957 Display::handleDisplayResize: uScreenId=0 pvVRAM=0000000000000000 w=720 h=400 bpp=0 cbLine=0x0 flags=0x1
00:00:10.066036 ERROR [COM]: aRC=VBOX_E_IPRT_ERROR (0x80bb0005) aIID={02326f63-bcb3-4481-96e0-30d1c2ee97f6} aComponent={DisplayWrap} aText={Could not take a screenshot (VERR_NOT_SUPPORTED)}, preserve=false aResultDetail=0
00:00:10.066292 GUI: UIFrameBufferPrivate::NotifyChange: Screen=0, Origin=0x0, Size=720x400, Sending to async-handler
00:00:10.066481 GUI: UIMachineView::sltHandleNotifyChange: Screen=0, Size=720x400
00:00:10.066528 GUI: UIFrameBufferPrivate::handleNotifyChange: Size=720x400
00:00:10.066549 GUI: UIFrameBufferPrivate::performResize: Size=720x400, Directly using source bitmap content
00:00:10.095540 PIIX3 ATA: Ctl#1: RESET, DevSel=0 AIOIf=0 CmdIf0=0x00 (-1 usec ago) CmdIf1=0x00 (-1 usec ago)
00:00:10.095701 PIIX3 ATA: Ctl#1: finished processing RESET
00:00:10.129269 AHCI#0: Reset the HBA
00:00:10.129512 AHCI#0: Port 0 reset
00:00:10.131556 VMMDev: Guest Log: BIOS: AHCI 0-P#0: PCHS=12483/16/63 LCHS=783/255/63 0x0000000000c00000 sectors
00:00:10.134476 PIT: mode=2 count=0x48d3 (18643) - 64.00 Hz (ch=0)
00:00:10.147680 GUI: UIMachineViewNormal::resendSizeHint: Restoring guest size-hint for screen 0 to 800x600
00:00:10.148547 VMMDev: SetVideoModeHint: Got a video mode hint (800x600x0)@(0x0),(1;0) at 0
00:00:10.151438 GUI: 2D video acceleration is disabled
00:00:10.151491 GUI: HID LEDs sync is enabled
00:00:10.156943 GUI: UIMachineLogicNormal::sltCheckForRequestedVisualStateType: Requested-state=0, Machine-state=5
00:00:10.158645 Display::handleDisplayResize: uScreenId=0 pvVRAM=000000000ccc0000 w=640 h=480 bpp=32 cbLine=0xA00 flags=0x1
00:00:10.158824 GUI: UIFrameBufferPrivate::NotifyChange: Screen=0, Origin=0x0, Size=640x480, Sending to async-handler
00:00:10.170923 GUI: UIMachineView::sltHandleNotifyChange: Screen=0, Size=640x480
00:00:10.171003 GUI: UIFrameBufferPrivate::handleNotifyChange: Size=640x480
00:00:10.171552 GUI: UIFrameBufferPrivate::performResize: Size=640x480, Directly using source bitmap content
00:00:12.625184 Display::handleDisplayResize: uScreenId=0 pvVRAM=0000000000000000 w=720 h=400 bpp=0 cbLine=0x0 flags=0x1
00:00:12.625411 GUI: UIFrameBufferPrivate::NotifyChange: Screen=0, Origin=0x0, Size=720x400, Sending to async-handler
00:00:12.625562 GUI: UIMachineView::sltHandleNotifyChange: Screen=0, Size=720x400
00:00:12.625615 GUI: UIFrameBufferPrivate::handleNotifyChange: Size=720x400
00:00:12.625676 GUI: UIFrameBufferPrivate::performResize: Size=720x400, Directly using source bitmap content
00:00:12.640494 PIT: mode=2 count=0x10000 (65536) - 18.20 Hz (ch=0)
00:00:12.641467 VMMDev: Guest Log: BIOS: Boot : bseqnr=1, bootseq=0231
00:00:12.642259 VMMDev: Guest Log: BIOS: Boot from Floppy 0 failed
00:00:12.644269 VMMDev: Guest Log: BIOS: Boot : bseqnr=2, bootseq=0023
00:00:12.645786 VMMDev: Guest Log: BIOS: CDROM boot failure code : 0003
00:00:12.646507 VMMDev: Guest Log: BIOS: Boot from CD-ROM failed
00:00:12.647355 VMMDev: Guest Log: BIOS: Boot : bseqnr=3, bootseq=0002
00:00:12.656341 VMMDev: Guest Log: BIOS: Booting from Hard Disk...
00:00:12.709781 VMMDev: Guest Log: int13_harddisk_ext: function 41, unmapped device for ELDL=81
00:00:12.711126 VMMDev: Guest Log: int13_harddisk: function 08, unmapped device for ELDL=81
00:00:12.754830 Display::handleDisplayResize: uScreenId=0 pvVRAM=000000000ccc0000 w=640 h=480 bpp=0 cbLine=0x140 flags=0x1
00:00:12.755038 GUI: UIFrameBufferPrivate::NotifyChange: Screen=0, Origin=0x0, Size=640x480, Sending to async-handler
00:00:12.755179 GUI: UIMachineView::sltHandleNotifyChange: Screen=0, Size=640x480
00:00:12.755224 GUI: UIFrameBufferPrivate::handleNotifyChange: Size=640x480
00:00:12.755703 GUI: UIFrameBufferPrivate::performResize: Size=640x480, Directly using source bitmap content
00:00:22.634827 Display::handleDisplayResize: uScreenId=0 pvVRAM=0000000000000000 w=720 h=400 bpp=0 cbLine=0x0 flags=0x1
00:00:22.635039 GUI: UIFrameBufferPrivate::NotifyChange: Screen=0, Origin=0x0, Size=720x400, Sending to async-handler
00:00:22.635198 GUI: UIMachineView::sltHandleNotifyChange: Screen=0, Size=720x400
00:00:22.635252 GUI: UIFrameBufferPrivate::handleNotifyChange: Size=720x400
00:00:22.635774 GUI: UIFrameBufferPrivate::performResize: Size=720x400, Directly using source bitmap content
00:00:23.375039 VMMDev: Guest Log: BIOS: KBD: unsupported int 16h function 03
00:00:23.376000 VMMDev: Guest Log: BIOS: AX=0305 BX=0000 CX=0000 DX=0000 
00:00:29.347245 PIT: mode=2 count=0x4a9 (1193) - 1000.15 Hz (ch=0)
00:00:29.605946 PIT: mode=0 count=0x10000 (65536) - 18.20 Hz (ch=0)
00:00:29.846691 OHCI: Software reset
00:00:30.426961 AHCI#0: Reset the HBA
00:00:30.430267 AHCI#0: Port 0 reset
00:00:30.435567 OHCI: USB Reset
00:00:30.436560 PIIX3 ATA: Ctl#0: RESET, DevSel=0 AIOIf=0 CmdIf0=0x00 (-1 usec ago) CmdIf1=0x00 (-1 usec ago)
00:00:30.436701 PIIX3 ATA: Ctl#0: finished processing RESET
00:00:30.437491 PIIX3 ATA: Ctl#1: RESET, DevSel=0 AIOIf=0 CmdIf0=0xa0 (-1 usec ago) CmdIf1=0x00 (-1 usec ago)
00:00:30.437603 PIIX3 ATA: Ctl#1: finished processing RESET
00:00:30.486080 OHCI: Software reset
00:00:30.486385 OHCI: USB Operational
00:00:30.981260 AIOMgr: Async flushes not supported
00:00:31.635195 Changing the VM state from 'RUNNING' to 'SUSPENDING'
00:00:31.685814 AIOMgr: Endpoint for file 'C:\Users\caev0\VirtualBox VMs\KitKat480x800x16\KitKat480x800x16-disk1.vdi' (flags 000c0781) created successfully
00:00:31.781629 PDMR3Suspend: 146 363 664 ns run time
00:00:31.781679 Changing the VM state from 'SUSPENDING' to 'SUSPENDED'
00:00:31.781717 Console: Machine state changed to 'Paused'
00:00:32.851952 GUI: Request for close-action to power VM off.
00:00:32.852004 GUI: Passing request to power VM off from machine-logic to UI session.
00:00:32.852020 GUI: Powering VM down on UI session power off request...
00:00:32.853121 Console: Machine state changed to 'Stopping'
00:00:32.853617 Console::powerDown(): A request to power off the VM has been issued (mMachineState=Stopping, InUninit=0)
00:00:32.853660 Display::handleDisplayResize: uScreenId=0 pvVRAM=0000000000000000 w=720 h=400 bpp=32 cbLine=0x0 flags=0x1
00:00:32.853715 GUI: UIFrameBufferPrivate::NotifyChange: Screen=0, Origin=0x0, Size=720x400, Sending to async-handler
00:00:32.854287 Changing the VM state from 'SUSPENDED' to 'POWERING_OFF'
00:00:32.854325 ****************** Guest state at power off for VCpu 0 ******************
00:00:32.854346 Guest CPUM (VCPU 0) state: 
00:00:32.854370 eax=00000000 ebx=b7754ff4 ecx=bf925a98 edx=080d27d0 esi=00000045 edi=00000002
00:00:32.854378 eip=b76b1705 esp=bf9258ac ebp=bf925928 iopl=0         nv up ei pl nz na po nc
00:00:32.854385 cs={0073 base=0000000000000000 limit=ffffffff flags=0000c0fb} dr0=00000000 dr1=00000000
00:00:32.854394 ds={007b base=0000000000000000 limit=ffffffff flags=0000c0f3} dr2=00000000 dr3=00000000
00:00:32.854400 es={007b base=0000000000000000 limit=ffffffff flags=0000c0f3} dr4=00000000 dr5=00000000
00:00:32.854405 fs={0000 base=0000000000000000 limit=ffffffff flags=0001c000} dr6=ffff0ff0 dr7=00000400
00:00:32.854412 gs={0033 base=00000000b75f5b00 limit=ffffffff flags=0000d0f3} cr0=8005003b cr2=b75f3000
00:00:32.854419 ss={007b base=0000000000000000 limit=ffffffff flags=0000c0f3} cr3=361a6000 cr4=000406d0
00:00:32.854425 gdtr=00000000f6e9a000:00ff  idtr=00000000fffbb000:07ff  eflags=00000246
00:00:32.854431 ldtr={0000 base=00000000 limit=ffffffff flags=0001c000}
00:00:32.854435 tr  ={0080 base=f6e9f080 limit=0000206b flags=0000008b}
00:00:32.854439 SysEnter={cs=0060 eip=c14ab2f0 esp=f6ea1200}
00:00:32.854444 xcr=0000000000000007 xcr1=0000000000000000 xss=0000000000000000 (fXStateMask=0000000000000007)
00:00:32.854450 FCW=037f FSW=0000 FTW=0000 FOP=0000 MXCSR=00001f80 MXCSR_MASK=0000ffff
00:00:32.854454 FPUIP=00000000 CS=0000 Rsrvd1=0000  FPUDP=00000000 DS=0000 Rsvrd2=0000
00:00:32.854459 ST(0)=FPR0={0000'00000000'00000000} t0 +0.0000000000000000000000 * 2 ^ -16383 (*)
00:00:32.854468 ST(1)=FPR1={0000'00000000'00000000} t0 +0.0000000000000000000000 * 2 ^ -16383 (*)
00:00:32.854475 ST(2)=FPR2={0000'00000000'00000000} t0 +0.0000000000000000000000 * 2 ^ -16383 (*)
00:00:32.854481 ST(3)=FPR3={0000'00000000'00000000} t0 +0.0000000000000000000000 * 2 ^ -16383 (*)
00:00:32.854487 ST(4)=FPR4={0000'00000000'00000000} t0 +0.0000000000000000000000 * 2 ^ -16383 (*)
00:00:32.854492 ST(5)=FPR5={0000'00000000'00000000} t0 +0.0000000000000000000000 * 2 ^ -16383 (*)
00:00:32.854498 ST(6)=FPR6={4015'800bf600'00000000} t0 +1.0000003366704604250112 * 2 ^ 22 (*)
00:00:32.854507 ST(7)=FPR7={0000'00000000'00000000} t0 +0.0000000000000000000000 * 2 ^ -16383 (*)
00:00:32.854513 YMM0 =00000000'00000000'00000000'00000000'00000000'00000000'00000000'00000000
00:00:32.854519 YMM1 =00000000'00000000'00000000'00000000'00000000'00000000'00000000'00000000
00:00:32.854525 YMM2 =00000000'00000000'00000000'00000000'00000000'00000000'00000000'00000000
00:00:32.854530 YMM3 =00000000'00000000'00000000'00000000'00000000'00000000'00000000'00000000
00:00:32.854535 YMM4 =00000000'00000000'00000000'00000000'00000000'00000000'00000000'00000000
00:00:32.854541 YMM5 =00000000'00000000'00000000'00000000'00000000'00000000'00000000'00000000
00:00:32.854546 YMM6 =00000000'00000000'00000000'00000000'00000000'00000000'00000000'00000000
00:00:32.854552 YMM7 =00000000'00000000'00000000'00000000'00000000'00000000'00000000'00000000
00:00:32.854557 YMM8 =00000000'00000000'00000000'00000000'00000000'00000000'00000000'00000000
00:00:32.854566 YMM9 =00000000'00000000'00000000'00000000'00000000'00000000'00000000'00000000
00:00:32.854571 YMM10=00000000'00000000'00000000'00000000'00000000'00000000'00000000'00000000
00:00:32.854577 YMM11=00000000'00000000'00000000'00000000'00000000'00000000'00000000'00000000
00:00:32.854582 YMM12=00000000'00000000'00000000'00000000'00000000'00000000'00000000'00000000
00:00:32.854588 YMM13=00000000'00000000'00000000'00000000'00000000'00000000'00000000'00000000
00:00:32.854593 YMM14=00000000'00000000'00000000'00000000'00000000'00000000'00000000'00000000
00:00:32.854598 YMM15=00000000'00000000'00000000'00000000'00000000'00000000'00000000'00000000
00:00:32.854604 EFER         =0000000000000000
00:00:32.854606 PAT          =0007010600070106
00:00:32.854609 STAR         =0000000000000000
00:00:32.854611 CSTAR        =0000000000000000
00:00:32.854613 LSTAR        =0000000000000000
00:00:32.854615 SFMASK       =0000000000000000
00:00:32.854616 KERNELGSBASE =0000000000000000
00:00:32.854622 ***
00:00:32.854634 Guest paging mode (VCPU #0):  32-bit (changed 643 times), A20 enabled (changed 2 times)
00:00:32.854640 Shadow paging mode (VCPU #0): EPT
00:00:32.854643 Host paging mode:              AMD64+G+NX
00:00:32.854645 ***
00:00:32.854651 Active Timers (pVM=0000000003e10000)
00:00:32.854654 pTimerR3         offNext  offPrev  offSched Clock               Time             Expire HzHint State                     Description
00:00:32.854664 000000000a0b7130 fffed8a0 00000000 00000000 Real           260845550          260844335      0 2-ACTIVE                  EMT Yielder
00:00:32.854677 000000000a0a49d0 000126e0 00012760 00000000 Real           260845550          260844343      0 2-ACTIVE                  VGA Refresh Timer
00:00:32.854687 000000000a0b70b0 00000000 fffed920 00000000 Real           260845550          260844750      0 2-ACTIVE                  CPU Load Timer
00:00:32.854697 000000000a0b3500 00000000 00000000 00000000 Virt         21741158851        21596737807      0 2-ACTIVE                  DevIchAc97
00:00:32.854708 000000000a09b9a0 00000e70 00000000 00000000 VrSy         21593334265        21593525621   1459 2-ACTIVE                  APIC Timer 0
00:00:32.854718 000000000a09c810 0001a3a0 fffff190 00000000 VrSy         21593334265        21990000000      0 2-ACTIVE                  MC146818 RTC/CMOS - Second
00:00:32.854727 000000000a0b6bb0 00000000 fffe5c60 00000000 VrSy         21593334265       599932015941      0 2-ACTIVE                  ACPI PM Timer
00:00:32.854738 ***
00:00:32.854745 ************** End of Guest state at power off ***************
00:00:32.863523 PDMR3PowerOff: 8 740 819 ns run time
00:00:32.863613 Changing the VM state from 'POWERING_OFF' to 'OFF'
00:00:32.868749 Changing the VM state from 'OFF' to 'DESTROYING'
00:00:32.868878 ************************* Statistics *************************
00:00:32.869198 /CPUM/MSR-Totals/Reads                 21 times
00:00:32.869228 /CPUM/MSR-Totals/ReadsRaisingGP         0 times
00:00:32.869244 /CPUM/MSR-Totals/ReadsUnknown           0 times
00:00:32.869258 /CPUM/MSR-Totals/Writes                 6 times
00:00:32.869271 /CPUM/MSR-Totals/WritesRaisingGP        0 times
00:00:32.869284 /CPUM/MSR-Totals/WritesToIgnoredBits        0 times
00:00:32.869297 /CPUM/MSR-Totals/WritesUnknown          0 times
00:00:32.869310 /Devices/E1k0/ReceiveBytes              0 bytes
00:00:32.869322 /Devices/E1k0/TransmitBytes             0 bytes
00:00:32.869334 /Devices/IDE0/ATA0/Unit0/AtapiDMA        0 times
00:00:32.869346 /Devices/IDE0/ATA0/Unit0/AtapiPIO        0 times
00:00:32.869358 /Devices/IDE0/ATA0/Unit0/DMA            0 times
00:00:32.869370 /Devices/IDE0/ATA0/Unit0/PIO            0 times
00:00:32.869382 /Devices/IDE0/ATA0/Unit0/ReadBytes        0 bytes
00:00:32.869395 /Devices/IDE0/ATA0/Unit0/WrittenBytes        0 bytes
00:00:32.869407 /Devices/IDE0/ATA0/Unit1/AtapiDMA        0 times
00:00:32.869418 /Devices/IDE0/ATA0/Unit1/AtapiPIO        0 times
00:00:32.869430 /Devices/IDE0/ATA0/Unit1/DMA            0 times
00:00:32.869441 /Devices/IDE0/ATA0/Unit1/PIO            0 times
00:00:32.869452 /Devices/IDE0/ATA0/Unit1/ReadBytes        0 bytes
00:00:32.869463 /Devices/IDE0/ATA0/Unit1/WrittenBytes        0 bytes
00:00:32.869475 /Devices/IDE0/ATA1/Unit0/AtapiDMA        2 times
00:00:32.869486 /Devices/IDE0/ATA1/Unit0/AtapiPIO        3 times
00:00:32.869497 /Devices/IDE0/ATA1/Unit0/DMA            0 times
00:00:32.869508 /Devices/IDE0/ATA1/Unit0/PIO            0 times
00:00:32.869520 /Devices/IDE0/ATA1/Unit0/ReadBytes        0 bytes
00:00:32.869531 /Devices/IDE0/ATA1/Unit0/WrittenBytes        0 bytes
00:00:32.869542 /Devices/IDE0/ATA1/Unit1/AtapiDMA        0 times
00:00:32.869554 /Devices/IDE0/ATA1/Unit1/AtapiPIO        0 times
00:00:32.869566 /Devices/IDE0/ATA1/Unit1/DMA            0 times
00:00:32.869582 /Devices/IDE0/ATA1/Unit1/PIO            0 times
00:00:32.869594 /Devices/IDE0/ATA1/Unit1/ReadBytes        0 bytes
00:00:32.869606 /Devices/IDE0/ATA1/Unit1/WrittenBytes        0 bytes
00:00:32.869618 /Devices/SATA0/Port0/DMA              374 times
00:00:32.869631 /Devices/SATA0/Port0/ReadBytes    9109504 bytes
00:00:32.869644 /Devices/SATA0/Port0/WrittenBytes     4096 bytes
00:00:32.869667 /Devices/VMMDev/BalloonChunks           0 count
00:00:32.869681 /FT/Checkpoint/Network                  0 times
00:00:32.869694 /FT/Checkpoint/Storage                  0 times
00:00:32.869706 /FT/Received/Mem                        0 bytes
00:00:32.869718 /FT/Received/State                      0 bytes
00:00:32.869730 /FT/Sent/Mem                            0 bytes
00:00:32.869743 /FT/Sent/State                          0 bytes
00:00:32.869755 /FT/Sync/DeltaMem                       0 times
00:00:32.869768 /FT/Sync/DeltaVM                        0 times
00:00:32.869780 /FT/Sync/Full                           0 times
00:00:32.869794 /GMM/VM/Allocated/cBasePages        13438 pages
00:00:32.869807 /GMM/VM/Allocated/cFixedPages           0 pages
00:00:32.869819 /GMM/VM/Allocated/cShadowPages          0 pages
00:00:32.869831 /GMM/VM/Reserved/cBasePages        262302 pages
00:00:32.869843 /GMM/VM/Reserved/cFixedPages         5124 pages
00:00:32.869855 /GMM/VM/Reserved/cShadowPages           1 pages
00:00:32.869867 /GMM/VM/cBalloonedPages                 0 pages
00:00:32.869879 /GMM/VM/cMaxBalloonedPages              0 pages
00:00:32.869891 /GMM/VM/cPrivatePages               13438 pages
00:00:32.869904 /GMM/VM/cReqActuallyBalloonedPages        0 pages
00:00:32.869916 /GMM/VM/cReqBalloonedPages              0 pages
00:00:32.869928 /GMM/VM/cReqDeflatePages                0 pages
00:00:32.869952 /GMM/VM/cShareableModules               0 count
00:00:32.869975 /GMM/VM/cSharedPages                    0 pages
00:00:32.869988 /GMM/VM/enmPolicy                       1 
00:00:32.870002 /GMM/VM/enmPriority                     2 
00:00:32.870014 /GMM/VM/fBallooningEnabled       false    
00:00:32.870026 /GMM/VM/fMayAllocate             true     
00:00:32.870038 /GMM/VM/fSharedPagingEnabled     false    
00:00:32.870050 /GMM/cAllocatedPages                13438 pages
00:00:32.870062 /GMM/cBalloonedPages                    0 pages
00:00:32.870078 /GMM/cChunks                           27 count
00:00:32.870090 /GMM/cDuplicatePages                    0 pages
00:00:32.870103 /GMM/cFreedChunks                       0 count
00:00:32.870116 /GMM/cLeftBehindSharedPages             0 pages
00:00:32.870128 /GMM/cMaxPages                   4294967295 pages
00:00:32.870144 /GMM/cOverCommittedPages                0 pages
00:00:32.870164 /GMM/cReservedPages                267427 pages
00:00:32.870185 /GMM/cShareableModules                  0 count
00:00:32.870203 /GMM/cSharedPages                       0 pages
00:00:32.870217 /GVMM/EMTs                              1 calls
00:00:32.870230 /GVMM/HostCPUs                          8 calls
00:00:32.870242 /GVMM/HostCpus/0                        0 
00:00:32.870255 /GVMM/HostCpus/0/CurTimerHz             0 Hz
00:00:32.870267 /GVMM/HostCpus/0/DesiredHz              0 Hz
00:00:32.870279 /GVMM/HostCpus/0/PPTChanges             0 times
00:00:32.870290 /GVMM/HostCpus/0/PPTStarts              0 times
00:00:32.870302 /GVMM/HostCpus/0/idxCpuSet              0 
00:00:32.870313 /GVMM/HostCpus/1                        1 
00:00:32.870325 /GVMM/HostCpus/1/CurTimerHz             0 Hz
00:00:32.870336 /GVMM/HostCpus/1/DesiredHz              0 Hz
00:00:32.870348 /GVMM/HostCpus/1/PPTChanges             0 times
00:00:32.870359 /GVMM/HostCpus/1/PPTStarts              0 times
00:00:32.870371 /GVMM/HostCpus/1/idxCpuSet              1 
00:00:32.870382 /GVMM/HostCpus/2                        2 
00:00:32.870394 /GVMM/HostCpus/2/CurTimerHz             0 Hz
00:00:32.870405 /GVMM/HostCpus/2/DesiredHz              0 Hz
00:00:32.870416 /GVMM/HostCpus/2/PPTChanges             0 times
00:00:32.870427 /GVMM/HostCpus/2/PPTStarts              0 times
00:00:32.870439 /GVMM/HostCpus/2/idxCpuSet              2 
00:00:32.870450 /GVMM/HostCpus/3                        3 
00:00:32.870461 /GVMM/HostCpus/3/CurTimerHz             0 Hz
00:00:32.870473 /GVMM/HostCpus/3/DesiredHz              0 Hz
00:00:32.870484 /GVMM/HostCpus/3/PPTChanges             0 times
00:00:32.870495 /GVMM/HostCpus/3/PPTStarts              0 times
00:00:32.870506 /GVMM/HostCpus/3/idxCpuSet              3 
00:00:32.870518 /GVMM/HostCpus/4                        4 
00:00:32.870529 /GVMM/HostCpus/4/CurTimerHz             0 Hz
00:00:32.870541 /GVMM/HostCpus/4/DesiredHz              0 Hz
00:00:32.870552 /GVMM/HostCpus/4/PPTChanges             0 times
00:00:32.870564 /GVMM/HostCpus/4/PPTStarts              0 times
00:00:32.870579 /GVMM/HostCpus/4/idxCpuSet              4 
00:00:32.870591 /GVMM/HostCpus/5                        5 
00:00:32.870603 /GVMM/HostCpus/5/CurTimerHz             0 Hz
00:00:32.870615 /GVMM/HostCpus/5/DesiredHz              0 Hz
00:00:32.870628 /GVMM/HostCpus/5/PPTChanges             0 times
00:00:32.870639 /GVMM/HostCpus/5/PPTStarts              0 times
00:00:32.870651 /GVMM/HostCpus/5/idxCpuSet              5 
00:00:32.870662 /GVMM/HostCpus/6                        6 
00:00:32.870674 /GVMM/HostCpus/6/CurTimerHz             0 Hz
00:00:32.870686 /GVMM/HostCpus/6/DesiredHz              0 Hz
00:00:32.870697 /GVMM/HostCpus/6/PPTChanges             0 times
00:00:32.870709 /GVMM/HostCpus/6/PPTStarts              0 times
00:00:32.870720 /GVMM/HostCpus/6/idxCpuSet              6 
00:00:32.870732 /GVMM/HostCpus/7                        7 
00:00:32.870744 /GVMM/HostCpus/7/CurTimerHz             0 Hz
00:00:32.870756 /GVMM/HostCpus/7/DesiredHz              0 Hz
00:00:32.870775 /GVMM/HostCpus/7/PPTChanges             0 times
00:00:32.870792 /GVMM/HostCpus/7/PPTStarts              0 times
00:00:32.870804 /GVMM/HostCpus/7/idxCpuSet              7 
00:00:32.870816 /GVMM/Sum/HaltBlocking               1009 calls
00:00:32.870829 /GVMM/Sum/HaltCalls                 11601 calls
00:00:32.870841 /GVMM/Sum/HaltNotBlocking           10592 calls
00:00:32.870854 /GVMM/Sum/HaltTimeouts                650 calls
00:00:32.870866 /GVMM/Sum/HaltWakeUps                   0 calls
00:00:32.870878 /GVMM/Sum/PokeCalls                   515 calls
00:00:32.870891 /GVMM/Sum/PokeNotBusy                 160 calls
00:00:32.870903 /GVMM/Sum/PollCalls                     3 calls
00:00:32.870915 /GVMM/Sum/PollHalts                     0 calls
00:00:32.870927 /GVMM/Sum/PollWakeUps                   0 calls
00:00:32.870939 /GVMM/Sum/WakeUpCalls                 411 calls
00:00:32.870951 /GVMM/Sum/WakeUpNotHalted             268 calls
00:00:32.870963 /GVMM/Sum/WakeUpWakeUps                 0 calls
00:00:32.870975 /GVMM/VM/HaltBlocking                1009 calls
00:00:32.870987 /GVMM/VM/HaltCalls                  11601 calls
00:00:32.871000 /GVMM/VM/HaltNotBlocking            10592 calls
00:00:32.871012 /GVMM/VM/HaltTimeouts                 650 calls
00:00:32.871025 /GVMM/VM/HaltWakeUps                    0 calls
00:00:32.871037 /GVMM/VM/PokeCalls                    515 calls
00:00:32.871049 /GVMM/VM/PokeNotBusy                  160 calls
00:00:32.871061 /GVMM/VM/PollCalls                      3 calls
00:00:32.871076 /GVMM/VM/PollHalts                      0 calls
00:00:32.871088 /GVMM/VM/PollWakeUps                    0 calls
00:00:32.871100 /GVMM/VM/WakeUpCalls                  411 calls
00:00:32.871113 /GVMM/VM/WakeUpNotHalted              268 calls
00:00:32.871126 /GVMM/VM/WakeUpWakeUps                  0 calls
00:00:32.871137 /GVMM/VMs                               1 calls
00:00:32.871150 /HM/CPU0/Exit/HostNmiInGC               0 times
00:00:32.871163 /HM/CPU0/Switch/Preempting              0 times
00:00:32.871174 /IEM/CPU0/CodeTlb-Misses                0 count
00:00:32.871186 /IEM/CPU0/CodeTlb-PhysRev        ffffffffffff9c00 
00:00:32.871200 /IEM/CPU0/CodeTlb-Revision       fffff38000000000 
00:00:32.871213 /IEM/CPU0/CodeTlb-SlowReads             0 
00:00:32.871225 /IEM/CPU0/DataTlb-Misses                0 count
00:00:32.871237 /IEM/CPU0/DataTlb-PhysRev        ffffffffffff9c00 
00:00:32.871250 /IEM/CPU0/DataTlb-Revision       fffff38000000000 
00:00:32.871263 /IEM/CPU0/cInstructions            857730 count
00:00:32.871275 /IEM/CPU0/cLongJumps                    1 bytes
00:00:32.871287 /IEM/CPU0/cPendingCommit                0 bytes
00:00:32.871299 /IEM/CPU0/cPotentialExits          960154 count
00:00:32.871311 /IEM/CPU0/cRetAspectNotImplemented        0 count
00:00:32.871323 /IEM/CPU0/cRetErrStatuses               0 count
00:00:32.871335 /IEM/CPU0/cRetInfStatuses               1 count
00:00:32.871347 /IEM/CPU0/cRetInstrNotImplemented        0 count
00:00:32.871358 /IEM/CPU0/cbWritten               1056775 bytes
00:00:32.871371 /MM/HyperHeap/cbFree               844048 bytes
00:00:32.871384 /MM/HyperHeap/cbHeap              1048256 bytes
00:00:32.871396 /PDM/BlkCache/cbCached                  0 bytes
00:00:32.871408 /PDM/BlkCache/cbCachedFru               0 bytes
00:00:32.871419 /PDM/BlkCache/cbCachedMruIn             0 bytes
00:00:32.871431 /PDM/BlkCache/cbCachedMruOut            0 bytes
00:00:32.871442 /PDM/BlkCache/cbMax               5242880 bytes
00:00:32.871454 /PDM/CritSects/8237A#0Auto/ContentionR3        0 times
00:00:32.871466 /PDM/CritSects/8237A#0Auto/ContentionRZLock        0 times
00:00:32.871477 /PDM/CritSects/8237A#0Auto/ContentionRZUnlock        0 times
00:00:32.871489 /PDM/CritSects/AHCI#0/ContentionR3        0 times
00:00:32.871500 /PDM/CritSects/AHCI#0/ContentionRZLock        0 times
00:00:32.871512 /PDM/CritSects/AHCI#0/ContentionRZUnlock        0 times
00:00:32.871524 /PDM/CritSects/ATA#0-Ctl/ContentionR3        0 times
00:00:32.871541 /PDM/CritSects/ATA#0-Ctl/ContentionRZLock        0 times
00:00:32.871558 /PDM/CritSects/ATA#0-Ctl/ContentionRZUnlock        0 times
00:00:32.871570 /PDM/CritSects/ATA#0-Req/ContentionR3        0 times
00:00:32.871585 /PDM/CritSects/ATA#0-Req/ContentionRZLock        0 times
00:00:32.871597 /PDM/CritSects/ATA#0-Req/ContentionRZUnlock        0 times
00:00:32.871608 /PDM/CritSects/ATA#1-Ctl/ContentionR3        0 times
00:00:32.871620 /PDM/CritSects/ATA#1-Ctl/ContentionRZLock        2 times
00:00:32.871631 /PDM/CritSects/ATA#1-Ctl/ContentionRZUnlock        0 times
00:00:32.871643 /PDM/CritSects/ATA#1-Req/ContentionR3        0 times
00:00:32.871654 /PDM/CritSects/ATA#1-Req/ContentionRZLock        0 times
00:00:32.871666 /PDM/CritSects/ATA#1-Req/ContentionRZUnlock        0 times
00:00:32.871677 /PDM/CritSects/E1000#0/ContentionR3        0 times
00:00:32.871689 /PDM/CritSects/E1000#0/ContentionRZLock        0 times
00:00:32.871700 /PDM/CritSects/E1000#0/ContentionRZUnlock        0 times
00:00:32.871712 /PDM/CritSects/E1000#0RX/ContentionR3        0 times
00:00:32.871723 /PDM/CritSects/E1000#0RX/ContentionRZLock        0 times
00:00:32.871735 /PDM/CritSects/E1000#0RX/ContentionRZUnlock        0 times
00:00:32.871746 /PDM/CritSects/E1000#0TX/ContentionR3        0 times
00:00:32.871757 /PDM/CritSects/E1000#0TX/ContentionRZLock        0 times
00:00:32.871768 /PDM/CritSects/E1000#0TX/ContentionRZUnlock        0 times
00:00:32.871781 /PDM/CritSects/EM-REM/ContentionR3        0 times
00:00:32.871792 /PDM/CritSects/EM-REM/ContentionRZLock        0 times
00:00:32.871804 /PDM/CritSects/EM-REM/ContentionRZUnlock        0 times
00:00:32.871815 /PDM/CritSects/FTM/ContentionR3         0 times
00:00:32.871821 /PDM/CritSects/FTM/ContentionRZLock        0 times
00:00:32.871821 /PDM/CritSects/FTM/ContentionRZUnlock        0 times
00:00:32.871821 /PDM/CritSects/GIMDev#0Auto/ContentionR3        0 times
00:00:32.871821 /PDM/CritSects/GIMDev#0Auto/ContentionRZLock        0 times
00:00:32.871821 /PDM/CritSects/GIMDev#0Auto/ContentionRZUnlock        0 times
00:00:32.871821 /PDM/CritSects/MM-HYPER/ContentionR3        0 times
00:00:32.871821 /PDM/CritSects/MM-HYPER/ContentionRZLock        0 times
00:00:32.871821 /PDM/CritSects/MM-HYPER/ContentionRZUnlock        0 times
00:00:32.871821 /PDM/CritSects/NOP/ContentionR3         0 times
00:00:32.871821 /PDM/CritSects/NOP/ContentionRZLock        0 times
00:00:32.871821 /PDM/CritSects/NOP/ContentionRZUnlock        0 times
00:00:32.871821 /PDM/CritSects/OHCI#0Irq/ContentionR3        0 times
00:00:32.871821 /PDM/CritSects/OHCI#0Irq/ContentionRZLock        0 times
00:00:32.871821 /PDM/CritSects/OHCI#0Irq/ContentionRZUnlock        0 times
00:00:32.871821 /PDM/CritSects/PDM/ContentionR3         0 times
00:00:32.871821 /PDM/CritSects/PDM/ContentionRZLock        0 times
00:00:32.871821 /PDM/CritSects/PDM/ContentionRZUnlock        0 times
00:00:32.871821 /PDM/CritSects/PGM/ContentionR3         0 times
00:00:32.871821 /PDM/CritSects/PGM/ContentionRZLock        0 times
00:00:32.871821 /PDM/CritSects/PGM/ContentionRZUnlock        0 times
00:00:32.871821 /PDM/CritSects/REM-Register/ContentionR3        0 times
00:00:32.871821 /PDM/CritSects/REM-Register/ContentionRZLock        0 times
00:00:32.871821 /PDM/CritSects/REM-Register/ContentionRZUnlock        0 times
00:00:32.872095 /PDM/CritSects/TM Timer Lock/ContentionR3        0 times
00:00:32.872106 /PDM/CritSects/TM Timer Lock/ContentionRZLock        0 times
00:00:32.872118 /PDM/CritSects/TM Timer Lock/ContentionRZUnlock        0 times
00:00:32.872129 /PDM/CritSects/TM VirtualSync Lock/ContentionR3        0 times
00:00:32.872141 /PDM/CritSects/TM VirtualSync Lock/ContentionRZLock        0 times
00:00:32.872153 /PDM/CritSects/TM VirtualSync Lock/ContentionRZUnlock        0 times
00:00:32.872164 /PDM/CritSects/VGA#0/ContentionR3        0 times
00:00:32.872176 /PDM/CritSects/VGA#0/ContentionRZLock        0 times
00:00:32.872187 /PDM/CritSects/VGA#0/ContentionRZUnlock        0 times
00:00:32.872200 /PDM/CritSects/VGA#0_IRQ/ContentionR3        0 times
00:00:32.872226 /PDM/CritSects/VGA#0_IRQ/ContentionRZLock        0 times
00:00:32.872245 /PDM/CritSects/VGA#0_IRQ/ContentionRZUnlock        0 times
00:00:32.872257 /PDM/CritSects/VMMDev#0/ContentionR3        0 times
00:00:32.872269 /PDM/CritSects/VMMDev#0/ContentionRZLock        0 times
00:00:32.872281 /PDM/CritSects/VMMDev#0/ContentionRZUnlock        0 times
00:00:32.872293 /PDM/CritSects/acpi#0/ContentionR3        0 times
00:00:32.872305 /PDM/CritSects/acpi#0/ContentionRZLock        0 times
00:00:32.872316 /PDM/CritSects/acpi#0/ContentionRZUnlock        0 times
00:00:32.872328 /PDM/CritSects/ichac97#0Auto/ContentionR3        0 times
00:00:32.872339 /PDM/CritSects/ichac97#0Auto/ContentionRZLock        0 times
00:00:32.872351 /PDM/CritSects/ichac97#0Auto/ContentionRZUnlock        0 times
00:00:32.872362 /PDM/CritSects/mc146818#0Auto/ContentionR3        0 times
00:00:32.872374 /PDM/CritSects/mc146818#0Auto/ContentionRZLock        0 times
00:00:32.872385 /PDM/CritSects/mc146818#0Auto/ContentionRZUnlock        0 times
00:00:32.872396 /PDM/CritSects/pcarch#0Auto/ContentionR3        0 times
00:00:32.872408 /PDM/CritSects/pcarch#0Auto/ContentionRZLock        0 times
00:00:32.872419 /PDM/CritSects/pcarch#0Auto/ContentionRZUnlock        0 times
00:00:32.872430 /PDM/CritSects/pcbios#0Auto/ContentionR3        0 times
00:00:32.872441 /PDM/CritSects/pcbios#0Auto/ContentionRZLock        0 times
00:00:32.872453 /PDM/CritSects/pcbios#0Auto/ContentionRZUnlock        0 times
00:00:32.872464 /PDM/CritSects/pckbd#0Auto/ContentionR3        0 times
00:00:32.872475 /PDM/CritSects/pckbd#0Auto/ContentionRZLock        0 times
00:00:32.872486 /PDM/CritSects/pckbd#0Auto/ContentionRZUnlock        0 times
00:00:32.872497 /PDM/CritSects/pit#0/ContentionR3        0 times
00:00:32.872508 /PDM/CritSects/pit#0/ContentionRZLock        0 times
00:00:32.872519 /PDM/CritSects/pit#0/ContentionRZUnlock        0 times
00:00:32.872530 /PDM/CritSects/usb-ohci#0Auto/ContentionR3        0 times
00:00:32.872542 /PDM/CritSects/usb-ohci#0Auto/ContentionRZLock        0 times
00:00:32.872553 /PDM/CritSects/usb-ohci#0Auto/ContentionRZUnlock        0 times
00:00:32.872564 /PDM/CritSectsRw/IOM Lock/ContentionR3EnterExcl        0 times
00:00:32.872578 /PDM/CritSectsRw/IOM Lock/ContentionR3EnterShared        0 times
00:00:32.872597 /PDM/CritSectsRw/IOM Lock/ContentionRZEnterExcl        0 times
00:00:32.872616 /PDM/CritSectsRw/IOM Lock/ContentionRZEnterShared        0 times
00:00:32.872632 /PDM/CritSectsRw/IOM Lock/ContentionRZLeaveExcl        0 times
00:00:32.872643 /PDM/CritSectsRw/IOM Lock/ContentionRZLeaveShared        0 times
00:00:32.872655 /PDM/CritSectsRw/IOM Lock/R3EnterExcl      652 times
00:00:32.872667 /PDM/CritSectsRw/IOM Lock/R3EnterShared    15866 times
00:00:32.872679 /PDM/CritSectsRw/IOM Lock/RZEnterExcl        0 times
00:00:32.872690 /PDM/CritSectsRw/IOM Lock/RZEnterShared  2243807 times
00:00:32.872703 /PDM/Queue/AHCI-Xmit/AllocFailures        0 times
00:00:32.872714 /PDM/Queue/AHCI-Xmit/Flush              0 calls
00:00:32.872726 /PDM/Queue/AHCI-Xmit/FlushLeftovers        0 times
00:00:32.872737 /PDM/Queue/AHCI-Xmit/Insert             0 calls
00:00:32.872749 /PDM/Queue/AHCI-Xmit/cItems            60 count
00:00:32.872761 /PDM/Queue/AHCI-Xmit/cbItem            32 bytes
00:00:32.872773 /PDM/Queue/DevHlp/AllocFailures         0 times
00:00:32.872785 /PDM/Queue/DevHlp/Flush                 0 calls
00:00:32.872797 /PDM/Queue/DevHlp/FlushLeftovers        0 times
00:00:32.872808 /PDM/Queue/DevHlp/Insert                0 calls
00:00:32.872820 /PDM/Queue/DevHlp/cItems                8 count
00:00:32.872832 /PDM/Queue/DevHlp/cbItem               64 bytes
00:00:32.872843 /PDM/Queue/E1000-Rcv/AllocFailures        0 times
00:00:32.872855 /PDM/Queue/E1000-Rcv/Flush              0 calls
00:00:32.872867 /PDM/Queue/E1000-Rcv/FlushLeftovers        0 times
00:00:32.872878 /PDM/Queue/E1000-Rcv/Insert             0 calls
00:00:32.872890 /PDM/Queue/E1000-Rcv/cItems             1 count
00:00:32.872913 /PDM/Queue/E1000-Rcv/cbItem            24 bytes
00:00:32.872931 /PDM/Queue/E1000-Xmit/AllocFailures        0 times
00:00:32.872944 /PDM/Queue/E1000-Xmit/Flush             0 calls
00:00:32.872956 /PDM/Queue/E1000-Xmit/FlushLeftovers        0 times
00:00:32.872981 /PDM/Queue/E1000-Xmit/Insert            0 calls
00:00:32.873000 /PDM/Queue/E1000-Xmit/cItems            1 count
00:00:32.873012 /PDM/Queue/E1000-Xmit/cbItem           24 bytes
00:00:32.873025 /PDM/Queue/Keyboard/AllocFailures        0 times
00:00:32.873036 /PDM/Queue/Keyboard/Flush               0 calls
00:00:32.873048 /PDM/Queue/Keyboard/FlushLeftovers        0 times
00:00:32.873072 /PDM/Queue/Keyboard/Insert             26 calls
00:00:32.873095 /PDM/Queue/Keyboard/cItems             64 count
00:00:32.873114 /PDM/Queue/Keyboard/cbItem             32 bytes
00:00:32.873132 /PDM/Queue/Mouse/AllocFailures          0 times
00:00:32.873150 /PDM/Queue/Mouse/Flush                  0 calls
00:00:32.873183 /PDM/Queue/Mouse/FlushLeftovers         0 times
00:00:32.873202 /PDM/Queue/Mouse/Insert                 0 calls
00:00:32.873222 /PDM/Queue/Mouse/cItems               128 count
00:00:32.873241 /PDM/Queue/Mouse/cbItem                48 bytes
00:00:32.873258 /PDM/Queue/Mouse_1/AllocFailures        0 times
00:00:32.873275 /PDM/Queue/Mouse_1/Flush                0 calls
00:00:32.873294 /PDM/Queue/Mouse_1/FlushLeftovers        0 times
00:00:32.873311 /PDM/Queue/Mouse_1/Insert               0 calls
00:00:32.873330 /PDM/Queue/Mouse_1/cItems             128 count
00:00:32.873343 /PDM/Queue/Mouse_1/cbItem              48 bytes
00:00:32.873355 /PGM/CPU0/cA20Changes                   2 times
00:00:32.873367 /PGM/CPU0/cGuestModeChanges           643 times
00:00:32.873379 /PGM/ChunkR3Map/Mapped                 27 count
00:00:32.873391 /PGM/ChunkR3Map/Unmapped                0 count
00:00:32.873403 /PGM/ChunkR3Map/c                      27 count
00:00:32.873428 /PGM/ChunkR3Map/cMax             4294967295 count
00:00:32.873444 /PGM/LargePage/Recheck                  0 times
00:00:32.873456 /PGM/LargePage/Refused                  2 times
00:00:32.873468 /PGM/LargePage/Reused                   0 times
00:00:32.873482 /PGM/Page/cAllPages                267334 count
00:00:32.873495 /PGM/Page/cBalloonedPages               0 count
00:00:32.873506 /PGM/Page/cHandyPages                 128 count
00:00:32.873518 /PGM/Page/cLargePages                   0 count
00:00:32.873530 /PGM/Page/cLargePagesDisabled           0 count
00:00:32.873542 /PGM/Page/cMonitoredPages               0 count
00:00:32.873553 /PGM/Page/cPrivatePages             18434 count
00:00:32.873565 /PGM/Page/cPureMmioPages               36 count
00:00:32.873580 /PGM/Page/cReadLockedPages              0 count
00:00:32.873592 /PGM/Page/cReusedSharedPages            0 count
00:00:32.873604 /PGM/Page/cSharedPages                  0 count
00:00:32.873620 /PGM/Page/cWriteLockedPages             0 count
00:00:32.873639 /PGM/Page/cWrittenToPages               0 count
00:00:32.873657 /PGM/Page/cZeroPages               248864 count
00:00:32.873677 /PGM/ShMod/Check                        0 ticks/call (           0 ticks,       0 times, max         0, min      -1)
00:00:32.873702 /PGM/cRelocations                       0 times
00:00:32.873723 /PROF/CPU0/EM/Capped                    0 ticks/call (           0 ticks,       0 times, max         0, min      -1)
00:00:32.873745 /PROF/CPU0/EM/ForcedActions         22269 times
00:00:32.873766 /PROF/CPU0/EM/Halted                  532 times
00:00:32.873779 /PROF/CPU0/EM/RAWTotal                  0 times
00:00:32.873791 /PROF/CPU0/EM/REMTotal                  0 times
00:00:32.873804 /PROF/CPU0/EM/Total              47722138959 ticks/call ( 47722138959 ticks,       1 times, max 47722138959, min 47722138959)
00:00:32.873823 /PROF/CPU0/VM/Halt/Block           232322 ns/call (  2693782117 ticks,   11595 times, max   5457692, min       1)
00:00:32.873841 /PROF/CPU0/VM/Halt/BlockInsomnia        0 ns/call (           0 ticks,       0 times, max         0, min      -1)
00:00:32.874041 /PROF/CPU0/VM/Halt/BlockOnTime          0 ns/call (           0 ticks,       0 times, max         0, min      -1)
00:00:32.874077 /PROF/CPU0/VM/Halt/BlockOverslept        0 ns/call (           0 ticks,       0 times, max         0, min      -1)
00:00:32.874100 /PROF/CPU0/VM/Halt/Timers            2008 ns/call (    43099499 ticks,   21462 times, max    256715, min       2)
00:00:32.874126 /PROF/CPU0/VM/Halt/Yield             8230 ns/call (       24691 ticks,       3 times, max      9076, min    7522)
00:00:32.874151 /Public/Net/E1k0/BytesReceived          0 bytes
00:00:32.874170 /Public/Net/E1k0/BytesTransmitted        0 bytes
00:00:32.874187 /REM/TbFlushCount                       0 times
00:00:32.874205 /REM/TbPhysInvldCount                   0 times
00:00:32.874225 /REM/TlbFlushCount                      1 times
00:00:32.874243 /SELM/LoadHidSel/GstReadErrors          0 times
00:00:32.874261 /SELM/LoadHidSel/NoGoodGuest            0 times
00:00:32.874283 /TM/CPU/00/cNsExecuting          11995926966 ns
00:00:32.874306 GUI: UIMachineView::sltHandleNotifyChange: Screen=0, Size=720x400
00:00:32.874387 /TM/CPU/00/cNsHalted             2752623901 ns
00:00:32.874445 /TM/CPU/00/cNsOther              6992614554 ns
00:00:32.874473 /TM/CPU/00/cNsTotal              21741165421 ns
00:00:32.874498 /TM/CPU/00/cPeriodsExecuting      1323399 count
00:00:32.874521 /TM/CPU/00/cPeriodsHalted             531 count
00:00:32.874543 /TM/CPU/00/pctExecuting                47 %
00:00:32.874564 /TM/CPU/00/pctHalted                   36 %
00:00:32.874589 /TM/CPU/00/pctOther                    16 %
00:00:32.874611 /TM/CPU/pctExecuting                   47 %
00:00:32.874632 /TM/CPU/pctHalted                      36 %
00:00:32.874653 /TM/CPU/pctOther                       16 %
00:00:32.874673 /TM/MaxHzHint                           0 Hz
00:00:32.874692 /TM/R0/1nsSteps                       976 times
00:00:32.874712 /TM/R3/1nsSteps                      1840 times
00:00:32.874733 /TM/TSC/offCPU0                         0 ticks
00:00:32.874753 /TM/VirtualSync/CurrentOffset      413794 ns
00:00:32.874774 /VUSB/0/cUrbsInPool                     0 count
00:00:32.874797 ********************* End of statistics **********************
00:00:32.875059 VUSB: Detached 'HidMouse' from port 1
00:00:32.882987 NAT: Zone(nm:mbuf_cluster, used:0)
00:00:32.884832 NAT: Zone(nm:mbuf_packet, used:0)
00:00:32.884885 NAT: Zone(nm:mbuf, used:0)
00:00:32.885271 NAT: Zone(nm:mbuf_jumbo_pagesize, used:0)
00:00:32.887215 NAT: Zone(nm:mbuf_jumbo_9k, used:0)
00:00:32.888122 NAT: Zone(nm:mbuf_jumbo_16k, used:0)
00:00:32.888645 NAT: Zone(nm:mbuf_ext_refcnt, used:0)
00:00:32.891337 GIM: KVM: Resetting MSRs
00:00:32.893341 Changing the VM state from 'DESTROYING' to 'TERMINATED'
00:00:32.898049 Console: Machine state changed to 'PoweredOff'
00:00:33.213364 GUI: Passing request to close Runtime UI from machine-logic to UI session.
