{
  "realm": "myrealm",
  "auth-server-url": "https://legalt-accelerated-keycloak.herokuapp.com/auth/",
  "ssl-required": "external",
  "resource": "reactclient",
  "public-client": true,
  "confidential-port": 0
}
