1 1 1
2 1 2
999999 999999 259
743771 509752 509
679753 983565 525
666501 704162 442
535357 777927 509
29344 856177 525
827569 831527 419
835717 38646 509
663066 573014 509
341678 76225 443
179956 807262 509
258222 205245 443
358573 317569 441
767353 691589 504
772532 682420 504
18135 598568 470
751991 8751 509
979598 957 525
982580 986314 427
432212 24463 449
839162 961052 507
558291 693279 509
857632 337029 525
16093 503440 449
851892 844091 419
845008 909153 445
806634 352487 509
415574 638087 509
868341 857620 388
92195 901464 525
85831 83022 320
661702 535894 509
613830 370349 470
898462 237655 525
225255 498727 449
582398 815729 509
178078 592469 470
70956 208767 383
278729 336266 389
359662 411516 449
859256 521390 525
134169 285597 443
518396 154188 470
155282 780566 509
171907 367183 443
639673 556037 509
497289 379310 449
493280 350271 449
574598 346555 470
847356 411844 525
454776 294219 449
915414 877107 476
120104 955410 525
60183 285812 443
998275 908150 507
930977 397263 525
96186 533513 470
864023 512647 525
473362 385082 449
73160 202963 383
251885 920759 525
482432 926842 525
558339 535694 452
405067 411352 449
488222 720009 509
325885 628463 509
652511 633128 416
854130 115097 525
508176 453389 444
53625 188012 383
938127 682135 525
384826 416896 449
332655 350087 441
216323 565735 470
37486 253065 443
823005 170702 509
157163 617087 470
59759 904125 525
397901 280444 441
526590 556884 452
327051 232293 407
696156 84134 509
312175 549899 470
888340 356680 525
937374 563143 525
887027 687366 525
256896 484943 449
613890 144944 470
236246 619147 470
464493 172888 449
322393 720970 509
491813 800291 509
241415 575573 470
696072 987437 525
766143 460042 509
354881 692048 509
95761 451480 449
846380 506374 525
302125 119619 443
27001 765835 509
573604 181073 470
718267 9937 509
351480 53805 443
107042 642086 509
921896 216623 525
260794 293859 407
479581 512847 470
432457 9514 449
80923 797560 509
62265 387812 443
333498 340432 366
628640 917601 525
309826 273284 389
429443 802009 509
504826 600468 470
812334 789273 468
366162 154789 443
873323 351032 525
658645 413356 509
255426 147089 443
146798 421927 449
767154 910050 525
583753 807311 509
720734 60321 509
566362 738783 509
259948 398533 441
660383 834665 504
705892 353709 509
204389 776901 509
663968 13503 509
772041 214090 509
532545 176763 470
113918 989285 525
31422 643787 509
31270 26205 308
965000 178682 525
927251 72838 525
389560 107866 443
819978 650860 504
503762 281259 449
327195 514050 470
538482 198312 470
936651 87304 525
746110 496412 509
429123 964410 525
482169 617130 470
120965 546998 470
575560 735358 509
897433 26997 525
244886 48017 443
595863 911968 525
499123 578393 470
112016 620790 470
260255 304583 407
761991 126155 509
905577 896684 401
315010 176429 443
892416 442139 525
438756 30778 449
690473 62932 509
898329 847784 445
424905 799559 509
12835 2209 268
347493 238237 441
921425 907451 476
418060 359810 449
240427 474279 449
603042 665243 509
254345 430530 449
176742 994095 525
563929 34237 470
355961 414720 449
88842 59798 351
569464 186361 470
165670 721441 509
809047 462762 509
658657 307024 509
692476 746710 504
332287 767046 509
549471 238088 470
779219 827720 468
784540 986674 525
217242 367253 443
971470 696654 525
462589 650765 509
703197 644685 442
972446 357807 525
770049 245705 509
196901 78125 383
807174 5260 509
304100 767415 509
530433 374490 470
934389 685397 525
931102 144511 525
242924 797229 509
879086 659813 525
398074 862651 525
163492 693026 509
691122 574362 509
454228 165203 449
440120 453207 387
984583 223077 525
52130 540108 470
961908 225622 525
216500 879030 525
445093 525749 470
959885 884235 507
977244 631845 525
527141 961021 525
850158 541266 525
506629 75781 449
828692 791234 468
389821 140396 443
374180 618920 470
551475 764630 509
329079 951225 525
477870 459597 444
639842 576445 509
176409 282480 443
690620 869886 525
486958 650024 509
321837 651783 509
625634 452483 470
728484 254163 509
16693 403154 443
129398 884674 525
904332 848708 445
553534 78817 470
581704 550398 421
942504 675649 525
395594 96776 443
648069 785521 504
146965 657889 509
117871 296820 443
615317 725946 509
930467 187228 525
787911 572753 509
641274 285520 509
270048 516926 470
846902 960092 507
826143 82187 509
249949 673481 509
512276 312607 470
366756 573226 470
460583 995923 525
390324 590710 470
334198 438626 449
338539 133227 443
35754 588283 470
644643 304063 509
751288 175060 509
444860 144658 449
460485 622081 470
701018 734590 504
694855 604750 509
363998 887106 525
446359 799192 509
229581 515276 470
634837 641054 416
784847 847774 525
783655 32465 509
792079 34358 509
447761 359998 449
418633 285945 449
170204 157449 370
997113 490598 525
232574 966785 525
624387 269995 470
83135 176394 383
812485 563362 509
220266 707535 509
601553 502377 470
743706 609129 509
929876 941271 507
960789 337398 525
175192 11273 383
181129 542549 470
898946 483028 525
