{
  "project_info": {
    "project_number": "397985505676",
    "firebase_url": "https://mydigitalmarvel.firebaseio.com",
    "project_id": "mydigitalmarvel",
    "storage_bucket": "mydigitalmarvel.appspot.com"
  },
  "client": [
    {
      "client_info": {
        "mobilesdk_app_id": "1:397985505676:android:77f8b8f626620f56c576a9",
        "android_client_info": {
          "package_name": "fr.mds.mydigitalmarvel"
        }
      },
      "oauth_client": [
        {
          "client_id": "397985505676-chkvfgj7lcjdsqbpk52b2fja3dshp7rs.apps.googleusercontent.com",
          "client_type": 3
        }
      ],
      "api_key": [
        {
          "current_key": "AIzaSyAtxNDRiYl1jJPo0uwEAQaWIVxntVtAwk4"
        }
      ],
      "services": {
        "appinvite_service": {
          "other_platform_oauth_client": [
            {
              "client_id": "397985505676-chkvfgj7lcjdsqbpk52b2fja3dshp7rs.apps.googleusercontent.com",
              "client_type": 3
            }
          ]
        }
      }
    }
  ],
  "configuration_version": "1"
}