;small;medium;large
50;97.15617715617715;95.62496479218629;99.12698412698414
45;97.15617715617715;94.59500206485517;99.12698412698414
40;96.43049932523618;92.84734231719541;98.57142857142858
35;95.15524679998366;91.57061298198654;98.57142857142858
30;93.86277664387713;90.46126553930576;98.13932980599647
25;93.34704237814285;87.80583260317105;98.13932980599647
20;91.83064211174259;85.01702528237199;97.05908289241621
15;88.86794508654556;81.8116257650918;96.78130511463844
10;81.81432635679047;74.83890016908204;94.09692159692159
5;69.34929139175551;62.000996257826266;86.89648006314673
