;Phalanx.9;BoneDist.9;DistToPred.9;Speed.9;Phalanx.28;BoneDist.28;DistToPred.28;Speed.28;Phalanx.8;BoneDist.8;DistToPred.8;Speed.8;Phalanx.12;BoneDist.12;DistToPred.12;Speed.12;Phalanx.15;BoneDist.15;DistToPred.15;Speed.15;Phalanx.27;BoneDist.27;DistToPred.27;Speed.27;Phalanx.31;BoneDist.31;DistToPred.31;Speed.31;Phalanx.6;BoneDist.6;DistToPred.6;Speed.6;Phalanx.2;BoneDist.2;DistToPred.2;Speed.2;Phalanx.5;BoneDist.5;DistToPred.5;Speed.5;Phalanx.11;BoneDist.11;DistToPred.11;Speed.11;Phalanx.34;BoneDist.34;DistToPred.34;Speed.34;Phalanx.37;BoneDist.37;DistToPred.37;Speed.37;Phalanx.7;BoneDist.7;DistToPred.7;Speed.7;Phalanx.30;BoneDist.30;DistToPred.30;Speed.30;Phalanx.25;BoneDist.25;DistToPred.25;Speed.25;Phalanx.18;BoneDist.18;DistToPred.18;Speed.18;Phalanx.23;BoneDist.23;DistToPred.23;Speed.23;Phalanx.24;BoneDist.24;DistToPred.24;Speed.24;Phalanx.33;BoneDist.33;DistToPred.33;Speed.33;Phalanx.36;BoneDist.36;DistToPred.36;Speed.36;Phalanx.10;BoneDist.10;DistToPred.10;Speed.10;Phalanx.14;BoneDist.14;DistToPred.14;Speed.14;Phalanx.17;BoneDist.17;DistToPred.17;Speed.17;Phalanx.13;BoneDist.13;DistToPred.13;Speed.13;Phalanx.16;BoneDist.16;DistToPred.16;Speed.16;Phalanx.0;BoneDist.0;DistToPred.0;Speed.0;Phalanx.1;BoneDist.1;DistToPred.1;Speed.1;Phalanx.3;BoneDist.3;DistToPred.3;Speed.3;Phalanx.4;BoneDist.4;DistToPred.4;Speed.4;Phalanx.26;BoneDist.26;DistToPred.26;Speed.26;Phalanx.29;BoneDist.29;DistToPred.29;Speed.29;Phalanx.32;BoneDist.32;DistToPred.32;Speed.32;Phalanx.35;BoneDist.35;DistToPred.35;Speed.35;Phalanx.19;BoneDist.19;DistToPred.19;Speed.19;Phalanx.20;BoneDist.20;DistToPred.20;Speed.20;Phalanx.21;BoneDist.21;DistToPred.21;Speed.21;Phalanx.22;BoneDist.22;DistToPred.22;Speed.22
0;2.0739791020408194;0.0;21.71381595306123;-5.0599939560950355;2.550201507246369;0.0;15.782871488405798;-3.7324191982655437;5.340582547169804;0.0;31.251792490566032;-4.564973796094963;2.296096949152543;0.0;16.048998781355934;-4.8918070439342465;3.319395555555551;0.0;18.686803644444446;-5.722189061895406;2.0165336829268248;0.0;18.167681439024392;-2.792804804112844;2.7412962500000027;0.0;15.895327604166667;-2.9559037609968057;2.2498456867469723;0.0;19.24623990361446;-5.387610029123975;18.963983333333346;0.0;66.14707944333416;-3.9278445959153783;7.54960526315789;0.0;33.23634263157895;-3.719109086348917;4.343755565217395;0.0;30.05155869782608;-4.131543522230419;6.853576944444425;0.0;19.633064311111113;-2.4351289127408586;9.239001909090888;0.0;24.56481186363636;-1.8840577964368812;12.649743333333328;0.0;28.383284041666666;-3.915716928517538;4.935786368421051;0.0;20.975404852631574;-2.2249409730484517;1.7823537750000065;0.0;17.5435421;-4.148830577444285;6.14221975757574;0.0;26.512695342424244;-5.777282128101705;6.253693333333358;0.0;43.145833333333336;-1.6699325315770295;7.484693846153822;0.0;29.644940461538457;-3.5696872839545084;9.639740454545448;0.0;25.447214863636365;-3.2237045764304564;15.529000470588224;0.0;29.223808588235297;-2.9463316188977022;3.4122188235294146;0.0;18.572613470588234;-4.153180235437588;11.61773748148149;0.0;46.96173929629631;-5.306662154840872;9.659619000000001;0.0;31.806973904761907;-4.721318833215603;18.70777335714286;0.0;41.13929421428571;-3.823791268300065;21.421970562500007;0.0;56.079830625;-5.354004049682704;1.4509619999999988;0.0;34.709902980232;-5.401460949597379;0.9505939999999988;0.0;34.709900999999995;-5.401460949597379;7.7535849999999895;0.0;40.286767999999995;-4.537814021438654;8.268039166666666;0.0;37.29384566666667;-5.405045600716488;4.929494285714272;0.0;23.197588071428576;-2.372907137182427;2.2098457142857035;0.0;14.545230571428572;-3.301453119752387;4.000876428571439;0.0;19.657692857142855;-2.292747402712487;6.503540166666667;0.0;19.06074883333333;-1.7204543171687074;32.695270000000015;0.0;79.599835;-1.9807496693706057;16.497090000000018;0.0;74.421655;-2.1264525206825606;50.71292000000001;0.0;99.41549;-1.9723600301280142;15.729525000000011;0.0;44.726405;-4.163464508491973
300;7.585244122448988;23.0877;49.632906428571424;8.936826008232172;51.290668;22.10955967741934;92.65477225806453;115.57279534559612;10.739284415094344;29.86061304347827;59.95461704347827;7.639325477309233;7.206269491525418;26.0843652173913;57.538767826086946;6.911504224218748;10.127052888888885;27.042867567567583;62.71872378378378;4.440809839167243;56.88135985365856;14.982590909090906;97.48251454545453;133.35612265421867;9.89615562499999;18.002380000000006;39.4248975;185.18953736066268;6.143949277108434;22.396507460317473;66.11302047619047;5.198957699628808;43.20568666666666;26.384212500000004;200.502;-9.628626655041252;42.05627263157894;52.76065999999998;130.96567000000002;-8.588443194445825;15.587978086956525;27.30037368421053;68.61645552631578;8.612875328867256;60.60786844444445;24.310143750000012;91.551171875;127.16874026525727;69.27477772727269;46.57992631578952;83.00619263157895;66.25714761365263;37.63130083333335;47.11900999999999;77.6373605;5.1545976523769585;88.79408221052631;30.266359999999995;130.01470233333333;124.25116705854417;46.669521749999994;23.018781818181818;112.8020896969697;75.70931406210985;10.782608424242433;29.710696153846147;76.8604676923077;5.578226040722543;17.79067999999998;4.952233333333297;58.221830000000004;193.89339272857856;24.485361538461554;64.2268625;102.24731625000001;-8.44859326020456;64.15207363636365;23.473573684210553;104.34138736842105;99.93528718090664;61.169062;34.749226666666665;84.97596733333334;98.96902902165445;37.49421647058824;53.164433333333314;84.61197783333333;5.616267023131069;28.97973488888889;38.78815652173911;80.52998652173913;3.5060929777763064;26.337901666666664;35.054733333333346;88.98272277777778;2.194886957403889;51.649573357142856;71.67156916666669;135.7898766666667;-10.599064537644168;47.48608268749999;76.00152571428573;173.81411214285717;-15.60133929782145;41.165799999999976;41.1310142857143;202.94994857142856;-12.120523166048654;38.663959999999975;41.1310142857143;202.94994857142856;-12.120523166048654;50.780845000000014;61.23915714285716;218.21892714285713;-7.064849070006304;22.96917833333332;25.56218571428571;191.24458857142855;-7.950204918408184;113.97294857142855;18.192307692307704;151.29673384615387;197.00853289959252;13.760648571428577;38.05410000000001;22.783923999999995;85.34382151673707;74.43604657142858;37.91959999999998;134.0825325;52.32464816629067;10.792990166666696;24.02930000000003;40.69856;113.90178897139279;25.60132000000002;21.36129999999997;53.150589999999994;182.6066407542387;10.345040000000026;10.690900000000005;61.01716999999999;195.46911961935052;12.047219999999982;28.920900000000035;102.6336;66.42686567140905;27.14214999999998;22.29719999999996;59.08185;-29.31234861412645
350;9.409229632653055;28.359758974358957;55.55410692307692;8.803602134546745;30.309291014492768;29.621398113207558;82.84439150943396;128.9811655027856;9.660935358490573;29.56445;65.71157105263157;10.10394978035581;8.90911186440678;28.503553061224483;58.13331979591837;6.4241101529306475;12.789175555555545;30.05208787878789;72.88125484848486;3.782140617958162;61.96868897560975;20.488291428571415;104.34543142857142;168.58902317229112;47.322161187499994;21.596556097560956;86.25270097560976;145.25243322485542;7.819791277108433;26.882775147058823;65.49568088235296;-0.9268408920483362;59.35143833333336;45.22434;178.34662;-13.344846187887958;26.56276315789471;51.73041818181814;167.39261;-19.3391371378401;10.01902752173913;29.35610833333333;65.98292333333333;9.975553612758974;51.320436944444445;31.755124242424245;79.79727242424242;181.42368754169252;41.557842045454535;28.742158823529444;81.12065588235293;117.33438729377359;27.614235000000008;38.5675166666667;78.54036166666667;6.992737064768904;94.02205284210525;35.97251724137931;140.25166379310346;163.37940377533755;35.02867475000001;24.26583057142858;83.33483742857143;99.8672580159289;12.595778121212128;26.325351851851863;84.44931370370371;3.4590541424429317;9.509920000000035;9.547550000000044;44.965615;177.21507246387085;18.102288461538475;46.39431818181823;84.57714818181819;56.86483167981355;64.77038145454544;33.71267058823531;115.75868000000001;90.71296482506688;100.11923258823529;40.18501428571432;132.42734071428572;98.97138944993392;33.360005882352944;41.781742857142845;83.76931285714288;7.49679505449513;25.146259851851852;40.90374545454545;81.58858545454545;-1.9266715842597664;24.525596904761898;39.79240624999999;96.80319125;-7.379585216640857;35.404109071428586;66.03970000000005;179.67759222222222;-4.333603771671644;56.8699756875;80.40528214285713;183.3168992857143;-7.310709871425886;64.24346999999997;43.40227142857141;232.03498142857143;-59.350597254359606;61.74162999999999;43.40227142857141;232.03498142857143;-59.350597254359606;82.53812;90.85844444444446;177.87203111111114;-17.082765756248378;48.217219166666666;35.22181249999998;198.05300375;-42.43088802284402;78.51437857142855;15.675667500000019;131.86396583333337;156.66824970202498;13.04263142857143;38.02770000000005;28.096149999999998;74.74758605847953;16.25980885714287;30.62636;52.663177999999995;109.02573340547163;15.320848000000055;30.113700000000087;47.66184;79.92342240179019;32.83167000000002;11.653900000000023;52.40985;207.37094202910572;16.17614;5.567150000000049;56.180815;207.1733333334535;20.29071999999994;7.8964000000000265;62.52997000000001;87.15869565222441;49.921549999999954;46.22464999999998;47.8458;2.3827276659821734
400;10.372534;31.55998170731707;60.41367682926828;10.514883490070957;22.093977855072467;29.48859827586208;74.75279120689656;159.24529483234454;13.657854150943388;34.72719761904763;65.63273030952381;10.76084167378626;9.887262372881354;33.52993469387754;72.53275612244899;11.355724450197588;15.883628222222208;30.891092500000003;75.37953825;8.609309032679102;20.45289902439025;21.513589285714286;69.0053525;169.4287177789941;62.21449266666667;26.172382500000015;109.08604424999999;168.44076227362908;5.953163903614453;32.32687745762712;70.91251101694914;9.529730691656093;78.04357166666667;51.34585454545456;177.5741081818182;2.5421568329975224;57.86808315789474;57.82015263157889;142.9126194736842;-0.18306184524433733;17.774944217391305;36.65514999999999;79.52491024999999;12.586933260697812;50.09452494444445;34.201543999999984;100.6237468;201.24692826058276;7.525665909090917;24.29745384615387;47.41289692307692;204.52662776412006;42.698440000000005;57.5725994736842;108.51962894736842;16.54934152103458;58.039967526315806;30.632716666666663;102.67077799999998;169.66501397216243;30.729907375000003;18.345220689655186;96.89228586206896;112.4840232941686;20.78841363636363;28.61274666666667;92.86634733333334;7.285617186036109;12.879893333333344;12.63459999999994;93.26059;259.6780000002362;28.78964999999999;35.081722222222226;58.35344555555556;89.13622845098273;84.87156072727274;27.58846;161.49872066666666;173.59576863695955;52.70430317647059;37.46450000000001;100.12402250000001;121.8824123687137;32.32597411764705;60.795499999999976;91.65036166666668;2.40724702656248;39.92490718518517;51.497752173913035;95.29662913043478;7.967302380039079;37.23734280952381;48.083977499999996;112.476839375;-1.1727746502621557;81.99592492857143;84.22479923076926;159.02563923076923;9.512146160924827;89.08995399999998;99.30710769230771;212.7123476923077;0.6197740976388157;85.08409399999998;76.03878999999999;155.92029309999998;-9.706528170449284;81.58151799999999;76.03878999999999;155.92029309999998;-9.706528170449284;75.88513500000002;94.08614999999998;188.78347250000002;-14.756605128321594;56.29383416666665;53.981763636363645;139.41329127272732;-6.846090977403462;2.120961428571441;19.774344444444452;52.41768444444445;154.82223845432088;5.578525714285724;29.09622500000006;29.4984925;108.7943432594582;86.17554500000004;46.74536;176.56555600000002;126.49493813601836;17.545364666666696;40.436400000000035;52.785154999999996;165.3948754031502;0.0;0.0;0.0;0.0;0.0;0.0;0.0;0.0;0.0;0.0;0.0;0.0;0.0;0.0;0.0;0.0
450;12.229438040816323;40.938373417721515;75.05307715189873;11.809875975546085;30.308312579710147;27.457114035087713;89.03399298245614;157.16245388669427;14.970248509433965;36.973827906976744;89.32740930232558;4.448495387776378;13.058398983050843;36.43938163265306;75.93542142857143;5.293976055081713;15.449766888888886;35.323945454545445;86.57829575757576;11.51181022052353;35.806284097560955;25.148986111111107;85.25468027777778;151.8169987082862;40.94344266666666;30.376017073170726;88.7223248780488;167.6617301784001;8.742015204819278;43.6106043939394;95.41303303030304;6.569474628156141;78.14547833333333;67.78594;185.608524;-0.947834121121638;42.31642947368421;55.702331249999965;167.007875625;-4.2574102101754265;10.672534956521734;39.18208333333332;83.14394583333335;8.896514750451162;83.40525825;41.640013333333314;130.45201699999998;136.79806324899607;12.550806363636367;31.356580000000008;55.168238499999994;142.32902147077144;48.86644583333333;65.72969473684212;120.96602842105264;8.811655688443974;51.57647431578948;41.56751333333333;96.84169366666666;143.19068755885436;31.259174500000007;19.141909696969705;79.71101515151514;91.71941300893549;25.626096303030312;33.569008000000025;117.02000800000002;7.823380549784884;36.11547999999997;25.575666666666734;61.65736999999999;235.61401447486665;98.56614615384613;43.243536363636366;135.8337127272727;130.68600015752963;72.73333981818185;36.800850000000025;117.61804000000004;114.43800934399755;66.25901600000002;53.17333999999999;97.53525133333333;94.04439252851722;27.800268235294123;47.91269285714285;110.23164571428573;6.749741161541823;27.745678370370374;54.05347142857142;98.6664957142857;9.859772953429204;33.83166833333333;53.108951666666655;100.60510888888889;-1.222649745040653;84.65819357142858;91.4953828571429;155.66607142857143;2.7095388442039945;98.86460399999999;108.39260000000002;204.26830285714286;-22.59347768282268;58.669411999999944;55.574625;213.49764875;-2.590469554718352;55.66720399999995;55.574625;213.49764875;-2.590469554718352;83.15207500000001;101.12145555555554;171.57165666666668;-2.4001582508951547;53.55454249999999;41.86678;167.818686;-15.960761690734813;76.15528642857142;20.477703846153855;127.40661999999998;118.97850528962334;87.88974285714286;42.09643333333332;117.76138333333334;108.1383171230395;77.17094785714282;35.83766999999997;144.37733999999998;40.27136967448657;28.048114666666663;36.49996000000004;63.625502;169.00291137075314;51.48987000000003;39.573599999999956;47.780249999999995;244.3647713820974;35.83229000000004;32.39185000000003;46.19965499999999;244.09745254151755;50.893320000000095;44.177100000000074;38.651109999999996;157.14366197202432;77.53184999999993;98.72219999999993;36.037675;76.40138817764635
500;13.596389999999996;45.02035405405406;74.14636891891892;12.721806694603805;49.743463710144944;28.796765517241376;111.99813448275863;163.03131261555205;19.610578547169816;45.02162340425534;79.9854155319149;5.674451068577548;12.936286271186438;42.25475777777778;90.85604822222223;7.2208619818947595;14.064483111111107;37.404372222222236;79.08724472222224;3.410267965715791;49.463915707317085;28.64947941176469;108.46674705882354;182.1571517311693;53.70567160416666;32.81940270270271;117.16363891891892;197.33557551751414;15.043291722891565;38.71343333333332;93.10139028985508;5.2272730370553155;72.095955;60.98207777777778;206.96616999999998;-4.155426426709226;59.008866315789476;67.81682857142853;187.3168078571428;-0.9962678441473913;20.282926608695647;46.011952631578936;87.68551999999998;8.117985191261052;38.771052388888876;42.60297241379311;80.72309137931036;147.26509475140475;43.37883431818181;33.130594736842134;84.26689315789474;167.8192368077599;30.79732416666666;42.42227105263158;100.15253789473685;1.3065354223480647;96.10165615789474;41.683415625;152.844084375;178.5920825942731;61.071419625;21.434008823529414;118.61340852941176;110.99621385792001;32.84262466666667;37.86515714285717;116.482875;0.8611914002222851;24.144953333333323;38.31730000000003;36.107065;211.0724647889919;51.35369615384615;29.515188888888904;119.74162777777777;118.96929566481195;63.260436000000006;47.38402352941176;134.98587;155.12642502321262;64.71269211764705;53.25060000000001;117.82479846153848;101.28634736994789;30.58227294117647;50.52917846153842;90.35911;6.882515518988002;47.06857385185184;64.11868750000001;102.28593083333334;1.2242156393404897;33.58321033333335;55.934721428571436;108.55018714285714;0.5580620035093565;34.29125471428573;87.74792500000004;222.77755874999997;1.9639809756348856;71.27914481250001;74.70676666666667;210.67137833333334;-5.236572250056333;85.39844599999998;87.6502777777778;198.90868666666665;56.6962863062341;81.39550199999998;87.6502777777778;198.90868666666665;56.6962863062341;71.727015;117.84253333333334;229.68024333333332;-7.4474977929304815;69.7905758333333;79.98263333333334;185.59526555555553;52.28622621717419;43.51162285714285;24.577799999999993;106.93975818181819;165.67727061816856;12.156082857142865;42.10855000000005;38.3965;164.67877407434918;95.66357885714288;44.56163999999997;176.34702199999998;139.22807259887438;32.856031333333384;54.64284000000007;68.84723599999998;79.70908122310432;52.17517000000004;41.98384999999996;44.14967;246.84062155560554;36.48534000000001;33.61140000000004;43.59949;242.02739436649483;50.701820000000076;44.677700000000044;37.15113;158.5323943663921;82.15579999999991;105.94330000000001;32.262789999999995;87.09614540192459
550;18.124712979591834;52.47623253012047;89.97145071084337;15.717638616137094;48.35470272463766;31.78089298245614;118.94049982456141;170.58513322421766;14.338180584905663;40.47546153846154;79.5427382051282;8.45707273117771;18.288151186440675;43.164190384615374;89.22314634615383;-6.052420989488293;22.586268444444435;37.84773714285714;95.37883828571428;-1.010308567089804;64.80544502439024;35.59786944444443;121.02019472222219;178.98130819577398;48.544720916666655;34.374116279069796;103.88865209302327;188.16491467235667;13.942753506024099;46.767551739130454;105.34574202898551;12.274389955215709;76.53723833333335;74.16031000000001;185.95777500000003;0.3532316856915826;37.51771684210526;49.21219285714283;203.22306999999995;-7.5427051228451685;16.372610347826075;44.06226923076924;114.74465384615382;0.9501450249230134;94.67269930555555;46.29263225806452;141.47151387096775;190.26215231304988;19.322847272727245;35.1249368421053;68.16135105263159;191.55677105509014;54.940594999999995;68.24442105263158;139.4765;-2.7581668604473477;66.70667542105264;43.00170689655172;124.51994137931034;180.9993371316638;64.9056645;26.86679199999999;143.25263633333333;97.17393373589;36.89586351515152;40.06285250000003;134.83993571428573;-4.404129616683536;235.25498666666667;45.39204999999999;331.16387;177.59442857101317;29.30831153846155;60.69488750000001;69.6386025;193.6768172151817;42.76130745454543;45.2747705882353;100.90206470588237;150.81848069744817;69.7431274117647;55.34886923076926;117.22994538461538;190.35599877569547;27.500288235294114;56.32041571428571;106.51829999999998;-1.3694909713342571;29.94938029629629;53.01205571428574;125.12190904761904;-6.031023825394992;25.780821142857132;40.58833157894736;114.89346684210525;-2.3768588171721077;83.29232928571432;99.66647285714285;165.90460857142858;-10.62199723338039;104.3627576875;111.9534541666667;238.74983999999998;-8.794063793348963;52.534704;82.28307499999998;251.9311625;-8.581774763876947;49.52743399999998;82.28307499999998;251.9311625;-8.581774763876947;57.844515000000015;97.37008571428571;197.13502142857143;-8.007333783879632;44.41497583333333;69.42206000000002;206.72839600000003;-4.602135682112363;11.84114928571428;17.121047000000022;56.379909;153.62255283121144;87.2095;52.31521666666669;120.71742333333333;76.37216417064502;106.02537114285717;47.77662833333334;147.49334333333337;81.56587217612172;39.60423916666669;52.97638000000003;63.662530000000004;133.4257275550514;32.67175999999995;66.06289999999998;29.15114;135.24928571396924;30.169919999999962;66.06289999999998;29.15114;135.24928571396924;51.470719999999936;44.9619;38.05113;161.76514285676444;85.30324999999996;109.82170000000002;32.92489;94.82124093796912
600;16.082306612244896;53.137042380952366;92.85490845238097;9.835237009267935;41.18324179710144;33.61110000000001;124.79385534482758;149.5590126834246;17.614780471698115;48.529222222222224;92.27660022222224;6.456853593313689;19.770525762711856;48.54433800000001;97.5736946;6.089954167210851;26.519047111111114;41.14721463414635;97.99536365853658;3.0871706294491466;66.55077429268293;34.597559374999996;142.04599125000001;170.82435790776077;39.37538595833334;38.37189736842105;113.57293;179.6916952786783;12.283091024096384;48.214917666666665;107.8758708333333;3.546193717369142;57.67301166666667;68.84726666666664;185.09076000000002;-4.651915212852517;74.20136210526317;70.73080588235293;183.46464470588234;-0.9833170773361045;26.55158517391304;53.01235750000001;109.18168599999998;4.661017323269604;49.695752083333325;42.07248999999999;116.80095966666664;170.69721360836044;64.91955886363633;30.162260000000042;153.193378;190.21883662617742;37.433398333333336;53.39509866666666;149.97261533333332;1.1284355446820176;86.03329868421052;44.156670967741924;146.3490890322581;166.63115704735097;50.98433200000001;26.849287812500005;140.11509531250002;100.54890284371626;38.992199878787886;44.4399666666667;136.32071814814816;-2.5966060987576487;212.20692;17.062549999999955;334.670045;289.52704498314233;73.11215384615383;46.19213076923081;112.20749538461538;115.01219416939527;88.34331581818184;37.91480526315791;165.48674105263163;150.11100303359663;87.0821145882353;43.09070000000003;165.2088975;124.7210849482289;27.771041176470582;53.185804999999995;122.60354166666667;-0.720104012023241;48.84997562962962;68.28737727272724;121.48905272727275;3.5681550133716713;44.09705880952379;57.69126470588233;125.49131647058823;1.3750199109869636;16.655211857142856;53.712400000000045;212.78628250000003;-13.019923552451901;64.21575143749999;65.45913333333338;218.27742249999997;-22.990644347901988;58.381814;81.58596249999998;212.30791374999998;-1.4286619610500595;55.361424;81.58596249999998;212.30790124999996;-1.4286910985792143;84.28174500000002;104.09085555555558;166.91919444444443;-5.85369558630319;49.94954250000001;66.30912000000004;172.44673100000003;-3.277099948585211;44.01504428571426;27.982616666666683;113.834565;225.42937572206043;4.478525714285718;34.75283333333331;49.209826666666665;187.65139028558576;76.96866985714287;56.09769999999998;303.77520000000004;70.80420423895256;28.00008133333337;51.22667500000006;105.06136500000001;147.4436050661564;19.92000999999998;19.642199999999946;58.44785;352.1526760567711;6.732520000000018;1.1916000000000704;58.531240000000004;346.0277777772183;0.0;0.0;0.0;0.0;0.0;0.0;0.0;0.0
650;15.082129877551022;62.78256315789472;94.6028962763158;10.864732505864508;46.46685344927535;39.47131754385964;132.8941187719298;168.24154351439336;17.53573896226415;54.64749523809527;94.69160142857143;7.200174356624679;14.650025593220336;52.99923249999999;104.58144250000001;5.488180632468551;17.45344577777778;45.74147333333333;99.26541166666662;7.348885112065426;17.489008439024385;40.156372727272725;82.83207515151516;167.67844391671906;57.701274624999996;43.377517499999996;133.753227;176.09863471232075;15.385624927710847;49.87303312499999;115.88354265625;4.98947609041251;77.93638000000003;74.0791111111111;236.9209622222222;-3.1179757397260164;55.71584842105265;62.56919999999999;177.3330935714286;5.854580624634705;11.742963565217384;55.37357586206897;114.89256137931035;9.232902543001403;74.4778635;49.48526666666667;130.59597166666666;194.5234834861756;17.538346590909057;35.354452631578965;72.06677263157896;185.18645433861377;55.737508333333324;62.26921818181818;117.08040045454544;-3.792503177340606;89.44990989473685;49.938082352941166;134.42989088235294;170.8617455336629;40.038224250000006;29.097236363636362;103.45625696969697;122.60287173679943;31.567768484848497;49.29210772727276;143.02271590909086;1.461450603752349;235.63768000000002;38.31273333333327;229.6791566666667;220.22311793340228;51.580603846153835;35.00325714285717;139.01623999999998;179.19765586636635;66.39241454545456;52.676966666666644;131.64288055555556;151.699766063438;67.96076858823528;64.63320000000002;118.52451642857145;132.58267606925943;46.86790117647059;59.78591428571426;95.36932857142857;-6.014846392132877;28.855575481481484;73.73218;125.8979929411765;10.42114985322566;33.54979085714286;68.14114357142857;112.99998428571428;-2.750547478098293;77.94534635714287;105.68254166666667;181.51154666666665;-2.7878110874869666;104.900235625;114.75719166666669;218.7861525;4.635300445417246;69.09801399999999;107.3927125;259.52347375;8.415386235067894;65.59543799999997;107.39272500000001;259.52347375;8.415386235067894;75.92404000000002;115.2553142857143;206.42189285714286;-21.376507930615386;49.454477499999996;100.66932857142862;289.25380285714294;-10.87732620466888;13.291720714285706;38.03419700000002;80.794919;227.97896245671504;89.56661999999999;55.98111666666667;136.03896333333333;105.41064105093817;104.08773357142861;61.538599999999974;152.968478;111.9712327799153;29.54161466666668;67.68795000000009;61.89987250000001;64.88715491671313;52.13162000000004;42.757299999999915;43.691165000000005;241.48780193212698;36.44248999999999;32.87704999999994;43.728060000000006;242.7919412127462;50.591520000000074;44.27979999999998;37.75111;163.9091304348776;85.82274999999997;112.089;35.10976;99.65807376169919
700;18.396445224489796;67.73356360000001;112.80366213333332;6.170753084412971;66.59437408695652;47.25783166666667;159.500006;142.27592015012186;17.38175786792453;53.36563720930234;98.38988255813953;2.75668073835444;24.238159491525423;54.061502;103.89856420000002;-0.3082234027806914;27.381368888888876;46.59731742857142;115.53766657142859;5.781009864999175;86.00513770731708;49.00610294117646;161.82515647058824;136.75853481903007;56.362977875000006;56.15497209302326;140.8606869767442;119.26461950833988;16.754146192771085;54.46667365079366;137.61069031746032;-1.7517063427271142;99.68591666666669;80.47824545454546;205.94509000000005;49.832589365658485;68.50507368421052;85.02974666666665;177.23751333333337;5.199874784148237;27.48507452173912;56.78848292682926;123.18605682926828;8.173575241228406;84.77626194444444;53.39605454545456;150.15634636363632;159.18385728040633;20.795619318181792;38.04900555555557;83.79948777777777;137.69536917753913;39.82423000000003;54.621143749999995;152.15158375000001;-27.436552280958466;48.053494947368414;54.4830375;94.43684812500001;167.35306043759073;80.92559150000001;35.375912500000005;165.0303296875;87.38254576911338;43.73174090909092;44.49714482758621;144.73960931034478;-0.1837893146359356;23.848786666666708;38.984550000000006;36.311524999999996;207.43788732368768;65.53236153846152;59.09066666666667;149.16308222222224;155.47442595126182;47.45544763636362;49.46929444444446;107.4542961111111;119.89314111873439;38.967904235294114;67.84097857142858;96.93427857142856;127.11951875332588;43.56596588235294;72.61421307692306;124.68915692307692;-33.333249543737054;63.21969525925923;78.71332916666665;129.5213575;4.271221881957744;55.410873523809514;69.49881578947367;132.26203999999998;-4.542122006255572;44.17523764285714;68.83588000000002;210.747187;0.1332346833664288;83.76013856249998;99.83310833333336;244.39364666666663;-3.985353938716738;75.30367599999998;111.43374444444446;176.4722033333333;201.8980123968421;71.723508;111.43374444444446;176.4721922222222;201.89806383717135;85.63971000000001;107.88632222222219;171.21073888888887;9.809343359218492;66.33310833333334;80.46195833333336;176.34433750000002;-12.616567781476006;51.92331714285712;37.701330769230815;118.97721846153847;171.22600085902098;80.65896857142856;64.22124000000004;165.632772;72.13847371272851;178.75475400000005;66.47300000000004;267.87089333333336;121.43231477568283;50.65909700000001;59.33385000000004;98.68839166666669;133.0484390379027;51.68401999999998;42.785600000000066;43.52807;240.5093661974788;35.99243999999999;32.388100000000065;43.51767;238.9692957743885;49.90592000000001;43.83579999999998;37.35113000000001;158.87253521146297;86.72380000000004;113.28725000000006;35.810649999999995;98.88538995174964
750;20.006989428571426;68.7378854117647;114.78176329411765;-2.9978740437466307;67.44603623188405;57.15631166666665;177.38010083333336;127.91380322188245;15.925118264150932;55.620928205128216;113.3572548717949;-9.502198194390488;22.316365254237283;57.83033466666666;122.86205444444444;2.0527281611777544;31.034514000000005;52.88724675675677;115.53269324324324;-9.824116784393675;66.61534014634147;45.55188823529409;149.1494288235294;137.4441772391672;72.25339152083335;57.13932307692307;176.31548102564102;154.69584073366096;19.759721337349397;54.3609795774648;130.7960330985915;-3.6053632348644067;90.45003166666669;102.05505000000002;201.21608000000003;221.91670140013986;60.873055789473696;68.9515;223.86083357142857;116.63860636559664;26.013324304347822;61.39943235294119;134.8218694117647;-12.003887768953158;64.23700980555557;51.11780740740742;165.52139333333332;167.14798568067835;42.09363159090906;41.199042857142864;145.47095214285716;166.18770730783245;53.90775583333333;70.75585052631581;161.43301894736842;-2.9459160543686687;53.474354789473686;50.939176666666675;130.28656866666665;173.50929088483645;51.34663887500002;31.541532352941175;149.9714473529412;100.94173901115586;47.98688030303032;55.48646428571427;155.12127821428572;-5.093847100631199;211.49056;42.167099999999905;610.6871;234.70102941182117;69.64396538461534;65.31246666666665;151.90403;253.25379764725616;89.82806327272728;49.60992500000001;198.97016000000002;208.03622169487477;25.683427411764704;61.203375000000015;110.8611141666667;155.62760829652882;44.222985882352944;62.568769230769234;157.3036976923077;7.536454113778499;55.33673599999998;78.37590875;133.85961583333335;-10.058214109097273;49.69023933333332;64.92029444444444;124.79232111111112;-4.1186755315566534;91.46916221428572;104.71507500000001;169.17264;110.66038291551622;125.98798487499997;109.1222642857143;187.0732564285714;111.60911306644009;87.43920600000001;122.99852499999999;159.56764625;0.6272188184353147;83.810208;122.99852499999999;159.56764625;0.6272188184353147;84.12658500000002;98.542825;182.69665000000003;249.6645409352471;44.136128333333296;74.72296666666668;195.61563222222225;-5.675022004427273;42.384830714285705;39.245207000000036;143.958463;163.48307521404945;25.226819999999996;56.94220000000006;31.07245;174.08047850231557;81.113805;44.988853999999954;226.25368399999996;42.833580091704086;30.313439166666665;47.64080000000004;121.21114999999998;123.45127977515327;0.0;0.0;0.0;0.0;0.0;0.0;0.0;0.0;0.0;0.0;0.0;0.0;50.052825;143.55030000000005;37.91941;36.65716417910063
800;18.788268734693876;73.42323456790122;136.9752739506173;-1.5916741341756087;42.46744486956521;64.1922245614035;167.24775719298248;165.29461510291884;20.516648358490556;60.51522093023255;119.18304023255816;1.5632640114708445;26.578948983050847;58.13151599999998;112.73064120000001;-2.8044943414624246;31.01630044444444;59.22368055555556;115.04754138888887;-3.960725534457401;65.84102546341464;54.842963888888875;146.59010249999997;146.781245635933;60.47701977083333;67.63778636363637;156.31270818181818;113.20478727862486;14.840217361445779;56.690377049180306;141.3733065573771;-8.361283811406608;95.19278166666669;125.74169000000002;168.16972300000003;10.279602614447356;77.62914105263161;80.95368235294117;139.19623117647058;2.95347589851693;25.692520869565215;60.113852631578936;116.21483684210524;-3.7032804065162073;98.63196133333332;61.89766129032261;189.70685483870972;167.12328483487053;51.00550636363634;41.904195;127.748844;145.40359139303717;43.06703166666666;51.55014705882354;138.2272888235294;-5.164029336047813;111.50950836842104;60.755644444444414;163.1810311111111;168.8873444502519;54.98993087500003;32.3890945945946;132.83721324324324;122.56599181373029;43.71102466666669;55.6541076923077;151.21165884615385;-14.62099518916067;235.00407999999996;41.32076666666664;226.03124666666668;211.77610812367917;69.52158076923075;52.871715384615406;122.89469769230767;150.56504725644083;45.85956909090909;43.85865789473687;127.54452736842104;113.9997063333819;113.51967552941178;68.22045000000001;175.46967500000002;145.29929899123096;36.73776705882352;70.10330545454543;125.38355999999999;7.646696194743186;52.23390718518517;85.14964499999999;142.8643555;-4.703540783349249;43.23090861904761;92.99261666666665;151.30685916666667;-15.391785297803331;55.29717771428572;85.54856363636362;139.63092363636366;-5.308287103751293;85.30234812499998;105.34266666666667;188.2085158333333;-12.507165558638343;79.80331399999997;116.2732625;213.39378874999997;0.22902344399209257;76.30073799999998;116.2732625;213.39378999999997;0.22902344399209257;78.30472000000002;139.01114285714286;123.7646885714286;5.208296225346506;67.11678499999998;78.0934;232.90339700000004;170.49320142717082;16.173268571428554;34.2549090909091;81.10377272727274;245.55302816557625;75.65186857142855;50.78732000000001;178.08413799999997;103.55587077738315;24.284707428571426;56.28425000000004;114.31697;147.71155416149898;31.36301466666673;52.00160000000006;101.53436500000001;47.4164688881296;51.19871999999998;42.702649999999984;43.31767;238.41359154882545;35.50808999999997;32.05984999999992;43.439434999999996;233.17809955589922;48.857919999999964;43.059100000000136;36.85111;157.5308450701118;38.13952500000005;84.58890000000008;34.18468;163.29394366164985
850;23.7084975510204;74.08337879518072;140.06220289156624;-6.923015206654571;77.29874347826086;63.45441428571428;200.1185280357143;108.57090661453367;22.86447658490566;57.72823333333333;114.51842511111113;4.206611255041021;27.597205084745756;64.21653081632653;136.83662040816327;1.6657419471150308;37.718179111111105;65.63033342105264;135.62847842105265;-6.128289219379664;72.75322804878049;56.40583636363636;168.06172424242425;133.5881673246988;47.983392666666674;86.75483750000001;181.7301921875;24.831463382076606;21.624881662650594;60.31470298507462;157.20989910447764;-9.590815677413936;80.10209833333333;119.99754545454547;172.0577181818182;-11.808935291110254;68.44417368421055;86.30007333333333;171.53269733333337;-0.07612896728823557;30.530798782608684;63.734320000000004;152.315896;-9.713850937909053;82.10629466666667;66.44810689655176;180.7943462068966;147.34597985753092;50.71159522727271;44.57990555555558;119.30646611111109;133.5836497124724;50.2437175;67.93412950000001;158.7414465;-7.657508943168435;55.19681989473686;62.91250799999998;143.8844844;179.71635387798685;50.046189500000004;38.74831724137932;148.21885137931037;82.20416370778668;49.71881115151516;64.51698571428574;172.28462000000005;-10.22314731166795;234.8318466666667;44.86323333333335;221.43403;213.72545549321305;54.28447307692307;47.92897777777783;155.34057555555557;202.99018107116328;74.42781000000001;54.41462352941176;152.0847429411765;133.2215023631387;71.32069352941176;62.731526666666696;147.51758999999996;130.290022394498;46.56985647058823;76.95441714285711;141.10452214285715;-8.095144003495223;49.35566740740739;89.93312727272728;144.08148636363637;-8.86122198098049;56.00082547619048;70.80267894736842;145.90263631578947;-3.426730023541094;87.44994078571429;117.57163333333335;126.89487416666668;4.876056807235635;109.67359812499998;141.58438461538464;196.65532153846155;-9.908565575806694;102.375618;113.55427;181.032083;-6.876363536485009;98.136042;113.55427;181.032081;-6.876363536485009;70.872805;129.00780000000003;121.38094428571428;-6.606525036882701;67.92695916666665;102.15394444444445;190.81462;-5.958114534211129;48.882407857142816;44.09741538461538;135.80105307692307;211.0327305906492;95.59874285714287;70.71853333333338;160.36677666666665;142.82578232251078;92.12282828571433;53.66738000000001;211.29550000000003;81.57292668722611;42.36788916666669;57.249220000000015;132.55909400000002;128.84931445825433;50.88152000000002;42.458949999999966;43.38944;231.75595890381516;35.18304000000005;32.023050000000026;43.117914999999996;237.1220142775765;48.260820000000045;42.52220000000007;36.75112;154.008767123092;89.06825000000003;115.19189999999996;36.756105000000005;101.3258292939122
900;18.00819440816326;75.48121518987342;156.00502455696198;-1.563335495180823;82.02292620289855;80.0645107142857;199.73220267857144;110.49353768505054;19.889559698113196;63.16138292682927;147.79751439024392;-5.980448657980019;23.56707525423729;66.98995111111111;140.38010266666666;1.3273891655291228;27.890821999999996;56.44320588235295;139.87516970588237;-0.8217472847554479;63.64824492682928;65.33206000000001;169.55294914285716;157.1140389323942;74.8792193125;76.08707727272726;157.42774977272728;80.82714700868203;20.363344397590357;60.90339857142856;160.91236314285712;-6.37568605117808;62.748751666666664;124.82745;167.57092000000003;-1.4086386315995925;77.61361999999998;87.96092352941174;151.44837117647063;1.2603131491560682;28.466052347826086;74.80655454545455;154.67977636363636;-3.3592028314948807;72.11086780555556;71.16824242424245;155.77472212121214;94.36989854361173;27.81130113636362;55.9242055555556;134.91525222222222;220.05620968350394;55.52880833333332;63.44996842105264;162.7170852631579;2.2441262930917643;86.7857125263158;73.644615625;151.0615859375;177.09270249420604;66.066189375;46.39754827586208;181.81427241379313;155.0859436939183;41.64519793939395;58.76872962962965;180.084707037037;-2.9953622495674774;0.0;;;;64.27147307692306;66.01542222222221;184.10898555555553;171.24034285846545;79.7819170909091;84.9432611111111;140.62571111111112;165.38236210932158;34.21949694117648;73.64608000000001;101.97923700000001;146.07398965352783;47.81940588235297;71.63070000000002;143.99234461538464;7.3747503603719196;55.691073851851854;82.98146190476191;159.81149190476188;-7.20530679192429;53.0478878095238;80.62149411764709;175.46229411764708;-11.195646825837132;55.5255447857143;117.40518000000004;168.51278500000004;1.5767580387573814;88.92782937499999;103.28714166666667;165.99044833333332;6.73163786242218;69.42847199999999;97.79032857142856;188.2607128571428;-2.1731476602946365;66.72547999999999;97.79032857142856;188.26070999999996;-2.1731353420111623;84.56319500000004;121.88881111111111;106.72864888888888;3.3521212337828685;75.5280925;86.72255;142.29355099999998;-6.832480416286012;46.69652571428573;51.15634545454544;162.96451636363636;183.1801304273135;15.3309742857143;71.03045000000003;104.669715;101.5344352103659;15.076912714285717;61.09726666666663;121.63405666666667;135.39376248115093;38.835905833333335;62.90856000000002;87.05741400000001;145.86332133921942;0.0;0.0;0.0;0.0;0.0;0.0;0.0;0.0;0.0;0.0;0.0;0.0;52.090825;149.66619999999998;40.63277;47.90597014916714
950;23.949241224489793;77.66131712328767;173.3296835616438;-16.62604472961578;86.39422063768116;70.16664923076921;216.00710353846154;96.36892934852406;23.17060316981131;59.91741951219513;137.2300156097561;5.549400782268323;28.816949152542367;74.22041604166664;155.21871291666665;-5.714285674733684;36.47316377777778;71.62576272727271;142.26081121212118;-16.0274056147726;115.48594985365854;69.85599428571426;200.05125400000003;80.43699066548913;90.42620472916667;75.60756976744187;202.0722918604651;77.83112243512151;22.003545855421677;60.301057575757575;168.21056545454545;-7.282782991746809;106.68864333333333;123.57450833333337;194.6788025;-3.890874336923756;59.93769789473686;76.8440071428571;148.1981592857143;2.6900603593179007;27.18674169565217;65.25765135135137;175.31374486486484;-4.073890535798697;64.71121411111112;69.53618333333335;187.44303733333336;142.91326667813775;46.01745113636364;70.00724705882355;161.75206647058826;42.88982680901464;44.6529925;58.36444705882353;141.99226411764704;4.356543159421953;31.940183999999977;79.238275;141.020128125;141.76341441211287;42.09563925;49.54394411764707;163.87733029411766;120.44849577279925;49.74960454545456;84.58660384615385;194.24565846153848;-13.378334758931336;234.52788;45.36489999999998;220.37213;218.72480975404562;72.09644615384613;65.58386666666668;154.43343833333333;189.42572144450034;76.54811581818183;79.63428823529416;178.92841352941173;138.21701501858146;132.25916376470585;63.71080666666668;221.32776733333336;141.2700093804396;33.77035529411765;74.082465;136.72490249999998;-6.952597849544485;55.38919140740739;101.37063999999998;166.97345099999998;-3.3587143734769223;60.257521571428555;88.83634444444445;168.15487055555553;-6.68030726909848;92.87956499999999;147.2805166666667;170.25709666666665;0.4510133957581801;117.99064443750001;151.69863571428573;189.09842857142863;0.0924920365712385;106.95682800000002;113.60998;179.70405699999998;-1.67146583699164;102.827572;113.60997999999995;179.70405899999997;-1.6714959691402036;92.40045000000002;140.62876250000002;117.17548125;-2.1668913255839866;87.44649999999997;95.46480000000001;166.34449272727272;-2.6216460533171624;5.370595000000007;33.35453999999999;90.244167;244.14567834358803;96.0101285714286;63.74808333333336;143.23673166666666;119.6744349409545;76.95488171428575;43.005061999999974;200.56276799999995;80.0513240865831;2.698232333333337;35.25974999999998;179.83782500000004;50.94642631235436;50.28981999999997;41.38594999999998;43.017915;237.7156739048508;34.59699;31.83285;43.23066;240.1669384923228;47.0194200000001;41.45010000000005;36.4511;155.64541666690658;89.97170000000003;117.18945000000002;37.135724999999994;106.3294900498724
1000;28.65422420408163;78.91957280487803;173.42095768292685;-15.27385261849618;86.30297211594203;75.59467799999999;237.04475300000001;127.02950487906973;27.19016533962263;67.99102619047619;136.22583714285716;-0.7887726210332782;32.51849355932203;75.95412895833331;160.75687645833332;-9.457370332832843;41.437972222222214;78.38220342105262;163.26236605263156;-7.909203884665203;88.01216687804879;81.94918387096773;172.3517090322581;34.59835940464584;87.93037924999999;74.4697945945946;189.9906362162162;58.1724200809304;19.68636771084336;61.65776874999999;180.5215559375;-12.630355362026943;69.84896333333332;109.09211111111112;231.9169977777778;-1.3027930118164355;65.12073473684212;95.33009999999997;176.59201142857142;1.882423888680136;38.63637304347826;76.50105789473686;153.75617815789474;-3.3099915339575543;85.8472798611111;84.82441785714283;199.02896214285718;108.02143762093742;35.97707977272726;68.75898500000001;153.79719300000002;84.47009946064932;52.94584416666665;61.29769444444443;179.99051944444443;-2.84018142411581;111.05653094736842;71.73372941176468;179.10059205882354;81.0990108503369;55.767589374999986;44.65947575757575;139.38109606060604;94.91437085760231;56.10026678787877;71.18472333333335;194.40034500000002;-6.321444992468494;234.34278000000003;47.899533333333316;217.85055666666668;210.29196188013194;92.42706538461537;63.62710000000004;209.45397333333327;207.4557155642009;77.38675800000006;60.009126315789494;169.7676694736842;114.95413574612073;70.11250352941177;76.12717272727274;178.74528090909092;133.7792877583149;56.37635294117647;77.71769166666668;160.89371749999998;1.1665349796075224;59.37573229629628;93.7362625;169.56179541666668;-6.992039119018643;51.01182071428572;68.34476875000001;170.114341875;-9.873262416814098;71.40471064285715;110.48524545454543;132.73696727272727;0.10598357343607584;92.5615260625;113.95596363636365;160.20984181818181;-0.8147551308218006;88.78012599999998;122.406925;212.29829625000002;-1.328631045312941;84.98625799999999;122.40691249999999;212.29827125000003;-1.3286609496191621;67.76124000000002;132.12281428571433;115.24495428571429;1.5396405667386754;71.00196000000001;110.58052500000001;210.00281;-2.4204802936550536;53.97282571428569;48.05429090909093;177.54418909090907;232.80841635269596;86.9957057142857;70.41702000000001;219.46327000000002;152.30224861066708;85.88816457142862;53.87991666666668;224.60441500000002;121.1605621084531;128.02984700000002;53.83856666666666;213.81094500000003;114.51816765129655;50.11067000000007;40.795600000000015;43.280649999999994;240.3722857145454;34.41494;31.53770000000003;43.477675;233.05907534235234;46.7988200000001;41.00280000000001;36.75112;156.1836111113518;36.85382500000005;82.32990000000007;34.06089;161.48750000024896
1050;26.37970791836734;81.73504874999999;197.152047;-12.488573540094682;72.45953031884059;81.60371833333332;226.84548516666666;153.6446425085169;33.408580566037735;71.12649761904761;161.69022666666666;-13.703645063807642;40.34303220338982;77.74880408163267;179.5092793877551;-9.663314678474991;45.57778977777779;82.26094615384615;163.4693276923077;-7.310586525628446;90.28097180487804;79.31705882352941;196.28950735294114;70.14105466315722;74.846643375;84.9252128205128;213.3650523076923;69.5479988814985;17.49387743373494;64.27510655737704;194.6928478688525;-17.65966188228196;100.29014833333328;138.84802222222223;237.05381888888886;-28.063111810924344;76.29534105263161;87.2361882352941;149.93669882352944;12.700008342536815;38.608527043478254;76.96640263157894;187.40686263157895;-5.8870074748089785;90.24978386111113;76.31996363636364;197.92561545454544;83.34820058875042;78.55590113636362;60.481394444444426;186.73523833333334;65.85439804868503;46.258233333333344;58.47238421052632;158.60117947368425;8.150343770481209;67.2506949473684;80.52694374999999;148.015058125;112.11371077442506;78.452126375;60.311841176470594;196.18751735294117;101.14369897595721;50.703791878787875;84.51778461538461;222.51776;-5.893309012936817;21.59459333333332;68.1196;24.35112;92.30452054782783;77.05615384615388;85.98418888888888;123.80108888888887;261.2700612248037;109.80120145454545;85.087005;198.6946025;31.129453827140225;146.5300707058824;74.66954117647057;189.50445823529412;144.34000755455733;43.3495305882353;70.00537499999999;143.07760624999997;1.9199843457050174;63.42000170370369;96.38751363636361;199.45300954545456;-12.256356567573999;55.12000642857143;96.61857500000002;212.860698125;-8.732668248566196;76.78681778571425;151.72592999999998;173.479095;-0.5656456709623303;101.69686024999999;148.77069230769231;201.1733884615385;-1.1505499788193616;96.25315599999998;114.04407500000002;173.5640525;-3.1359352687656297;93.12943399999997;114.04407500000002;173.56405125;-3.1359186020989624;84.46135000000001;145.95375714285717;123.49066000000002;-1.3576443990127276;71.61592583333332;76.15147999999999;142.512979;-2.2036750685484927;21.827390714285684;51.169687499999974;138.96343416666667;164.5925307190087;9.441417142857146;50.19073333333332;133.31832;74.83035420211215;22.60705271428572;41.77839000000002;161.21493800000002;41.03134367376637;219.7443391666667;56.21235000000001;264.4242183333334;109.1873356000569;29.573409999999992;61.26160000000008;26.65111;127.9413698628512;27.07156999999999;61.26160000000008;26.65111;127.9413698628512;45.91571999999995;40.60279999999994;35.85112;153.767260273777;91.12179999999995;117.81530000000001;34.75416;107.77984537145787
1100;30.605755142857138;84.23805476190475;200.8943023809524;-14.680796156925597;73.55916353623188;72.53518421052628;233.30837877192982;101.15983059078981;34.64982384905659;67.02935869565219;150.59563152173914;-11.123567951222947;34.61121694915255;75.39252040816328;174.5222093877551;-11.28369891608004;31.71182222222222;79.36881515151515;191.60383090909093;3.494113102315793;73.66839609756099;73.80250909090907;169.88601878787878;85.45791898809141;95.059405875;81.99646923076924;225.06636615384616;74.6236821592273;23.320320385542168;67.94332727272726;197.1617190909091;-8.840473733857904;113.83444333333331;120.37725;148.04666583333332;-0.49808018822454625;88.24443052631582;94.11227058823528;126.0211188235294;1.109032248043978;38.6401513043478;72.98579210526316;162.47444473684212;-4.999907027210608;97.91653602777778;84.99753333333332;225.2019623333334;51.839462779585915;32.985379090909085;74.49333125000001;202.252855;94.5265735013508;55.0235875;73.62419473684211;158.26895;-3.760326839000168;80.03804647368423;76.97859655172414;170.67887068965518;100.64916213789787;43.587369375;60.98651818181819;171.4753393939394;104.32488148109442;44.12230151515151;68.38727407407407;198.07871148148152;-5.313602144504626;212.3018533333333;45.286249999999995;306.363625;262.4927777781823;75.62747692307696;66.90513000000004;122.90670700000001;218.90292736645816;99.99016454545458;75.68860666666669;244.84785533333337;108.18692766428244;43.062474470588256;81.12157692307696;168.95211153846154;137.91028003355015;37.85126705882352;72.54558333333334;152.58954833333334;-5.206699525478645;59.74764422222219;97.64949523809521;178.24693952380952;-4.777030677635679;69.71972547619048;86.64950000000002;171.2240588888889;-5.655297292293356;78.14020785714285;128.26386363636365;165.60504545454543;3.3132572052165528;72.7881326875;109.13176666666668;210.50757555555558;-7.092483583242387;73.346724;103.85052499999999;204.66878250000002;0.45529337730161457;70.177144;103.85053749999999;204.66878250000002;0.4552764854097223;87.55215000000001;137.63483750000003;114.23035125000001;3.957539699198147;97.6449658333333;95.05095833333333;157.40071166666664;-3.322373269140849;90.9828571428571;64.06218;267.43278200000003;283.3606293769323;87.54127714285717;68.50800000000001;235.283972;156.64062676717055;8.889618000000004;47.15105;183.32907500000005;95.21094323368771;7.200315666666687;41.163725000000014;186.94218500000005;6.056531491591098;19.995609999999964;20.01059999999999;59.10425;336.09315068450434;6.798169999999963;1.2904999999999722;59.338080000000005;340.0691666671907;0.0;0.0;0.0;0.0;57.20237500000001;156.536;34.250339999999994;62.67893939391006
1150;29.26958032653061;90.77134683544304;215.1284664556962;-10.640934711760437;90.52360852173915;75.39018928571429;258.47014125;125.85817103824047;37.96435975471697;74.14310465116277;160.81058069767442;-26.880567293526987;37.24585440677966;87.20993999999997;193.0679477777778;-12.567297575703817;45.46310244444444;92.96083235294118;178.69551470588235;-10.13324474335281;76.31656180487805;75.27780789473682;166.94603157894736;59.81080656815393;93.11772647916666;83.35941707317076;215.0003843902439;83.929657683041;25.077987686746987;67.54607733333334;195.12012533333333;-8.510166659045446;89.84518999999999;132.34784444444446;165.46781555555557;-1.08440882965297;78.79091789473686;82.53699999999999;222.3175172727273;-23.63404562896783;28.85803952173913;83.5335794117647;192.5578526470588;-9.470755365842328;95.10646072222222;82.10040000000002;210.52692321428572;113.75983632280057;73.1626368181818;78.20805294117646;153.4763105882353;-33.259340835763595;68.61038916666666;67.36667368421051;199.8856552631579;-14.199901489214714;90.3792072631579;83.3191727272727;158.72833242424244;87.63145934182647;67.3388295;65.31000625000003;193.1876596875;53.19063346832512;57.80676157575759;104.002636;226.4216616;-9.443370049857474;233.57781333333335;57.933599999999984;207.04012333333333;198.49981227774325;87.94693076923078;85.57203000000001;118.51468299999999;237.76871521336201;88.89479563636365;75.77226500000002;172.46398900000003;82.37695137615846;56.2793637647059;95.10522857142858;138.46855785714283;-4.288497654241033;76.73065294117646;75.33801538461537;160.37724384615387;-19.042789393762597;70.18879703703702;116.07286086956522;199.81412260869567;-9.209740108845425;57.38648738095238;106.06557647058824;206.05475882352943;-12.803074058871683;94.00988364285713;157.42417500000008;181.51194833333332;9.3174981750874;122.190547375;148.27366666666663;186.251812;1.2553417156187394;104.00157599999997;126.2246;173.97975125;0.20895798052973968;100.18486799999998;126.2245875;173.97975125;0.20892517213080675;85.738325;138.41138750000002;112.13752499999998;-0.36479823247088405;67.58073666666667;126.53103333333331;206.45000500000003;-0.862597005275509;114.09463642857142;56.34145285714285;211.062335;58.876038690372035;30.27222857142861;59.05972000000001;80.60672;128.01740186037355;31.8294225714286;54.30800666666665;107.58005000000001;122.8870212005013;125.62584016666666;59.38099999999999;233.40945750000003;153.0730825244966;49.081919999999954;40.071500000000015;43.194585000000004;233.5075285389941;33.38163999999996;30.97219999999998;43.5223;233.4225979829017;45.02532000000011;39.35830000000007;36.4511;152.87643835597015;95.37029999999999;120.76239999999999;33.056575;116.09693577351374
1200;33.02881085714285;95.3535802631579;231.3603707894737;-11.573873362418745;86.03052591304349;89.49990925925924;279.1056616666667;110.52236450134826;42.8974427735849;99.1866119047619;172.7164085714286;-1.8558400675785136;42.741653728813546;88.34245882352941;205.36086078431376;-7.107054754555327;46.18000533333333;97.1188154054054;196.16272945945946;-1.6275733224193423;83.54408653658535;84.20109032258063;175.5256409677419;69.26047021406755;88.97694175;91.94569473684214;234.00067368421045;37.481064661038765;19.968143867469887;65.54975409836065;211.85568196721314;-5.581948260625174;76.8462883333333;116.14651250000001;178.19088500000004;0.3631212062801957;82.27023368421052;97.21551249999999;111.957781875;-1.5055169035499638;50.87673791304348;93.53586097560976;184.90922804878048;-11.369186543213019;102.34175638888891;84.53371515151514;217.5249318181818;145.84625390444882;94.49386090909091;75.13627894736844;202.91425999999998;52.14813820616408;63.27963000000002;73.702775;136.5984695;0.9213358205818446;82.47252236842107;77.6948;164.482565483871;56.23749168655141;62.42476887500002;69.68642777777778;202.33596944444446;44.087314966127536;65.12115163636363;91.84363103448278;220.03150689655175;-0.13154925437576023;63.74872;87.74384999999998;33.890445;139.13432995519605;102.54331923076923;92.77080000000004;233.93316799999997;348.29045357272514;78.11546454545459;73.36408;196.507288;59.39193432765138;45.927134000000045;80.17872142857142;163.07218928571427;17.379547873504556;47.09121764705881;87.89153846153847;157.1881330769231;-5.441989428925778;74.79621088888887;126.45272857142858;185.87451333333334;-9.393260621216195;72.23636442857142;102.30152777777778;185.51476777777776;0.42403626161285235;74.90179357142857;124.51584545454548;167.91776636363636;9.709312191832103;97.57519775;121.82612499999999;187.40931166666664;6.226248615314719;99.868204;132.63706249999998;209.2896275;21.026242235325352;96.551864;132.63705;209.2896275;21.026274204634795;106.39692000000002;141.7809555555556;108.14385888888886;1.3536697648378206;97.61948333333332;107.95750909090908;165.06003272727273;15.978379809591159;67.0589114285714;64.92468;160.61028700000003;126.24880722833072;88.95555714285716;72.71570000000008;263.452834;84.52571997914484;12.86894657142858;54.34953333333329;143.21441333333334;47.98379818973759;37.40351466666668;59.455079999999995;95.43099199999999;96.83177128155872;29.01666000000005;59.21600000000011;28.151090000000003;125.12594594621366;26.514820000000054;59.21600000000011;28.151090000000003;125.12594594621366;45.06622;38.77839999999999;37.45109;151.188648648972;95.44804999999997;122.33399999999995;35.59621;117.60123147356818
1250;36.281177346938776;100.4013070588235;239.82002611764705;-14.505485889727087;67.27633472463768;79.05664310344827;266.6593681034483;65.07988201063529;30.503006999999982;83.62069459459461;191.46239648648648;-6.168880341562568;40.98894067796609;107.04173260869568;205.9865726086957;-12.198296173773127;43.794920444444436;99.60855277777776;201.1705263888889;-15.232513781249748;122.89729858536585;68.97020606060607;239.66666303030303;64.086998982066;82.3407614375;77.3358380952381;232.8231866666667;11.147584626495899;22.713562554216868;69.92321904761903;206.27835777777776;-4.611430295088977;108.208685;117.11676363636366;154.31029272727272;-2.0021016800924922;106.58490210526317;89.8863470588235;142.90467588235293;-36.38342786113671;34.51990726086956;97.73368571428573;207.53091885714286;-2.5610607788081334;103.57107491666666;84.73618571428572;255.1719307142857;89.54438031910237;91.13751931818179;49.96285000000003;254.49649499999998;118.14467808284725;61.11676833333333;96.47402307692306;258.12619538461536;-57.56090949756582;114.23743221052631;72.83999310344825;225.99130758620691;91.16055802578191;83.753519625;60.16621724137931;241.54443586206895;28.641486374153477;60.14678993939393;112.92004074074076;234.02272555555555;-1.323387347817854;0.8398599999999932;5.4091000000000005;45.64444;305.74657534302963;128.36197307692308;76.26364000000004;287.672946;222.55747627864966;84.06088327272727;75.49306500000002;193.39880649999998;-18.471912940013468;72.7516031764706;100.61662000000001;194.04208;38.94538165509713;81.10540235294117;112.13636363636361;180.33346090909092;-69.55224315745467;72.21003503703702;121.97539565217392;206.68739565217393;-1.3902218626598049;49.73618219047618;117.36976666666669;255.277318;18.102799650614966;96.40394914285712;189.90241818181815;193.1557809090909;-2.3180392097494193;114.7431385625;176.13801666666666;209.53279833333332;3.8273348754835688;167.99583800000002;105.36738999999997;207.34726799999999;-27.825667008558735;163.50084199999998;105.36739999999998;207.34726799999999;-27.825642378016862;95.02677000000003;145.16748750000002;118.26573874999998;-0.9919858638693644;105.94505166666664;67.07515555555557;217.43230666666665;-31.575720597910234;103.94478071428568;57.82222250000001;241.04445750000002;102.76947990660246;100.14553714285715;68.53453333333336;231.78202333333334;148.12685914540478;18.395175999999996;45.18244666666667;153.27458;70.2124065340257;9.051132333333367;40.697649999999996;192.87314750000002;-5.746134114317314;20.00270999999997;19.48910000000004;59.99351;339.89930555500587;6.81156999999996;1.264300000000107;59.83234;332.743835617052;0.0;0.0;0.0;0.0;0.0;0.0;0.0;0.0
1300;33.511034367346944;94.9892564102564;235.49900461538462;-14.034085858571476;102.53605936231884;83.4497172413793;301.94954862068965;113.53602147999042;49.06625392452831;94.25841666666666;181.45101375;-6.611618673081826;31.713927118644058;93.3752347826087;203.34749434782606;-3.1806383808734147;36.84487133333333;84.14154406249999;191.4317715625;-11.775163832675586;132.4610034634146;90.61172571428571;236.71796457142855;71.78301822237714;84.28006397916667;87.37911951219515;239.36975804878048;42.16316185356756;25.266732349397593;72.5145641791045;230.95077641791042;-8.253193799059442;118.18450166666666;132.07118181818186;148.54034545454545;-0.722674344687113;122.07166526315793;136.3996125;150.62713624999998;6.803583520208146;39.79360360869565;95.53879032258065;176.9772296774193;-9.248883557561138;92.03511936111111;100.89526000000001;256.118608;26.276711945602383;126.03358295454542;71.60959;210.122739;58.52424180197939;86.86580083333332;102.06400909090907;151.92841045454546;2.587218772299272;160.77139410526317;76.97969411764703;232.42261823529412;100.75144765932662;76.25438625;71.67182702702699;222.11388945945947;30.03174024335519;44.480587212121215;95.48793636363635;226.54145818181823;-9.912879919285773;74.38018000000001;62.85050000000003;50.66530333333335;190.4415315401668;107.52620384615383;95.06411999999999;210.77717500000003;144.7377285516889;152.55658072727275;80.75210588235296;234.06293470588236;52.426083171626985;92.49007623529413;92.60892500000003;163.17637812499999;25.183962408926774;72.14382352941175;132.96375714285716;168.9738292857143;2.3889313328753174;55.15974696296294;110.56734444444444;201.32899166666667;-11.581020984047203;66.44529214285714;109.53425625000003;162.94048625;-13.757151072431226;66.04974357142859;108.4133454545455;158.38645818181817;-7.7186744941621575;92.05541025000002;123.84297692307692;193.9556276923077;-2.5636173912096254;77.44507399999999;110.13985714285711;186.45995714285715;1.8938288104811314;73.95081399999998;110.1398714285714;186.4599614285714;1.893760129162448;79.44242000000003;150.70850000000002;116.33792857142855;2.9662333633848377;84.20745166666666;118.01828749999997;168.17793999999998;0.4016626260083429;109.35900499999995;58.01331307692308;224.43165923076918;95.7306214335621;5.321582857142862;21.221366666666686;139.5573866666667;97.44212394051084;22.116318857142897;39.411536;118.680038;138.59480468093463;37.36820683333334;60.32250000000006;105.63067999999998;147.16073108802328;48.46236999999999;38.94314999999996;44.241715;229.41123287693904;32.76409;29.1004;44.32418;225.59607182501793;44.02632000000002;37.350499999999954;38.0511;152.66657534227159;94.99210000000005;122.98674999999993;37.530945;119.46161065916866
1350;30.70030946938775;104.34770277777778;255.04046736111115;-7.848763621542645;96.65791571014493;91.58830862068965;298.9417056896552;52.595353697619714;34.993835207547164;92.66615897435896;193.6401720512821;-11.524871463481524;40.01166593220339;108.57703191489364;218.19652340425532;-11.514546151599674;46.535702888888885;103.83464314285713;215.87342000000004;-12.38041495689302;89.39485468292682;82.08915714285715;201.80574714285717;-1.0503581044786034;109.49581883333333;87.11802432432435;271.71104378378374;22.922013303550056;23.59325515662651;65.61903174603175;244.17081365079363;-11.133043985571188;93.88710666666664;116.72615555555558;177.87222444444444;0.3285185025183474;60.98221789473685;70.61438333333332;175.82969416666666;-0.5004281088173882;38.8910174347826;97.26062105263158;208.9333202631579;-6.187638433480864;126.47948572222221;97.73699333333334;279.7217266666667;71.38963771071462;56.8706277272727;83.89694375000002;233.97574875;51.38235352223131;54.70890416666666;62.97919473684211;164.13008315789475;-2.7607572168387744;125.22293552631577;85.29500999999998;232.88258266666668;46.24213654482148;76.924194;66.26758823529416;222.5809538235294;1.1997337867567817;60.815902606060604;113.20134137931034;260.1408986206896;-17.36599603957868;71.03141333333332;63.75163333333331;43.72519333333333;187.84775309041996;101.27045384615384;104.66688750000002;298.42370125;223.9657055862045;93.14263727272733;62.81123529411766;190.1573594117647;-3.5306138532493927;79.09575752941176;91.64502666666668;156.42214466666664;-107.14329759616275;55.813524705882344;84.96235;129.24998000000002;-7.729453175815609;71.87298607407406;120.15675833333331;212.63214625;-9.851149356374478;65.49801204761904;118.55043333333333;223.1797183333333;-9.798112785801234;100.74145071428568;173.07069166666668;201.51245000000003;-7.526053643451423;122.7792381875;146.57443846153845;176.3280453846154;-3.361091059471152;160.833036;134.6344;200.38159333333334;-78.50441857503706;156.83009199999998;134.6344;200.38159333333334;-78.50441857503706;81.85099500000001;131.341675;118.632745;-1.0966211411685316;148.2070408333333;110.51491666666665;158.82809166666667;-58.22907222086314;67.87990857142856;60.35079090909091;211.7683909090909;-65.23637555112944;35.82790857142858;73.62443333333333;143.448085;88.06857431189066;22.502212714285744;62.96162000000004;173.40045600000002;58.03326231144943;38.87159800000004;55.26600000000002;143.72740166666668;93.2609936286907;48.00736999999995;38.741500000000016;44.574175;227.04541872851522;32.30463999999997;28.423750000000055;44.54693;229.36694964344733;43.176220000000065;36.154399999999924;38.65108;156.47225352131903;94.44434999999997;123.94750000000005;39.67818;125.29208428004523
1400;34.875899591836735;106.91469871794874;267.78686256410253;-15.243382419210157;107.09267217391303;92.03732692307692;319.8752025;37.63794183458999;49.98811250943395;107.42726;203.27869049999998;-14.309053270582647;38.778721694915255;106.07457346938773;225.57196551020408;-8.607894579980842;53.24242133333332;106.10667894736842;219.7699160526316;-10.725940094158354;106.43904253658536;91.490584375;218.5026696875;21.30166541206834;95.96053735416666;86.45387692307693;261.66686846153846;22.343005876469768;27.03413363855422;75.88508181818183;241.1315118181818;-24.58712391172428;104.16637666666664;123.25606363636369;152.01592272727274;-2.7378596981610244;114.39446000000001;119.8365470588235;141.1856888235294;10.098058457767218;49.78270839130435;111.01779736842106;217.17893631578946;-10.465035353134846;120.71836750000004;113.01559062500003;268.03318656249996;1.9280223996990422;55.40796545454543;79.85855000000001;207.76050222222224;60.157385749008476;92.13777749999998;132.19002941176473;159.82745352941177;10.433194818796748;154.73417347368417;93.82944687499997;267.7324725;25.604718070920153;91.82965950000002;71.06744838709677;206.70565483870973;-0.21872878285894637;63.916015272727265;117.38714666666665;251.9710703333333;-9.521405727842994;0.0;;;;95.6576;74.06696000000005;225.354093;131.18465377463963;98.42684436363638;85.08982222222227;185.61832722222223;34.66917854179111;58.60216823529413;82.76520000000001;181.6108825;-26.09026234213461;99.90719176470587;164.8720769230769;132.2764653846154;9.168466158810691;66.49241651851851;121.61189545454543;207.4681159090909;-14.258235269694842;66.19953585714286;138.90956470588236;237.09707000000003;-9.819286753703382;79.62878642857142;140.90725833333335;203.96265250000002;-0.38420762396640656;95.65522275000001;131.95553076923076;217.6135084615385;0.4865097521553904;148.006806;193.5974666666667;175.88340000000002;14.829471384835841;144.00386200000003;193.5974666666667;175.88339;14.829471384835841;104.12268000000002;155.68637500000003;150.1681;0.5014288990290765;127.81010083333331;168.98187000000001;160.61710799999997;11.322554197444427;118.46045357142854;69.70086299999998;223.28748099999999;23.71164319690691;13.306068571428582;49.237233333333364;141.92875333333333;176.85411364157673;14.113601285714253;42.35640999999997;115.73923000000002;36.207298303911415;9.211399000000037;54.20999999999998;151.66306666666668;-44.847393306905566;0.0;0.0;0.0;0.0;0.0;0.0;0.0;0.0;0.0;0.0;0.0;0.0;58.98702500000001;173.38129999999995;50.51698;94.60338709658258
1450;35.183429183673475;108.0516975308642;261.2096424691358;-9.199972374100248;96.8023057391304;94.54648392857142;309.51627017857146;30.544263619472492;41.29280303773584;100.91084444444445;202.96670533333332;-4.291554053742104;34.05554559322034;109.36028125;227.15257041666666;-4.45983500608805;31.710722444444436;89.98648294117645;205.4875417647059;-13.695188588052089;54.75890360975611;94.33093;185.29002633333332;54.484093792870596;82.30578133333333;81.72469210526317;254.13087736842112;-27.44979278930231;24.276967036144576;70.46990615384617;235.68574584615382;-5.085691552302742;77.90859000000002;113.47402222222229;167.45261222222223;1.954485712293057;83.7676905263158;93.80758461538461;166.96911076923072;-1.655766415277983;46.056768;107.7947025;205.33115600000002;-6.991166305816852;88.19616380555556;106.60497586206898;249.50309965517243;-11.869743078790727;55.42310499999997;71.47713333333334;218.04673733333337;97.5734556088788;44.814835000000016;68.56986470588235;193.69535588235297;-4.872136722377596;103.402407;76.78045384615383;232.40793346153848;-9.132545336115;116.500309375;64.4780612903226;265.3386093548387;13.828333427878988;53.111896303030306;115.04416521739132;258.6859226086957;-21.51294148816168;232.52998000000002;66.64849999999998;198.21083000000002;185.7274131149235;111.60086923076923;85.54360833333332;219.027095;211.10825342458557;91.2667261818182;87.69476666666668;197.89352611111113;21.624678951767155;98.69084505882351;109.81830000000002;199.15725166666664;52.06782271044039;45.898835294117646;100.04137499999997;177.7090875;-12.036897046461924;69.77265259259256;133.599225;216.4889635;-15.932043123948143;47.32895709523812;123.11766153846153;221.13374999999996;-19.064968616320193;74.3727162142857;140.15442222222222;128.6725311111111;-10.04127556100741;86.62541062499999;122.97869999999998;169.67252599999998;-6.839500595320108;103.657746;130.29972499999997;174.89727249999999;1.3206088838842107;99.65480199999999;130.29972499999997;174.89727249999999;1.3206088838842107;93.70679500000003;140.2945125;144.6023675;49.70232044220486;66.17512666666666;89.5274;169.04357499999998;1.8446983644116353;93.34535571428569;36.21673333333333;215.98599000000002;214.0774324379816;95.98747428571428;64.88241428571432;214.08877428571424;107.90214238935621;14.553069857142853;39.420379999999945;169.16310000000004;124.99752375269136;31.560523500000027;56.68993999999998;170.801922;136.11383241278568;47.48157000000004;38.46904999999998;44.246925000000005;228.30175989365674;31.77839000000001;27.971950000000053;44.34312;228.10785578355433;42.22321999999996;35.57650000000001;38.0511;153.94569444419545;94.58104999999993;127.02870000000004;45.250685000000004;130.70634184573925
1500;33.30710963265306;103.63769615384615;252.14292897435902;-9.9902167192619;100.92595055072462;90.83371754385965;330.75874526315795;42.759014483385734;44.2820030754717;104.8943375;221.96209675;-9.620906860727933;44.00997932203389;111.74876875;231.4806660416667;5.202673640518245;42.81497066666667;104.26521874999999;225.7042540625;-15.078412837768479;104.74063024390244;90.90046470588234;232.89022235294118;39.76466051001426;122.91754962499999;76.96960500000002;273.23026475;43.84859160130967;29.960613771084336;80.88166164383563;243.74166027397257;-5.3420863352114765;96.99007333333333;127.12984444444444;182.35942111111112;-4.145981144630564;112.57087684210525;119.09568666666662;152.34037933333335;3.6341802761555675;37.723178999999995;99.69006060606061;217.1355387878788;-13.600307046376543;115.36558911111112;107.60389354838708;277.1600019354839;-34.51159323847686;90.56219204545452;81.40918333333333;247.01961611111108;52.21633656412726;93.96240166666666;115.83955263157895;164.12356999999997;-4.779872973213046;114.22853884210525;94.35055312499998;237.6246784375;61.46396710359037;75.40491125000001;86.41188888888888;242.95719666666673;31.5444913692829;48.11060345454545;115.14977692307691;280.1292007692308;-3.2441999155345225;222.11764666666667;67.32466666666666;235.77449000000001;187.17102042108124;136.31251538461535;95.89824999999999;291.034535;204.35452228403895;67.15700800000003;86.8044222222222;178.24253222222222;-69.83913271398042;138.64575200000002;98.79310714285715;202.50459857142852;32.46697409215325;90.33139529411764;146.67541538461538;129.43042307692306;-6.074756800966454;62.19964051851849;120.44915499999999;233.819904;-12.226811630122294;84.57253585714287;135.91102500000002;223.136856;-9.776355932599978;51.94286899999999;147.3458;243.26717;-1.5862470059957294;105.950503625;120.22907333333333;195.47478800000005;-4.579462989118835;127.754934;182.84078749999998;171.08104624999999;21.99475920393063;124.25235799999999;182.84078749999998;171.08104500000002;21.99475920393063;84.96066;162.7995571428572;148.96828857142856;-1.8902556044942458;137.65325083333335;174.47893000000005;149.337523;14.997245586421737;109.41540071428571;61.90895615384617;227.41100076923078;25.640475057741114;95.85328857142859;68.6096285714286;217.7300485714286;100.21988944505006;32.304913571428564;53.90368166666667;114.40039666666667;129.40226859278656;25.380282333333327;58.30583333333335;140.09868;36.831966035528104;259.17762;38.359649999999995;306.045885;227.67130136976994;243.47399000000001;27.931750000000005;306.65605999999997;229.94677891917644;498.02842000000004;35.07070000000001;549.1874;152.66904109617184;239.387275;77.0495;579.2849;158.94315068522457
1550;33.60303424489796;106.62911012658226;262.19538227848096;-0.8294207470965516;66.46695031884059;98.22656481481481;301.20933648148144;-32.604890262439525;51.47149354716981;98.21105106382979;209.03221085106387;-8.476217069105335;39.48006542372881;116.33645319148938;229.5253653191489;-9.78717749734475;49.44472777777777;112.4263564102564;246.35417333333336;-10.594538074172545;103.17344004878048;89.86904062500001;232.245740625;-29.256074739321495;114.28682462499997;91.27883076923078;268.10621897435897;-4.409718773015898;27.72571444578313;78.91112413793104;255.95107120689656;-4.592890139101209;98.4492;126.68617000000002;161.298713;0.9787726149637109;92.60441578947366;106.74208823529409;147.8647876470588;13.084495942189184;37.95226960869566;102.36348918918921;202.91712432432433;-3.364128418262397;113.65296844444443;105.43546785714285;261.2009160714286;8.88285889278006;105.73468886363634;79.14929444444445;263.47009833333334;84.33619151261162;69.57065583333333;103.00793157894734;203.67622631578945;8.121549346173216;109.66566489473682;82.00630999999996;212.44483166666666;24.904712168092583;61.939276875000004;65.7570375;213.15454343749997;-27.079472196123582;57.472696000000006;108.581325;261.9330982142857;-11.101811717332016;0.0;0.0;0.0;0.0;150.7191807692308;96.718325;238.5963233333333;341.00199907215705;86.93691127272729;74.99848750000002;207.65666500000003;14.49953529511541;145.5221170588235;94.50238750000003;249.10093125000003;-105.75481553725922;69.09411882352941;157.745675;186.77630916666666;10.08130463714825;67.35878785185183;121.7390608695652;221.67833260869568;-10.568641915699537;59.19720166666666;118.78928235294117;248.46101;-14.102294240366472;97.98286935714285;141.85431666666668;163.92601416666665;-10.625591570765973;114.20290399999999;141.49424166666668;212.27253416666667;-10.891066877423924;96.043394;121.96563749999999;174.73847999999998;1.4404935701625714;92.54081799999999;121.96563749999999;174.73847625;1.4404935701625714;101.14146000000002;153.76252222222226;130.10739777777775;-0.2203314888662817;88.4955258333333;104.24286;145.09486399999997;1.1839451378475123;104.47759714285712;67.62481666666666;249.54794249999998;-83.14182774178859;10.348102857142882;99.57430000000002;82.44382999999999;82.44777454529387;1.1787947142857085;44.25713333333332;257.8237666666667;39.84227463773338;22.275764666666735;49.23098000000001;171.73305;88.54958402098117;0.0;0.0;0.0;0.0;0.0;0.0;0.0;0.0;0.0;0.0;0.0;0.0;59.62757499999997;183.95000000000005;69.03318;119.87396551725651
1600;37.405947387755106;118.1965782051282;271.47119858974366;-14.62131479884563;80.62594492753624;92.0555894736842;302.94690526315793;13.143093175030225;48.392104981132064;107.21969749999998;221.79020025;-8.593056889457994;40.65989627118643;119.44121836734695;239.4792985714286;-2.2033174964682267;34.62117711111111;105.64895161290322;222.91416193548392;-6.991924323242566;92.82218868292684;92.44885945945948;231.36153270270276;43.30673393014087;95.8428535625;79.20055609756098;265.6867846341463;33.80151975266598;28.88222977108434;94.0715303030303;264.25158424242426;-5.2034233525872065;85.07104166666667;112.52085000000002;175.80162900000002;0.18298675817482998;90.37535157894736;96.07039999999994;156.20148866666668;-6.851098098028497;48.50393756521739;117.76347368421054;227.42504973684214;-8.253989812693035;127.21623694444445;90.65541818181819;281.8441439393939;17.470038796355606;130.4801252272727;79.82793333333333;301.06101;63.74088262217869;72.4333625;98.84274444444445;178.296515;-4.041484997154211;91.06737915789475;85.08381666666668;243.55427966666667;35.63572473532883;106.482326375;78.45114857142858;267.56368142857144;-12.672056542106821;70.35465248484849;123.74269615384615;275.5303411538462;-12.45864225624342;88.34474666666667;68.21323333333332;61.89539666666666;186.29737062375764;172.67832307692308;101.32784444444445;360.7951244444444;204.81130547756192;139.67038000000005;84.97738095238094;239.65588809523805;9.172979721262164;129.90716235294116;99.99409090909093;319.1690336363636;-23.742829310518108;72.19593411764708;112.75656153846154;129.30671692307692;-4.660515098129813;74.7857637037037;141.7353;235.48852590909092;-6.952107715717781;67.53272028571426;159.3001142857143;230.0117842857143;-5.074596878415958;76.93378207142855;146.10913636363637;204.1938745454545;-4.298509412963809;89.61667937499999;120.8777;210.5208090909091;2.276435658210799;165.00719800000002;183.97828888888887;161.90464777777777;1.8347142730829253;160.50388600000002;183.97828888888887;161.9046511111111;1.8347142730829253;89.60844500000003;178.9164142857143;152.73319;-3.3772349586752557;132.27728416666665;169.22084444444442;159.91554333333337;1.5363275235232947;73.58034428571425;61.5466475;178.120395;5.002630390191676;94.18162285714287;75.25728333333333;249.53008499999999;129.75325514688566;31.804661714285714;54.73280833333334;111.38405999999999;86.6958172341889;105.46678916666671;62.48018000000002;223.40191600000003;90.22432876429784;45.80832000000002;37.908800000000056;43.053309999999996;229.69232686418604;30.10444000000001;27.66195000000008;42.96782;229.39947964196438;38.76812000000003;34.47390000000006;34.251090000000005;151.88397260254672;93.42149999999997;128.91155000000003;51.57673;134.90093493135137
1650;27.618384816326536;107.93195507246378;276.29424855072466;-10.90730289430476;96.3946692753623;104.16523859649122;323.6812556140351;22.618056291317163;43.43795403773584;101.26621707317075;212.81240973170733;-9.81145076621918;34.66456983050847;110.56813111111113;229.1020177777777;-5.3999768889039235;50.253362;107.18713030303032;263.59340181818186;-6.747512860117524;99.84572063414635;114.36526333333332;258.04577333333333;-13.484834469653363;97.50222739583334;101.96567297297301;280.5248664864865;28.504711158459635;23.09724860240965;91.35918103448276;273.43583051724136;2.0901219404550084;90.51255666666664;120.0562888888889;179.86128222222226;1.5379771110000098;91.01216210526314;98.53752666666664;154.82491933333333;7.601095853625062;34.53848734782607;102.56292857142859;225.81876114285717;-4.330246586658474;82.33701072222222;97.28211999999999;257.50737100000003;57.05655047179091;62.31622977272725;86.0937222222222;224.15681666666669;68.31508178853615;71.41711999999998;77.60062631578947;176.67073684210524;6.522185382078248;113.57040131578948;99.41753000000001;249.1538733333333;19.463572840741524;62.398257000000015;83.57082500000001;254.9288892857143;-11.901210832389495;45.09939187878787;96.39962307692304;265.8226307692308;-12.254971052999814;88.26908000000002;68.31896666666668;61.22357;183.10466555607604;148.68715384615382;101.33572500000001;273.79942583333326;178.65578549667057;59.46809836363638;85.16136666666665;166.95549733333334;9.613081894646164;154.97168764705881;96.53494000000002;251.6464446666666;7.148428532854907;65.72994;133.67384615384614;180.3279023076923;11.711182048957625;51.50551362962961;100.59667999999999;225.93786;-5.397517724587797;49.23643457142855;113.53181333333333;240.39094066666667;-6.164166953171793;91.5205249285714;143.22498000000004;178.65344800000003;0.9631768635129093;114.07148818749995;131.04609285714284;199.9529592857143;-2.708947732703101;124.78487599999998;157.18633333333332;193.41270666666665;20.741063859377604;120.78193199999998;157.18633333333332;193.41270666666665;20.741063859377604;82.46118500000003;152.06243750000002;137.377695;-1.9922444917045512;98.87346916666662;148.02322222222222;190.12001666666666;22.784049757758325;140.67122857142857;72.50983333333332;275.02055583333333;22.845560759558584;76.96674285714285;45.495500000000014;276.059746;28.30655032848461;85.90779314285713;61.851280000000045;233.29262200000002;182.9137801257019;26.43047350000003;61.15835000000005;141.21484750000002;21.182155547854855;44.975570000000005;37.409399999999955;42.417815000000004;228.1443111858593;29.270290000000003;27.522450000000006;42.700775;226.64962606466767;37.02032000000006;33.323499999999946;33.25111;149.07675675661733;93.93674999999999;129.33300000000003;53.676755;135.83933783781833
1700;38.37187885714286;105.58861315789473;280.32950618421046;-4.49701423882284;63.80971402898549;89.14158599999998;304.1504928;-13.72147554675112;41.03404088679245;92.1967277777778;237.30143416666664;-4.361881983846364;46.14859372881356;114.8023733333333;255.89665177777775;-3.9190269271873075;40.77455622222221;100.96878000000001;238.76863942857142;-9.790447041645079;69.61488380487806;88.11833714285714;185.95763085714287;42.10907122011761;64.97064475;80.00449444444445;224.06224944444443;-9.95721001616845;30.371008168674706;95.86544126984126;261.82048349206354;2.236648194468884;94.45977499999998;129.61558000000002;174.807133;-22.49424946345329;82.12229789473685;94.24675714285713;138.21213357142858;4.83425710529639;42.003243304347826;113.53735454545456;233.73170757575758;-8.8570095239827;116.27173850000001;88.3583172413793;262.3237396551724;78.2954476579779;63.84811295454541;79.354765;201.103176;-29.91204796185092;73.06546749999997;90.717915;195.862955;-2.993423438810818;112.19513399999998;82.67709032258065;235.52847999999997;20.563642917567883;51.19336637500001;67.00721111111112;206.82642444444443;13.232733951346514;52.57365442424242;120.145304;288.0217064;-7.186764825313576;0.0;;;;141.41828846153845;115.02236250000001;332.39848125000003;223.7207313808603;69.16792490909094;90.86001764705884;195.8322817647059;-92.54187752860449;157.4387045882353;93.9387;256.53762500000005;32.95074278389267;66.20865176470589;107.82166153846153;143.3490369230769;0.13741220914559696;61.98288866666665;121.37105500000003;230.61591750000002;-8.035553013740707;56.18798176190477;138.93143999999998;260.57901066666665;-0.9334777827151157;59.03422214285714;122.66777500000002;228.8564866666667;0.008879760407951576;76.07756062499999;80.9393;212.131632;-3.260957808472751;89.53403200000001;120.03054285714282;212.78823285714284;2.1526145686507063;86.73902000000001;120.03054285714282;212.78823285714284;2.1526145686507063;69.48229500000001;147.52868750000002;143.24222625;-3.2912906039022065;102.19201833333334;107.19281000000004;166.78006499999998;2.6671423084226893;111.81321857142855;62.72193333333333;241.89295916666666;-19.306474198730672;23.80307142857142;76.43738000000005;186.00461;47.57649717080907;16.507272714285723;39.055845999999995;171.603122;65.7589819581203;39.59100583333336;53.5634;153.03396666666666;128.97506192297388;0.0;0.0;0.0;0.0;0.0;0.0;0.0;0.0;0.0;0.0;0.0;0.0;61.50442499999996;191.36029999999997;88.31043000000001;130.11229508213398
1750;33.0307358367347;124.73499571428573;298.61629114285705;-8.2182605091835;69.08858643478261;101.103744;314.967509;-0.25664488802341057;57.800542698113205;118.6945731707317;247.38396707317074;-7.917603462423839;41.68099915254237;120.75734545454547;244.50135454545455;-7.939330231335441;42.86423933333333;115.86841;248.49507300000002;2.898679457753741;75.3873815609756;98.9007636363636;210.59379090909093;17.482605654472955;91.71624777083336;96.22333902439023;266.44004;13.645800388142797;23.843807722891576;105.68753333333335;283.5339105263158;-3.276552191705552;105.7796683333333;124.22752727272727;156.17017;1.7171876578729695;87.44954526315789;91.58111999999997;149.770304;3.454203058806046;51.84540600000001;111.83170000000001;247.43734428571426;-3.4461374259286925;116.76797986111112;105.16513571428573;298.26615821428567;4.238694106465131;99.00681022727271;85.64934666666666;324.79042;34.522112601816204;67.59885499999999;83.37315000000001;155.73122874999999;12.060961312517497;101.47364231578946;93.0074633333333;228.2693526666667;-10.183781480278764;58.224354375000004;81.85887096774194;232.70960935483873;-44.325556937024004;51.80935084848483;124.11010541666667;281.131815;-6.196637632759855;81.29761333333333;68.26869999999997;51.63702000000001;183.35504888053433;127.25025384615387;104.57460000000002;188.04165363636363;316.07392853955594;66.05909763636366;82.5250117647059;199.91418705882356;1.004945704848114;148.79700388235295;107.73572727272732;299.04723454545456;-182.8752295412833;83.37054117647057;122.68825624999998;152.76038625;11.168243962636497;60.02272296296293;126.69039999999998;240.48601047619056;-9.584600493582712;88.21334019047619;143.64881666666665;297.00770888888894;-6.705254688549538;83.36413764285714;188.872;243.81044;0.5809707475228125;115.33507274999997;143.82171538461537;216.9583053846154;-6.095301318888887;151.30730599999998;169.63311111111113;186.25106000000002;19.53133832718951;147.30436199999997;169.63311111111113;186.25106111111114;19.531356423461673;114.54680999999998;185.1165625;158.34082;0.6018038559905381;139.6034083333333;144.11489090909092;162.41402363636365;11.392841938034705;63.40958285714283;82.56515714285715;242.33406857142856;-359.78097768076805;34.54194285714287;102.28876000000002;84.391056;123.05073724787985;12.709917999999988;72.54243333333329;84.19570333333334;218.58353429243837;21.314273499999995;62.20373333333337;79.22610666666668;161.3532973690131;44.72682000000002;36.807200000000016;42.700775;227.45684931548791;29.022690000000043;27.30385000000005;42.85129;222.9585205484498;36.530820000000034;32.61670000000005;33.65108;150.89739726055237;94.82704999999999;134.52975000000004;63.507095;147.71082546071085
1800;29.512679755102035;108.6470815384615;263.1753949230769;12.214358799301591;70.39259101449274;101.51219814814814;307.0904375925926;-9.599126286249078;38.178329566037725;101.97343684210524;241.49000894736847;13.212533596712909;37.924415254237275;115.15620227272728;234.29120113636364;-4.245193226319567;43.64851199999998;110.17149166666665;231.38672472222223;5.230588641303136;60.73782063414634;104.79441333333334;229.01106466666664;-16.475936678617447;89.58685979166667;93.00322187500001;272.97798375;27.72254502552478;28.956125204819283;94.15554333333331;253.3801778333333;-4.253738133220292;86.2423;115.75507999999999;160.797259;-17.025938081691375;104.34821368421052;101.0234882352941;143.20956529411768;-0.046230070398386384;41.235258173913046;101.78962;212.83113942857142;0.22693853746495463;100.87425516666666;97.04540689655174;247.64051206896548;74.64765269872;88.68661613636363;78.63142352941178;266.8614723529412;14.557247455831265;82.69616333333332;97.777765;172.8409715;-6.160174863298247;84.36713442105261;98.78519642857142;217.5427375;34.79379009367798;50.574659249999996;74.89018333333335;235.85488233333336;-13.658474963801934;48.33081393939394;121.59027727272725;291.8323445454546;-7.093033206188587;71.91271333333336;67.55013333333336;39.842000000000006;186.74846961232802;175.44803461538459;97.77484545454546;313.51665727272723;228.65506061871713;90.01282618181821;81.2119111111111;194.3696188888889;-63.7628480050722;163.69218764705883;108.34030666666669;245.5297293333334;-0.7842644236023933;82.4112011764706;142.45985;141.68669999999997;-4.688416231786905;76.57970251851849;145.49907499999998;216.71755549999997;-0.40987907520713873;71.35830990476191;148.04415384615385;211.1823461538461;2.3113223203891122;71.35538485714285;117.76165555555556;173.22938666666667;6.706271747208981;105.01759149999997;121.3558230769231;197.54737846153847;-1.4380826305017054;114.19025400000001;121.71449999999999;177.81659555555555;-17.386426464658527;110.68767800000003;121.71448888888888;177.8165988888889;-17.386444414757257;97.31821000000004;148.6067888888889;146.7724811111111;-15.94977959634504;80.39436916666666;94.59354444444445;170.3776288888889;17.3246867175454;112.52140785714282;69.32035846153848;222.24624384615385;-11.73350210618885;15.307914285714276;50.60825999999999;181.055772;55.94284441542057;28.49389599999999;53.41505999999998;113.87480666666666;138.24099853403118;26.429306833333328;60.05315000000005;156.147765;83.0005466583083;44.61492000000007;36.12579999999996;43.751305;221.8691351354676;28.912640000000046;26.734000000000012;43.67369;228.73180180147367;36.39771999999993;31.292700000000057;35.65112;148.6260810809424;33.19657499999999;73.54669999999996;29.76847;154.5722972971529
1850;30.192867510204085;122.2635432835821;278.1640308955224;-8.929870535689645;72.65610533333333;96.90885833333333;338.12643083333336;-68.1667548796009;39.250286132075466;114.84761250000001;251.81681125;-6.479264706783853;33.16576423728814;110.35965652173915;243.33029608695648;-19.367066555379626;35.13258844444444;107.23829999999998;270.9613740625;-13.23307250755273;103.94977882926828;118.16889722222221;243.91589805555557;25.51109513036556;103.87004291666665;91.43214047619048;259.796639047619;-16.678152492944463;23.850260566265074;104.57921071428574;278.72416535714285;-1.0293976863851095;98.04698166666667;127.41845000000004;179.70885799999996;39.01367977599726;82.94176421052633;82.97388749999996;148.77960250000004;-2.3872547003623383;44.47941091304347;102.19546756756758;231.14405081081085;-16.678721362711677;114.57529097222222;98.38868620689654;291.3869975862068;24.337418281400435;109.18124795454546;79.74180000000001;260.49050176470587;-33.69407446686613;63.11414166666665;72.63871111111108;194.10998444444442;-2.5731086989129657;102.09036031578947;98.71785;233.2398159375;24.13689964468948;62.21986175000001;82.00059000000002;230.8731478333333;-27.727547996775073;44.52978527272727;117.15677600000001;305.37856640000007;-34.8016632109593;70.45001999999995;97.34894999999989;36.612855;126.42390507406273;105.28991923076924;125.87821;189.48577799999998;197.66824521509176;71.24078727272727;100.42878125000003;188.80411375;25.10409000331492;121.35968105882354;107.46574285714287;231.19855285714286;-113.17938799452868;43.105341176470596;89.96975454545453;157.5758181818182;2.027961178696024;79.0829202222222;133.10508636363636;272.5500845454546;-18.813541524695054;49.78389690476191;159.76572666666667;301.7123393333333;-15.89775635596649;95.93359635714289;165.16370000000003;202.19252666666662;-9.337642424943445;113.16604812499997;143.83092727272725;193.8110281818182;-8.053604954404907;106.01629;147.88164285714285;207.32881;42.57339133513581;103.51445000000001;147.88164285714285;207.32880714285716;42.57339133513581;86.48999500000002;140.74335000000002;155.2540325;10.531859139546683;129.36633416666666;124.45230909090907;157.7235863636364;20.360081545428432;111.85156428571429;70.80834615384614;248.02549692307687;-123.1008839481858;31.153485714285694;94.16474000000001;198.98462;73.24706219691959;11.005194714285722;55.04596666666672;185.00279;155.2527710757311;37.94529799999998;60.35290000000007;133.596448;162.2683619563465;24.394110000000047;50.929200000000066;26.65111;124.96561643819734;21.892270000000046;50.929200000000066;26.65111;124.96561643819734;36.090820000000036;30.09430000000002;37.1511;151.5342465751499;96.07290000000003;137.88575000000003;71.75545;154.6695267744073
1900;32.50543551020409;111.15172459016395;277.99984737704915;-8.131236727665776;66.97642863768115;105.37926530612242;307.59656183673474;-30.028226468024208;38.75598616981133;117.97028888888889;271.62602583333336;-14.683437334867598;37.148106101694914;116.3260743589744;246.36687846153845;-3.4657204080247666;44.236754888888875;115.48015;236.0973656666667;-3.6990726884764147;69.33238634146339;103.91072812499999;207.43294500000002;25.59600834741714;56.5654415;87.194565625;247.51565;0.027452881649229433;26.03569878313254;112.14969666666667;281.7283616666666;-14.857641893795538;110.106315;131.4740500000001;178.173655;-0.4851232304805082;112.32729684210527;106.87696470588234;144.1460994117647;-25.15402361920786;32.904001782608695;122.94746538461541;230.11842115384616;-0.5171786432970056;99.98928047222222;98.36219666666668;287.8702186666667;-3.9462877356358823;51.08877068181817;86.15221764705883;241.45296823529412;18.050626395776774;88.43978916666667;124.31093888888888;190.35144333333335;-3.66128474825779;67.90632389473683;91.99695999999997;212.5014723333333;10.178903487480294;35.078167875000005;65.04799615384616;195.49017884615384;-6.166622154223517;59.6660224848485;139.57824499999998;304.05665799999997;32.35098170277341;0.9694599999999821;4.608700000000021;48.421170000000004;317.54414285640024;131.9672884615385;97.51532727272733;197.29452727272735;205.48789126631448;67.8771910909091;87.96792105263157;201.4940273684211;24.585244389604586;79.45488035294116;99.15835833333331;251.8080891666667;-6.341352303798975;82.32541058823529;143.5095307692308;189.5632453846154;1.1966116563093803;70.0331719259259;142.62339444444444;205.09395444444445;-0.584036729112478;73.0356259047619;164.90000625000002;266.635323125;-1.3857628759609308;72.3232805;146.8483;197.054641;-4.220506482168545;98.88127312499998;136.78142499999998;236.3811025;-11.117355382577939;141.08542599999998;144.39523333333332;182.30655000000002;4.58759431773964;137.08248199999997;144.39523333333332;182.30655333333337;4.587618008808095;88.43118000000001;181.73673333333338;191.488345;-1.2141683547928452;115.6983008333333;109.12853636363639;156.77783363636362;6.1498114094995735;61.53923928571425;53.093926666666654;247.80057444444446;-65.32477965650338;23.981571428571463;72.18911999999996;134.02625400000002;42.40535939083666;18.008015571428558;46.12034249999996;123.42837499999999;135.57185987548286;21.03014016666665;52.06045000000001;163.1631625;169.76586180539562;20.01631;20.003699999999963;61.89626;335.07333333279155;6.941119999999994;2.2914000000000545;62.76218000000001;346.96657142776;0.0;0.0;0.0;0.0;63.39282500000003;204.5211;119.5477;153.8385714284614
1950;28.83573151020408;119.60453;273.26119966666664;-7.116392269610588;80.44095449275362;106.99309791666667;338.368733125;-6.679279221547643;40.46894275471698;113.32000769230767;259.6441938461538;-4.469464856754896;34.92805016949152;114.28399523809524;240.52695238095242;-11.283899300004439;41.39016622222221;115.65060999999996;242.733963;-14.041578715416955;85.93511809756097;108.58885806451613;222.76363677419357;-2.669835878266691;71.44227622916667;101.60939696969697;233.2501887878788;3.1380429617628276;29.906928987951808;108.90102807017544;265.4414954385965;20.820987175557843;106.48935666666665;120.41740000000001;215.939144;1.9997126611487108;54.89276315789474;74.5386181818182;184.0992709090909;-0.5955085066092876;37.99982808695652;109.76217666666665;209.93894399999996;1.0785598656561688;80.13458172222221;105.81196399999999;256.8728584;47.508154747418274;64.03607840909088;92.75793124999998;276.073685;25.979710853012858;58.43397999999999;71.90093684210524;196.31557842105263;-19.72132291088812;83.18750215789474;114.26576153846152;241.41615192307688;-18.932427529508512;49.26004212500002;76.18535862068968;219.16327724137932;-7.729353761127198;52.573002909090896;123.57898636363633;284.7947463636364;-8.902666756629882;71.80194666666664;65.15943333333337;42.30772;186.47226851881484;134.53967307692307;117.69745000000003;181.83498000000003;317.3513978308359;65.58735418181818;88.89872500000003;194.55980499999998;-35.481668090455685;104.4167211764706;110.40113000000001;267.02541099999996;-79.56578810665567;56.44295294117648;110.11287272727272;151.3076372727273;-42.894341160292115;45.38039399999998;140.62886428571431;246.0904028571429;-2.4500738350928133;32.87521380952381;127.71941000000001;281.384255;-13.405051439624495;88.05565628571426;155.4434;179.98007;-2.6108888555131755;114.2641573125;142.05959090909093;166.42765;2.737221980106268;95.21863200000001;119.5342375;190.77532875;1.0669964099564122;92.21642399999999;119.53425;190.77533625;1.0669964099564122;97.64462000000002;151.97836666666672;148.9160866666667;-4.21255939641199;79.74234416666665;132.28802857142858;218.25476000000003;-94.02059563336725;69.43305857142856;81.87593999999999;229.753887;-34.01848870501955;24.471614285714292;84.84448000000005;164.985654;99.44808249237437;23.873969857142868;70.43264999999998;78.73656;191.05581157093604;25.07943233333333;76.69150000000002;108.82044;49.448142645966215;44.28137;34.432250000000025;45.25665000000001;236.0591076318036;28.660639999999987;26.824950000000104;45.383570000000006;231.9182524737402;35.54311999999999;28.66630000000003;38.651109999999996;151.53863013726576;97.1755;140.29254999999995;81.07275;157.47097572711067
2000;25.45617208163265;121.87302075471699;274.98699264150946;-4.953642459223949;71.03958921739131;102.86296;311.35360822222225;-6.990559073997956;43.52710320754716;113.5515;267.7418181818182;11.371372090019365;35.52082322033899;123.5785692307692;245.37517461538468;6.719631595864341;35.57082622222221;119.269571875;251.7208734375;-19.092690287715122;45.846398780487796;100.51005714285715;188.42798321428577;-9.07798274872559;87.62826558333332;110.45435142857143;250.16720400000003;35.98926759316111;35.877591891566276;110.52234423076924;279.71155384615383;-11.404169631923365;74.53421166666665;124.62110000000003;264.3441057142857;-149.23762652770003;105.68456421052629;100.6229842105263;146.40387894736838;1.89915727616783;49.57818208695653;118.85194687500001;235.19291750000002;2.3039080369589096;115.77561102777779;108.60246129032258;285.3684048387097;69.79147527059101;102.11507068181814;83.20205882352941;296.0205917647059;-73.73943961666953;83.59872166666666;106.79604210526318;195.48517789473684;-2.4189832946733554;68.55678968421051;108.4543896551724;223.08808068965513;49.039655551068556;41.033347625000005;80.72750800000003;249.178148;-61.784265545152145;53.19878666666667;138.6083772727273;307.6234963636364;-31.225754378309293;71.15854666666667;63.71636666666668;43.34028333333333;183.14466617289773;61.08110384615387;132.08541250000005;140.4723925;259.55054170670616;70.89173327272727;93.58045499999999;197.47608399999996;33.36349180496775;98.53195788235294;107.10193999999998;220.23069666666666;-81.79944879894221;76.9273917647059;129.82574375;175.50173125;6.559733482330681;67.22113214814813;147.40216999999998;243.32772849999998;-24.466832496027465;87.42878866666666;171.00058888888887;273.5239011111111;-40.65281119272336;65.80447057142857;148.171;227.00521363636372;-62.80807481990127;94.24444187499998;140.42537499999997;241.44142666666667;-77.10008508259067;132.555674;153.69039999999998;196.07687499999997;-94.3768083614469;129.053098;153.69039999999998;196.07687124999995;-94.37686294659972;90.05147500000001;155.64722500000002;168.99427624999998;-123.34186486341126;125.62359083333331;115.23882727272726;160.34327363636365;1.6378680001388062;76.99980499999997;66.37221499999997;198.75478999999999;-101.11664693067108;21.505571428571447;78.43246000000006;208.81191200000004;21.783474203723813;16.737220857142876;42.86006499999998;153.6232625;87.18410667995485;33.09424016666666;58.02897500000001;123.064125;176.61960452550235;43.841769999999954;32.71369999999993;46.03356000000001;231.65071822716436;27.746039999999972;26.4208;46.07672000000001;230.19952054784673;34.697520000000004;26.99260000000014;40.0511;151.34479452082718;96.69474999999997;138.98585000000003;86.43119499999997;158.4504085129699
