;Phalanx.0;Phalanx.1;Phalanx.2;Phalanx.3;Phalanx.4;Phalanx.5;Phalanx.6;Phalanx.7;Phalanx.8;Phalanx.9;Phalanx.10;Phalanx.11;Phalanx.12;Phalanx.13;Phalanx.14;Phalanx.15;Phalanx.16;Phalanx.17;Phalanx.18;Phalanx.19;Phalanx.20;Phalanx.21;Phalanx.22;Phalanx.23;Phalanx.24;Phalanx.25;Phalanx.26;Phalanx.27;Phalanx.28;Phalanx.29;Phalanx.30;Phalanx.31;Phalanx.32;Phalanx.33;Phalanx.34;Phalanx.35;Phalanx.36;Phalanx.37
50;0.11724311111111187;0.11863051851851923;0.03690881481481654;0.2793451851851852;0.1560959999999993;0.46236155555555586;1.1663965407407408;0.7538474074074046;0.8447194296296293;1.0491869777777814;0.7250939999999947;0.6223362222222227;0.9101632814814911;0.5009834074074124;0.5970441481481508;0.8233120000000023;0.32981851851851995;0.568280666666665;0.5231498518518538;0.0012525925925922787;0.0012525925925922787;0.0012525925925922787;0.0029162962962960524;0.01940592592592549;0.017920740740740893;0.03313777777777886;0.03782148148148078;0.027530370370370687;0.03402666666666642;0.034251851851852866;0.03852222222222131;0.038699259259259176;0.03315851851851882;0.03981333333333265;0.02812518518518598;0.041184444444444857;0.046615555555554994;0.02395259259259151
45;0.11343229629629659;0.11724311111111187;0.03645251851852025;0.24989118518518497;0.14199555555555615;0.3620629629629646;1.1370004740740762;0.7020987407407392;0.7846239481481456;0.9609028296296308;0.7027399259259217;0.5987977037037027;0.8354430592592661;0.48858266666667327;0.551569037037037;0.7701868148148185;0.30413037037037294;0.5391579999999988;0.49055785185185424;0.0012525925925922787;0.0012525925925922787;0.0012525925925922787;0.0029162962962960524;0.01916888888888901;0.017920740740740893;0.03313777777777886;0.03689111111111069;0.025252592592592455;0.03402666666666642;0.02480740740740859;0.036799999999999396;0.037906666666666804;0.03315851851851882;0.03939851851851754;0.025140000000000225;0.041184444444444857;0.04523999999999862;0.0231399999999991
40;0.10769229629629615;0.11343229629629659;0.03594511111111305;0.2378045185185187;0.1397874074074084;0.33265503703703775;1.0343175555555608;0.6552824444444441;0.69387654074074;0.8329926148148148;0.6388731851851795;0.5363710370370377;0.7705662444444524;0.470496592592596;0.515341851851855;0.6970553333333325;0.29117629629629727;0.5155202222222205;0.4334948888888912;0.0012525925925922787;0.0012525925925922787;0.0012525925925922787;0.0029162962962960524;0.01883037037037041;0.01743185185185178;0.03283925925926033;0.03600740740740649;0.023781481481482614;0.03312888888888915;0.02480740740740859;0.03590222222222213;0.037906666666666804;0.02417037037037083;0.0384592592592591;0.02073999999999985;0.03219629629629687;0.036251851851850626;0.013705925925925115
35;0.09680192592592426;0.10769229629629615;0.03403007407407649;0.2257997777777791;0.12518296296296336;0.30345503703703824;0.9223450370370402;0.6115160740740753;0.6015151111111087;0.7717491333333331;0.5618842962962948;0.5199358518518521;0.687362985185191;0.4395668148148167;0.47186851851852024;0.6234444444444456;0.2745514074074065;0.4382973333333338;0.38682177777777776;0.0012525925925922787;0.0012525925925922787;0.0012525925925922787;0.002422222222222209;0.018334074074074058;0.01743185185185178;0.03283925925926033;0.035105185185184205;0.022965925925927142;0.03276592592592635;0.02440518518518628;0.02466740740740679;0.03415111111111247;0.02372444444444484;0.0384592592592591;0.020325925925926136;0.03129407407407459;0.03489481481481318;0.012279259259258669
30;0.08703266666666507;0.09680192592592426;0.03403007407407649;0.22114792592592777;0.1231829629629635;0.26399940740740857;0.8749601481481494;0.5507191111111126;0.5425691111111074;0.6972449111111096;0.519385555555555;0.4567967407407383;0.6054566148148204;0.38461792592592686;0.4387161481481492;0.5288251111111126;0.25786474074074045;0.32054681481481534;0.34657970370370406;0.0012525925925922787;0.0012525925925922787;0.0012525925925922787;0.002422222222222209;0.018334074074074058;0.016942962962962663;0.010305925925925934;0.035105185185184205;0.013205185185186383;0.031117037037037044;0.023170370370370685;0.01695481481481417;0.030197777777776953;0.023297777777778323;0.021336296296296152;0.01039703703703607;0.030848148148148596;0.03446814814814666;0.012279259259258669
25;0.08623414814814741;0.08703266666666507;0.02719955555555708;0.21642355555555623;0.11422592592592554;0.2371434814814812;0.8147512592592593;0.5193033333333318;0.46430881481480935;0.6433389111111096;0.4297522222222191;0.36962918518518156;0.5172766888888967;0.3564372592592605;0.3709842222222228;0.46538903703704027;0.2462951111111117;0.28154162962962787;0.3206019259259246;0.0012525925925922787;0.0012525925925922787;0.0012525925925922787;0.0019451851851853361;0.017830370370370476;0.016942962962962663;0.009928148148148668;0.024448888888887015;0.012339259259258871;0.022597037037037585;0.019718518518519614;0.01592518518518457;0.02027037037036947;0.02206740740740774;0.020475555555553363;0.009447407407406495;0.02960592592592661;0.02545259259259288;0.00998074074074027
20;0.08448081481481545;0.08623414814814741;0.01921140740740902;0.20952355555555802;0.10303999999999965;0.2167019999999999;0.7202512592592594;0.43754274074073757;0.3776231851851815;0.5459374296296307;0.3727848148148086;0.31449955555555076;0.41086918518519083;0.3061104444444484;0.31881718518518726;0.4043882962962956;0.22218851851852045;0.22847525925925855;0.28618592592592373;0.0012525925925922787;0.0012525925925922787;0.0012525925925922787;0.0007377777777778479;0.017830370370370476;0.016439259259259077;0.009928148148148668;0.02346148148147925;0.011262962962962635;0.01696148148148085;0.019333333333335114;0.014682962962962585;0.016279259259258924;0.02206740740740774;0.01780740740740559;0.0076940740740736955;0.02918370370370427;0.02455703703703665;0.009139999999999199
15;0.08194748148148266;0.08448081481481545;0.01593125925926073;0.199312962962965;0.09446962962962963;0.18123555555555565;0.510501925925925;0.35126259259258674;0.3142978518518445;0.3911182444444407;0.30491244444444165;0.27101533333332434;0.319647777777779;0.27519874074074313;0.25916148148147805;0.33890651851851833;0.17295814814815122;0.2088752592592576;0.2612390370370348;0.0012525925925922787;0.0012525925925922787;0.0012525925925922787;0.0007377777777778479;0.017830370370370476;0.016439259259259077;0.009550370370369718;0.02257259259259117;0.010403703703703485;0.013376296296296228;0.008607407407408296;0.011914814814811705;0.015827407407407654;0.008394074074073984;0.012755555555552774;0.007287407407406371;0.017600740740740802;0.021573333333333056;0.007308148148146959
10;0.07946896296296355;0.08194748148148266;0.01163651851851876;0.1801176296296319;0.0874022222222215;0.11129999999999975;0.3990379999999923;0.2934679259259206;0.2593936296296254;0.30913217037035967;0.26262170370370236;0.22159399999999202;0.23094674074074228;0.20693429629629764;0.20040118518518457;0.2682464444444417;0.14465962962963255;0.1281200740740744;0.17605992592592482;0.0012525925925922787;0.0012525925925922787;0.0012525925925922787;0.0007377777777778479;0.017830370370370476;0.0014296296296295087;0.009187407407406915;0.007440740740739637;0.010403703703703485;0.01238518518518453;0.007616296296296599;0.011914814814811705;0.015363703703704134;0.008394074074073984;0.009474814814814603;0.0059614814814814825;0.015022962962963347;0.01976740740740655;0.0059088888888894605
5;0.05940970370370072;0.07946896296296355;0.010174074074074179;0.14061614814814838;0.06642370370370153;0.077984444444445;0.25900318518518306;0.1797911111111031;0.18452681481480782;0.21360417037036908;0.18657296296295903;0.12424140740740226;0.16126659259259263;0.1597083703703745;0.13005866666666868;0.16478266666666525;0.08571185185185365;0.08037474074074087;0.09388977777777939;0.0012525925925922787;0.0012525925925922787;0.0011111111111109426;0.000355555555555569;0.017341481481481354;0.0009481481481476226;0.0;0.006077777777777745;0.00867037037037019;0.011474074074073913;0.006994074074074774;0.009717037037037286;0.012976296296296739;0.007040000000001172;0.008572592592593062;0.0059614814814814825;0.008662222222223771;0.009681481481481288;0.004469629629630213
