;obj0;obj1;obj2;obj3;obj4;obj5;obj6;Cube;Cylinder
50;87.34170591313448;84.77006327006328;90.18518518518519;96.36141636141636;80.82366171839855;80.33613445378151;73.41534391534391;72.5006543164438;81.28665577646902
45;82.4777603349032;81.42118992118994;89.62962962962962;96.36141636141636;79.64417453891137;74.39614307261367;72.5542328042328;70.83042639621587;75.87518147450236
40;80.25553811268098;76.86002886002888;87.56613756613757;95.52808302808303;74.82337253389885;72.85768153415214;69.62962962962962;65.89673046251995;73.47302223023786
35;73.75893947322518;72.21262071262072;85.34391534391534;94.40920190920193;73.41596512649146;71.439883645766;67.54629629629629;62.68376749955698;72.33292529642276
30;69.5700331414617;66.17127317127317;82.31746031746032;90.84998334998335;63.75694578326157;68.09146735617324;61.28968253968254;59.08191564770513;64.31551929175019
25;61.78135356706785;65.00460650460651;79.15584415584415;86.72910422910422;64.21685624317203;58.888960712490125;58.01587301587301;53.45733652312599;58.90354919556957
20;54.23164137449852;58.22316572316572;76.93362193362194;83.9940614940615;57.71880556091082;52.50922933275874;51.382275132275126;48.01063264221159;50.56293580656907
15;52.412349555206696;42.92207792207792;71.18710918710919;72.11249861249861;47.55575905575905;44.14736897089838;43.219576719576715;45.00137338295233;42.88562770311497
10;38.3320251177394;31.0994560994561;47.768638768638766;63.322399822399824;28.23076923076923;31.49142687377981;31.90343915343915;35.173577884104205;29.072206985619548
5;27.012035583464154;19.75135975135975;28.77296777296777;45.4999444999445;16.816239316239315;25.275094186858894;20.517195767195766;24.528087896508953;20.1743671972874
