;small;medium;large
0;0.0;0.0;0.0
100;5.906931340246542;8.082522536672029;4.488820919158359
110;6.547934963823102;11.76054960144691;4.713174689754684
120;6.98783282901823;10.556323684137356;6.737210263713817
130;8.027159139290934;10.211192345389007;7.035219477942697
140;9.265980597518995;12.200554016008748;7.238284606953897
150;9.45393008422003;12.809442959288772;8.065841303986712
160;9.611696823364786;11.737156824743398;8.495283006218587
170;9.669234459500073;12.133946723647364;8.644123147130653
180;11.076956423896165;13.943233117908756;9.570473487300575
190;14.187337007875492;14.44758593789109;11.511057886084261
200;14.848022615511422;17.214793937818936;11.408734835946584
210;15.953436338188087;18.095841396257796;12.03941854091231
220;16.164832905302465;20.816919821681147;11.66245396103897
230;17.082036290455363;21.000576900732458;13.192097539108623
240;17.763650507632978;23.068347769917796;12.425762575276579
250;18.075451661234755;21.00781318783012;13.985570496058884
260;18.7421349321963;23.94807215473313;13.51368335695389
270;19.491293723678684;23.37831789332386;13.404472244639376
280;19.656932252975597;28.09927188404941;14.133091598764352
290;21.916288116871115;27.04105645272873;13.583000055495885
300;22.184859152375726;28.211838001098076;14.157910890582288
310;22.29027276217674;26.98530713584747;15.172442776957888
320;25.197528122258436;29.651428085650128;15.642837316017317
330;21.186732584923313;33.139989398930524;14.483289944182797
340;20.87845540535882;35.10890785008393;15.390613198621553
350;22.53038878343198;34.523840434350795;16.251527163532074
360;24.21281261183642;37.68886659558724;16.783019180839002
370;21.860623325948307;35.908045316664186;17.088262207490402
380;28.33361991566349;34.94782921096043;17.23780020899471
390;26.665522200377623;35.477606777824356;16.777467714692712
400;28.492955853710725;39.088966233596594;17.236173972693972
410;30.017819969277863;37.06104369272313;17.191903164231604
420;30.29955353069854;38.88795976143307;18.900931091269847
430;32.367029028793276;39.37257276616177;20.71251274785801
440;30.22137271450771;38.85174942270932;18.72476959693267
450;28.381428758054934;39.18964829532826;19.31447730430064
460;29.314274921784843;39.588328737938454;18.33908250669155
470;30.68595786715556;40.814090281383095;17.91419206878306
480;29.697407534546414;41.473414423605746;18.826569232804225
490;31.203475222150953;43.88334299954514;19.808652787780396
500;30.9657585693666;43.62300184489678;19.08880269931457
510;30.180602734250446;41.646527590251765;19.96064114909599
520;30.107962708217947;41.42975717444153;21.077548680283225
530;29.821980618838975;41.158449474378486;21.013053791486286
540;31.17142930411991;43.600651339440496;21.360762389652834
550;31.70865277793167;45.58191761891939;22.23882121145888
560;33.99734665084074;48.04207097767193;23.06375115171651
570;35.14902983488174;50.45491387227535;22.24136528687612
580;36.00350212196445;49.066622361695025;23.06303900974026
590;36.30905757082677;48.24210265137603;22.85272689417989
600;35.77181532732565;51.682841626975375;22.81494492368538
610;36.16278604000902;50.47254857401455;23.44334857886851
620;36.10015771131323;49.57257888859633;23.82694940102708
630;36.83961479689554;49.562517463885484;23.578011481456617
640;38.7127912247121;51.789376660751486;24.21099165985178
650;36.10023052507085;50.67381488111138;24.83218644840454
660;35.28433360563178;50.63739364372657;25.432166811417755
670;37.51513700895375;51.0253441696524;25.577540455182067
680;37.550023958974556;54.18118251520948;26.567978629940857
690;38.47751128317023;51.70475332835439;25.819159698830404
700;40.13533875129026;53.011135309516504;26.854104568920583
710;40.853762973493595;50.645585196197544;27.146961122915073
720;38.482604903565544;53.29400131887555;26.4522861387966
730;39.24141671502208;57.924366381140366;26.775674446460403
740;42.015588210212705;56.714191449194864;29.0007934409171
750;42.3847487466168;58.54647287497298;28.83877571957671
760;42.36777092137441;60.53005463918151;29.951475823231192
770;44.163114809142265;61.568644125575155;33.452867153417046
780;43.888989090252025;57.6515169608859;31.900831336134445
790;41.64396835390461;56.085320745763646;30.897600315789457
800;43.550184699305944;59.02266855083963;33.30726628387829
810;44.33155714124203;63.223141265765506;32.466615445314474
820;43.82002096725604;59.46207030547075;33.9391014770723
830;44.31341017613271;59.822975477477215;35.22276083208458
840;45.432341152826496;63.107798315060634;36.442991037163566
850;44.44164161864501;61.216222528390496;32.32981678195489
860;44.67998152006423;64.37429715094034;30.791953795995664
870;46.45852602048997;62.92779033827187;33.25675937387373
880;46.24193832102693;64.63090756736104;33.566668433427026
890;47.306943641724004;64.6240009286549;33.00801506261023
900;45.230451001779365;64.57306933613211;35.24799084811023
910;48.48951634697437;64.22792942757398;37.080014920255174
920;47.100426911382215;62.88488820977562;34.281160871212116
930;46.944312025139816;66.37059821822585;32.83362783867622
940;46.71879754272157;68.60865579274123;35.863535689153444
950;47.97852418902342;66.03578348609165;36.06463008259284
960;47.81659273473705;67.96660681204331;34.349924332399624
970;48.713595160856485;70.03865435476688;36.032428060587065
980;49.94386197229787;66.7128823431253;36.76390871723882
990;49.37857591267161;64.78105342530839;36.539996538149346
1000;51.06660274949302;65.94427909332991;37.678998187389766
1010;51.34899233012029;66.83549813455515;37.711291276575274
1020;52.26370799270824;72.1912423800153;36.66067544356379
1030;50.77309320565222;77.36527735003484;36.23134741971207
1040;53.98738210596217;75.33556735293006;35.20692000029142
1050;51.30442877262972;72.86694043859451;40.8412747722504
1060;52.168995692425305;73.20519444299599;39.79408940336954
1070;50.977283066701574;77.0138820947806;42.16769359307359
1080;54.17506602862314;72.43547493075104;40.55229831657849
1090;55.571258070662985;77.13814872722861;46.184520829725834
1100;58.42064129275614;79.23608452156871;48.26332016902721
1110;57.94592846120897;83.66182658843933;47.616359699546486
1120;56.36108292685205;77.54882854654029;43.18058502832951
1130;55.159599497777364;77.07916144282012;42.98483088744589
1140;54.80677015752724;72.44736285320278;42.224402633477624
1150;50.64796833034648;72.42425701628746;40.742274172528845
1160;50.733412760447735;71.4953407177767;43.56705405844155
1170;54.52083628555303;68.91257394490593;46.29783132369613
1180;52.89914115809317;71.97797152754354;47.36046960336887
1190;56.09512092065252;73.58403788684886;45.56459345621953
1200;55.32984718335047;72.80494233064792;48.42386804110705
1210;50.12508928520381;71.67432438322413;46.46153399514991
1220;50.37873778631604;79.2305128615248;44.819234808641966
1230;53.60440501184552;69.01820509576092;44.67596742252455
1240;53.0742978251714;71.58802613151414;44.89430480989656
1250;55.11318009277911;75.25165075535476;48.90286233449477
1260;54.029709635162945;73.13063006026552;50.45812831878307
1270;55.20761087267343;72.07202519217759;54.16378576298701
1280;54.28391309023856;76.94559892255874;52.040377876750696
1290;55.360731622756006;73.77121688719787;53.12759308386706
1300;56.851216510843216;76.52030942408287;51.575275597976415
1310;56.65363861422292;77.33445058183045;54.0995766387944
1320;54.233252101212585;79.39514452597854;53.57614873770169
1330;54.757438967647644;79.7899791391145;55.871943706709935
1340;55.79562502169176;86.85489415895749;54.778864213732
1350;55.80044551431028;78.3942670552947;57.29163383116883
1360;54.76994806219098;79.99103612423424;51.37768958253191
1370;58.18402929023137;78.40484635262634;51.0803361499118
1380;62.695167374065;78.16412580522216;54.347318402295365
1390;59.00240821153432;79.24377703709297;53.82679641684703
1400;62.42271743856891;87.3155057275738;51.84718762445886
1410;63.83413476700871;83.43564362040739;54.089234277245765
1420;63.93367161630237;84.38734567863077;54.79551904566973
1430;68.38229177914963;82.621638830584;57.174901194429516
1440;66.70615283242861;85.45532383961034;57.07078503291845
1450;63.45623167288846;82.04876864120553;59.814920246083275
1460;66.63311355031884;87.95200117556988;59.71790898671095
1470;71.47475116861204;88.83503634316111;60.8126379883658
1480;67.51750202906867;88.67516001604282;61.793734310405654
1490;66.2019364664069;86.516873845982;58.77264801406927
1500;67.94717254268443;91.58853988417933;59.14917417725686
1510;69.58129635347764;94.23215085860011;56.57333151993353
1520;69.16755269569059;97.33205492891166;59.02994755813954
1530;68.3514091409477;97.05806653634413;55.98897344434606
1540;69.07408767170199;91.7001746460058;60.38115298265042
1550;72.81894790688031;93.5583198641214;62.84812242063491
1560;72.06065878392464;91.6820491916664;69.56739278369125
1570;72.04864108385324;89.00523803148111;65.48008367965366
1580;72.52765833509434;86.70805177110368;64.69548619244391
1590;75.06821719461539;99.64191080311689;60.29023467331119
1600;71.19855207052503;96.688913067086;56.411849933261166
1610;77.3347247508148;94.00652535415097;60.87737953530965
1620;75.5264291665009;97.6512412221562;59.7457070423449
1630;75.25981015417906;102.14409073372958;62.99553659788358
1640;77.30693171073432;93.05737011484403;62.807722331409906
1650;81.21179993510205;95.78631086269924;63.904805224385726
1660;75.06952915445551;93.89861120942801;66.6195187082236
1670;75.58638456037077;90.48628231908444;72.75875091096403
1680;73.04698938784921;92.59320085033735;72.27435538961039
1690;77.2863874247918;98.61608757132132;69.60616661904764
1700;75.12762534922963;93.85494399356232;65.22833707407408
1710;77.84963078315354;100.65902238172862;64.35454737761069
1720;83.40740611821744;100.91393415405484;63.15100478458049
1730;89.7530633692128;98.43686194630273;66.81080181893687
1740;86.66837203302256;91.47788926849364;70.12233495275888
1750;85.83403154747019;98.77124161837828;66.72064664243474
1760;85.4560218478573;97.07091994054966;70.71636289153437
1770;79.1547510512026;102.87904391135119;71.88324640618639
1780;78.68248060051117;108.32609865915822;71.62121721330013
1790;81.99800570206817;109.9536574834841;67.59902442279942
1800;80.67827469131507;107.58716375731268;67.86980349025973
1810;80.80926978000016;104.46014406697162;66.60649825937949
1820;90.3115922930495;99.91434533429081;63.3699288035366
1830;87.08677341840912;90.31119425263829;65.52713848098928
1840;82.03967805822246;103.42637267952323;68.43822828719085
1850;87.48637585194926;107.04147954692417;64.49706185340804
1860;85.75347426497929;104.17667396122046;69.32264894885363
1870;82.81317116865519;107.82599465819096;69.21742411564627
1880;84.18631208595761;116.18069327180015;58.41726792500781
1890;96.000454153808;106.24700042913953;66.95871003246754
1900;89.68567978755311;109.06444247985777;68.67263542680777
1910;95.31508486796434;104.6186007991642;67.561211324515
1920;92.0370701661748;104.98873056350064;67.06680727315448
1930;90.03487878752964;105.26340744114077;71.68526466991342
1940;86.7415239596829;103.70339276899082;65.50445623809523
1950;85.18467752906544;110.63856436782069;64.07961568550498
1960;86.74917025105114;110.15959752255701;68.00455864623122
1970;83.50580414412283;115.27010879419932;63.39365877235704
1980;76.996690948638;112.61469883602668;63.81246555892574
1990;81.36988595488148;110.39007229391446;66.34130088732005
2000;93.83121695439151;105.05707167478597;62.77171021302111
2010;89.95398528470007;103.42023005513018;63.30858335075494
2020;93.4168184251522;101.65078745051159;72.84902484199135
2030;93.29828117950767;107.95613646740483;68.35090212018142
2040;95.2666619167369;105.36893536172046;70.01873646258504
