;Phalanx.0;Phalanx.1;Phalanx.2;Phalanx.3;Phalanx.4;Phalanx.5;Phalanx.6;Phalanx.7;Phalanx.8;Phalanx.9;Phalanx.10;Phalanx.11;Phalanx.12;Phalanx.13;Phalanx.14;Phalanx.15;Phalanx.16;Phalanx.17;Phalanx.18;Phalanx.19;Phalanx.20;Phalanx.21;Phalanx.22;Phalanx.23;Phalanx.24;Phalanx.25;Phalanx.26;Phalanx.27;Phalanx.28;Phalanx.29;Phalanx.30;Phalanx.31;Phalanx.32;Phalanx.33;Phalanx.34;Phalanx.35;Phalanx.36;Phalanx.37
50;93.75;93.75;77.77777777777779;96.15384615384616;86.36363636363636;94.11764705882352;98.29059829059828;98.82352941176471;95.45454545454545;97.6;97.2972972972973;97.77777777777777;98.23008849557522;96.72131147540983;96.55172413793103;99.0;95.83333333333334;95.8904109589041;95.45454545454545;100.0;100.0;100.0;100.0;100.0;100.0;100.0;100.0;100.0;100.0;100.0;100.0;100.0;100.0;100.0;100.0;100.0;100.0;100.0
45;93.75;93.75;77.77777777777779;96.15384615384616;86.36363636363636;94.11764705882352;98.29059829059828;97.6470588235294;94.54545454545455;97.6;94.5945945945946;95.55555555555556;97.34513274336283;95.08196721311475;96.55172413793103;97.0;93.75;95.8904109589041;95.45454545454545;100.0;100.0;100.0;100.0;100.0;100.0;100.0;100.0;100.0;100.0;100.0;100.0;100.0;100.0;100.0;100.0;100.0;100.0;100.0
40;93.75;93.75;77.77777777777779;96.15384615384616;86.36363636363636;94.11764705882352;98.29059829059828;97.6470588235294;94.54545454545455;96.0;91.8918918918919;94.44444444444444;96.46017699115043;93.44262295081968;94.25287356321839;96.0;91.66666666666666;93.15068493150685;95.45454545454545;100.0;100.0;100.0;100.0;100.0;100.0;100.0;100.0;100.0;100.0;100.0;100.0;100.0;100.0;100.0;100.0;100.0;100.0;100.0
35;93.75;93.75;77.77777777777779;96.15384615384616;86.36363636363636;94.11764705882352;98.29059829059828;96.47058823529412;94.54545454545455;94.39999999999999;90.54054054054053;94.44444444444444;95.57522123893806;90.1639344262295;93.10344827586206;95.0;89.58333333333334;93.15068493150685;94.31818181818183;100.0;100.0;100.0;100.0;100.0;100.0;100.0;100.0;100.0;100.0;100.0;100.0;100.0;100.0;100.0;100.0;100.0;100.0;100.0
30;93.75;93.75;77.77777777777779;96.15384615384616;81.81818181818183;92.15686274509804;97.43589743589743;92.94117647058823;94.54545454545455;94.39999999999999;89.1891891891892;93.33333333333333;95.57522123893806;90.1639344262295;90.80459770114942;95.0;89.58333333333334;93.15068493150685;94.31818181818183;100.0;100.0;100.0;100.0;100.0;100.0;100.0;100.0;100.0;100.0;100.0;100.0;100.0;100.0;100.0;100.0;100.0;100.0;100.0
25;93.75;93.75;77.77777777777779;92.3076923076923;81.81818181818183;90.19607843137256;96.58119658119658;83.52941176470588;91.81818181818183;90.4;86.48648648648648;90.0;92.92035398230088;90.1639344262295;89.65517241379311;91.0;85.41666666666666;91.78082191780823;90.9090909090909;100.0;100.0;100.0;100.0;100.0;100.0;100.0;100.0;100.0;100.0;100.0;100.0;100.0;100.0;100.0;100.0;100.0;100.0;100.0
20;93.75;93.75;77.77777777777779;88.46153846153845;81.81818181818183;88.23529411764706;96.58119658119658;81.17647058823529;88.18181818181819;88.8;81.08108108108108;88.88888888888889;92.03539823008849;88.52459016393442;87.35632183908046;88.0;81.25;87.67123287671232;90.9090909090909;100.0;100.0;100.0;100.0;100.0;100.0;100.0;100.0;100.0;100.0;100.0;100.0;100.0;100.0;100.0;100.0;100.0;100.0;100.0
15;93.75;93.75;77.77777777777779;88.46153846153845;81.81818181818183;88.23529411764706;95.72649572649573;77.64705882352942;84.54545454545455;86.4;77.02702702702703;82.22222222222221;86.72566371681415;83.60655737704919;82.75862068965517;83.0;79.16666666666666;83.56164383561644;85.22727272727273;100.0;100.0;100.0;100.0;100.0;100.0;100.0;100.0;100.0;100.0;100.0;100.0;80.0;100.0;100.0;100.0;100.0;100.0;100.0
10;93.75;93.75;66.66666666666666;84.61538461538461;72.72727272727273;78.43137254901961;92.3076923076923;74.11764705882354;80.9090909090909;76.8;72.97297297297297;75.55555555555556;80.53097345132744;78.68852459016394;79.3103448275862;75.0;72.91666666666666;79.45205479452055;77.27272727272727;100.0;100.0;100.0;100.0;100.0;50.0;50.0;100.0;100.0;100.0;100.0;100.0;80.0;100.0;100.0;100.0;100.0;100.0;75.0
5;87.5;93.75;66.66666666666666;76.92307692307693;72.72727272727273;74.50980392156863;80.34188034188034;67.05882352941175;74.54545454545455;66.4;66.21621621621621;68.88888888888889;68.14159292035397;73.77049180327869;73.5632183908046;65.0;64.58333333333334;69.86301369863014;67.04545454545455;100.0;100.0;0.0;100.0;100.0;50.0;50.0;75.0;80.0;100.0;100.0;80.0;80.0;100.0;80.0;100.0;75.0;60.0;50.0
