;obj0;obj1;obj2;obj3;obj4;obj5;obj6;Cube;Cylinder
50;2.3267547948717913;2.643150954637967;5.505657564021159;2.330214332167818;1.9142991865079382;2.045461937007471;3.5850187263192934;2.3553988950567524;2.3220864218658117
45;2.0985572626262585;2.5233250319236444;5.031276575757567;2.249921224553209;1.8088091812169271;1.9664505396270757;3.3951202276195813;2.1938307832633175;2.1396770582439233
40;1.7031218515928472;2.258020547334175;4.693060622655111;2.093449091538071;1.7922535816993521;1.860357350815875;3.228761648024572;1.9286607137188305;2.086554727718706
35;1.6242673333333237;1.9696673541339822;3.6489947972582866;2.0479239695859515;1.5245031830065368;1.7566901231546477;3.063514968166736;1.4527999955163888;1.965270672909906
30;1.4891367777777669;1.9696126019066682;2.83679456038405;1.8920048519813335;1.3633246335200795;1.7219788780108984;2.795680497161529;1.272570356782111;1.7284938166046537
25;1.5634579894179812;1.4850155203343907;2.4576318146520006;1.7687899483294403;1.291138833333331;1.223735708131175;2.481611056740833;1.1836444616187378;1.58820362375247
20;1.3976911111110915;1.2397380860806124;1.819944485347971;1.5322860050504985;1.056467501831507;1.1383993361126352;2.2594362925169578;0.9148428922387006;1.5587369038668197
15;1.2001188888888854;1.3861067592592933;1.6691865382025375;1.3925477053871813;1.1591049650349599;1.1381874910987066;2.3156937538651508;0.9360662818372046;1.4559463412549047
10;1.3724949999999905;1.1635590000000247;1.2811724829932136;1.3111121190475918;1.608203805555545;1.205784166666724;2.751179365079337;0.64497736444232;1.0179772907647762
5;0.9915314814815083;0.6867155555556129;0.7532220959595827;0.7503009438775239;1.0279142777777412;1.020033703703783;3.4690696428571535;0.40194905806186493;0.7442186011904882
