;Touch;Raise;Pull;Push;Push Down
50;92.430966469428;76.4594715983605;86.05568331421944;85.74127941775;85.25900025900026
45;91.95019723865877;71.88439132883578;83.94326367491807;84.41879743350331;84.48027281360613
40;90.2743730628346;70.71273890718335;79.01106310180069;81.91998451802374;82.89159400270512
35;86.78941251056636;66.52692472136917;76.67632841562289;76.78436759319112;78.54211631989409
30;83.40007748661596;61.532757366090706;69.13594719574724;73.47351903724451;73.85098440653996
25;79.77141448295295;57.13903380570047;68.73424850457485;65.80094167512469;71.91205913428135
20;75.82223865877712;47.282198254420464;64.59642984402464;58.557238875866325;64.97496330829665
15;64.54775993237533;38.384357412135195;54.05148538047991;50.221490262339934;51.507412340745674
10;50.344639335023956;31.285417257639484;44.00849522524678;33.55220487573428;36.01153990042879
5;33.328050154973226;26.25530333863667;31.370144070577954;22.76466271564311;24.830385663718996
