;small;medium;large
50;97.66122766122767;95.29529446251597;99.44444444444444
45;97.2405226352595;94.44599171847638;99.12698412698414
40;96.63446202919886;92.47713855517875;98.57142857142858
35;95.30239132212819;91.76461650932339;98.38624338624338
30;93.70252023362072;90.1051401831804;98.13932980599647
25;93.18678596788645;87.08351398611559;97.89241622574954
20;90.43734790594839;84.9337637726399;96.78130511463844
15;87.33509031505443;80.81317480276056;96.22134038800706
10;80.00394923391335;72.19134043543701;90.95743145743145
5;64.64965075461488;58.68617551816894;80.76484626484626
