;small;medium;large
50;1.9176777544671253;2.709562078129464;3.1692568314518876
45;1.6859539995799653;2.490839846200439;3.080489039368044
40;1.4609431589414361;2.4213037431068036;2.92437366691566
35;1.268448843984295;2.138131608914348;2.562663248581273
30;1.1402802118146984;1.8337232367401506;2.384228602084435
25;0.9766523763622691;1.6582209983319536;2.1897353125974446
20;0.9411299153108821;1.268038276580132;1.862193080746448
15;1.017828923021444;1.1546591785422666;1.8123414821973858
10;1.0421586630036839;1.043704957037902;1.7478133054696425
5;0.8252482878151581;0.972804125471326;0.9540419517543741
