
Time;Config;OOI;x;y;z;OrX;OrY;OrZ;OOI;x;y;z;OrX;OrY;OrZ;OOI;x;y;z;OrX;OrY;OrZ;OOI;x;y;z;OrX;OrY;OrZ;NbBloc;GraspContact;NbTouchReal
58.34167;2;0;-0.5290;-0.0600;0.3410;0.0000;0.0000;0.0000;1;-0.1216;-0.0858;0.3488;0.0000;0.0000;0.0000;2;-0.2500;-0.4000;0.3350;0.0000;0.0000;0.0000;3;-0.1216;-0.0858;0.3488;0.0000;0.0000;0.0000;0;False;1
59.18438;2;0;-0.5290;-0.0600;0.3410;0.0000;0.0000;0.0000;1;-0.1216;-0.0858;0.3488;0.0000;0.0000;0.0000;2;-0.2500;-0.4000;0.3350;0.0000;0.0000;0.0000;3;-0.1216;-0.0858;0.3488;0.0000;0.0000;0.0000;0;False;2
59.39941;2;0;-0.5290;-0.0600;0.3410;0.0000;0.0000;0.0000;1;-0.1216;-0.0858;0.3488;0.0000;0.0000;0.0000;2;-0.2500;-0.4000;0.3350;0.0000;0.0000;0.0000;3;-0.1216;-0.0858;0.3488;0.0000;0.0000;0.0000;0;False;1
59.56705;2;0;-0.5290;-0.0600;0.3410;0.0000;0.0000;0.0000;1;-0.1216;-0.0858;0.3488;0.0000;0.0000;0.0000;2;-0.2500;-0.4000;0.3350;0.0000;0.0000;0.0000;3;-0.1216;-0.0858;0.3488;0.0000;0.0000;0.0000;0;False;1
59.70708;2;0;-0.5290;-0.0600;0.3410;0.0000;0.0000;0.0000;1;-0.1216;-0.0858;0.3488;0.0000;0.0000;0.0000;2;-0.2500;-0.4000;0.3350;0.0000;0.0000;0.0000;3;-0.1216;-0.0858;0.3488;0.0000;0.0000;0.0000;0;False;1
59.83928;2;0;-0.5290;-0.0600;0.3410;0.0000;0.0000;0.0000;1;-0.1216;-0.0858;0.3488;0.0000;0.0000;0.0000;2;-0.2500;-0.4000;0.3350;0.0000;0.0000;0.0000;3;-0.1216;-0.0858;0.3488;0.0000;0.0000;0.0000;0;False;1
59.97198;2;0;-0.5290;-0.0600;0.3410;0.0000;0.0000;0.0000;1;-0.1216;-0.0858;0.3488;0.0000;0.0000;0.0000;2;-0.2500;-0.4000;0.3350;0.0000;0.0000;0.0000;3;-0.1216;-0.0858;0.3488;0.0000;0.0000;0.0000;0;False;1
60.10624;2;0;-0.5290;-0.0600;0.3410;0.0000;0.0000;0.0000;1;-0.1216;-0.0858;0.3488;0.0000;0.0000;0.0000;2;-0.2500;-0.4000;0.3350;0.0000;0.0000;0.0000;3;-0.1216;-0.0858;0.3488;0.0000;0.0000;0.0000;0;False;1
60.23741;2;0;-0.5290;-0.0600;0.3410;0.0000;0.0000;0.0000;1;-0.1216;-0.0858;0.3488;0.0000;0.0000;0.0000;2;-0.2500;-0.4000;0.3350;0.0000;0.0000;0.0000;3;-0.1216;-0.0858;0.3488;0.0000;0.0000;0.0000;0;False;1
60.36735;2;0;-0.5290;-0.0600;0.3410;0.0000;0.0000;0.0000;1;-0.1216;-0.0858;0.3488;0.0000;0.0000;0.0000;2;-0.2500;-0.4000;0.3350;0.0000;0.0000;0.0000;3;-0.1216;-0.0858;0.3488;0.0000;0.0000;0.0000;0;False;1
60.49584;2;0;-0.5290;-0.0600;0.3410;0.0000;0.0000;0.0000;1;-0.1216;-0.0858;0.3488;0.0000;0.0000;0.0000;2;-0.2500;-0.4000;0.3350;0.0000;0.0000;0.0000;3;-0.1216;-0.0858;0.3488;0.0000;0.0000;0.0000;0;False;1
60.63044;2;0;-0.5290;-0.0600;0.3410;0.0000;0.0000;0.0000;1;-0.1216;-0.0858;0.3488;0.0000;0.0000;0.0000;2;-0.2500;-0.4000;0.3350;0.0000;0.0000;0.0000;3;-0.1216;-0.0858;0.3488;0.0000;0.0000;0.0000;0;False;1
60.8393;2;0;-0.5290;-0.0600;0.3410;0.0000;0.0000;0.0000;1;-0.1216;-0.0858;0.3488;0.0000;0.0000;0.0000;2;-0.2500;-0.4000;0.3350;0.0000;0.0000;0.0000;3;-0.1216;-0.0858;0.3488;0.0000;0.0000;0.0000;0;False;1
61.0416;2;0;-0.5290;-0.0600;0.3410;0.0000;0.0000;0.0000;1;-0.1216;-0.0858;0.3488;0.0000;0.0000;0.0000;2;-0.2500;-0.4000;0.3350;0.0000;0.0000;0.0000;3;-0.1216;-0.0858;0.3488;0.0000;0.0000;0.0000;0;False;1
61.2565;2;0;-0.5290;-0.0600;0.3410;0.0000;0.0000;0.0000;1;-0.1216;-0.0858;0.3488;0.0000;0.0000;0.0000;2;-0.2500;-0.4000;0.3350;0.0000;0.0000;0.0000;3;-0.1216;-0.0858;0.3488;0.0000;0.0000;0.0000;0;False;1
61.49814;2;0;-0.5290;-0.0600;0.3410;0.0000;0.0000;0.0000;1;-0.1216;-0.0858;0.3488;0.0000;0.0000;0.0000;2;-0.2500;-0.4000;0.3350;0.0000;0.0000;0.0000;3;-0.1216;-0.0858;0.3488;0.0000;0.0000;0.0000;0;False;1
61.77314;2;0;-0.5290;-0.0600;0.3410;0.0000;0.0000;0.0000;1;-0.1216;-0.0858;0.3488;0.0000;0.0000;0.0000;2;-0.2500;-0.4000;0.3350;0.0000;0.0000;0.0000;3;-0.1216;-0.0858;0.3488;0.0000;0.0000;0.0000;0;False;1
62.05105;2;0;-0.5290;-0.0600;0.3410;0.0000;0.0000;0.0000;1;-0.1216;-0.0858;0.3488;0.0000;0.0000;0.0000;2;-0.2500;-0.4000;0.3350;0.0000;0.0000;0.0000;3;-0.1216;-0.0858;0.3488;0.0000;0.0000;0.0000;0;False;1
62.34434;2;0;-0.5290;-0.0600;0.3410;0.0000;0.0000;0.0000;1;-0.1216;-0.0858;0.3488;0.0000;0.0000;0.0000;2;-0.2500;-0.4000;0.3350;0.0000;0.0000;0.0000;3;-0.1216;-0.0858;0.3488;0.0000;0.0000;0.0000;0;False;1
62.65524;2;0;-0.5290;-0.0600;0.3410;0.0000;0.0000;0.0000;1;-0.1216;-0.0858;0.3488;0.0000;0.0000;0.0000;2;-0.2500;-0.4000;0.3350;0.0000;0.0000;0.0000;3;-0.1216;-0.0858;0.3488;0.0000;0.0000;0.0000;0;False;1
62.9497;2;0;-0.5290;-0.0600;0.3410;0.0000;0.0000;0.0000;1;-0.1216;-0.0858;0.3488;0.0000;0.0000;0.0000;2;-0.2500;-0.4000;0.3350;0.0000;0.0000;0.0000;3;-0.1216;-0.0858;0.3488;0.0000;0.0000;0.0000;0;False;1
63.22588;2;0;-0.5290;-0.0600;0.3410;0.0000;0.0000;0.0000;1;-0.1216;-0.0858;0.3488;0.0000;0.0000;0.0000;2;-0.2500;-0.4000;0.3350;0.0000;0.0000;0.0000;3;-0.1216;-0.0858;0.3488;0.0000;0.0000;0.0000;0;False;1
63.48637;2;0;-0.5290;-0.0600;0.3410;0.0000;0.0000;0.0000;1;-0.1216;-0.0858;0.3488;0.0000;0.0000;0.0000;2;-0.2500;-0.4000;0.3350;0.0000;0.0000;0.0000;3;-0.1216;-0.0858;0.3488;0.0000;0.0000;0.0000;0;False;1
63.7379;2;0;-0.5290;-0.0600;0.3410;0.0000;0.0000;0.0000;1;-0.1216;-0.0858;0.3488;0.0000;0.0000;0.0000;2;-0.2500;-0.4000;0.3350;0.0000;0.0000;0.0000;3;-0.1216;-0.0858;0.3488;0.0000;0.0000;0.0000;0;False;1
63.9763;2;0;-0.5290;-0.0600;0.3410;0.0000;0.0000;0.0000;1;-0.1216;-0.0858;0.3488;0.0000;0.0000;0.0000;2;-0.2500;-0.4000;0.3350;0.0000;0.0000;0.0000;3;-0.1216;-0.0858;0.3488;0.0000;0.0000;0.0000;0;False;1
64.21261;2;0;-0.5290;-0.0600;0.3410;0.0000;0.0000;0.0000;1;-0.1216;-0.0858;0.3488;0.0000;0.0000;0.0000;2;-0.2500;-0.4000;0.3350;0.0000;0.0000;0.0000;3;-0.1216;-0.0858;0.3488;0.0000;0.0000;0.0000;0;False;1
64.43919;2;0;-0.5290;-0.0600;0.3410;0.0000;0.0000;0.0000;1;-0.1216;-0.0858;0.3488;0.0000;0.0000;0.0000;2;-0.2500;-0.4000;0.3350;0.0000;0.0000;0.0000;3;-0.1216;-0.0858;0.3488;0.0000;0.0000;0.0000;0;False;1
64.66919;2;0;-0.5290;-0.0600;0.3410;0.0000;0.0000;0.0000;1;-0.1216;-0.0858;0.3488;0.0000;0.0000;0.0000;2;-0.2500;-0.4000;0.3350;0.0000;0.0000;0.0000;3;-0.1216;-0.0858;0.3488;0.0000;0.0000;0.0000;0;False;1
64.89991;2;0;-0.5290;-0.0600;0.3410;0.0000;0.0000;0.0000;1;-0.1216;-0.0858;0.3488;0.0000;0.0000;0.0000;2;-0.2500;-0.4000;0.3350;0.0000;0.0000;0.0000;3;-0.1216;-0.0858;0.3488;0.0000;0.0000;0.0000;0;False;1
65.13072;2;0;-0.5290;-0.0600;0.3410;0.0000;0.0000;0.0000;1;-0.1216;-0.0858;0.3488;0.0000;0.0000;0.0000;2;-0.2500;-0.4000;0.3350;0.0000;0.0000;0.0000;3;-0.1216;-0.0858;0.3488;0.0000;0.0000;0.0000;0;False;1
65.35856;2;0;-0.5290;-0.0600;0.3410;0.0000;0.0000;0.0000;1;-0.1216;-0.0858;0.3488;0.0000;0.0000;0.0000;2;-0.2500;-0.4000;0.3350;0.0000;0.0000;0.0000;3;-0.1216;-0.0858;0.3488;0.0000;0.0000;0.0000;0;False;1
65.58398;2;0;-0.5290;-0.0600;0.3410;0.0000;0.0000;0.0000;1;-0.1216;-0.0858;0.3488;0.0000;0.0000;0.0000;2;-0.2500;-0.4000;0.3350;0.0000;0.0000;0.0000;3;-0.1216;-0.0858;0.3488;0.0000;0.0000;0.0000;0;False;1
65.8075;2;0;-0.5290;-0.0600;0.3410;0.0000;0.0000;0.0000;1;-0.1216;-0.0858;0.3488;0.0000;0.0000;0.0000;2;-0.2500;-0.4000;0.3350;0.0000;0.0000;0.0000;3;-0.1216;-0.0858;0.3488;0.0000;0.0000;0.0000;0;False;1
66.03469;2;0;-0.5290;-0.0600;0.3410;0.0000;0.0000;0.0000;1;-0.1216;-0.0858;0.3488;0.0000;0.0000;0.0000;2;-0.2500;-0.4000;0.3350;0.0000;0.0000;0.0000;3;-0.1216;-0.0858;0.3488;0.0000;0.0000;0.0000;0;False;1
66.26041;2;0;-0.5290;-0.0600;0.3410;0.0000;0.0000;0.0000;1;-0.1216;-0.0858;0.3488;0.0000;0.0000;0.0000;2;-0.2500;-0.4000;0.3350;0.0000;0.0000;0.0000;3;-0.1216;-0.0858;0.3488;0.0000;0.0000;0.0000;0;False;1
66.48522;2;0;-0.5290;-0.0600;0.3410;0.0000;0.0000;0.0000;1;-0.1216;-0.0858;0.3488;0.0000;0.0000;0.0000;2;-0.2500;-0.4000;0.3350;0.0000;0.0000;0.0000;3;-0.1216;-0.0858;0.3488;0.0000;0.0000;0.0000;0;False;1
66.7026;2;0;-0.5290;-0.0600;0.3410;0.0000;0.0000;0.0000;1;-0.1216;-0.0858;0.3488;0.0000;0.0000;0.0000;2;-0.2500;-0.4000;0.3350;0.0000;0.0000;0.0000;3;-0.1216;-0.0858;0.3488;0.0000;0.0000;0.0000;0;False;1
66.92304;2;0;-0.5290;-0.0600;0.3410;0.0000;0.0000;0.0000;1;-0.1216;-0.0858;0.3488;0.0000;0.0000;0.0000;2;-0.2500;-0.4000;0.3350;0.0000;0.0000;0.0000;3;-0.1216;-0.0858;0.3488;0.0000;0.0000;0.0000;0;False;1
67.1473;2;0;-0.5290;-0.0600;0.3410;0.0000;0.0000;0.0000;1;-0.1216;-0.0858;0.3488;0.0000;0.0000;0.0000;2;-0.2500;-0.4000;0.3350;0.0000;0.0000;0.0000;3;-0.1216;-0.0858;0.3488;0.0000;0.0000;0.0000;0;False;1
67.37142;2;0;-0.5290;-0.0600;0.3410;0.0000;0.0000;0.0000;1;-0.1216;-0.0858;0.3488;0.0000;0.0000;0.0000;2;-0.2500;-0.4000;0.3350;0.0000;0.0000;0.0000;3;-0.1216;-0.0858;0.3488;0.0000;0.0000;0.0000;0;False;1
67.59408;2;0;-0.5290;-0.0600;0.3410;0.0000;0.0000;0.0000;1;-0.1216;-0.0858;0.3488;0.0000;0.0000;0.0000;2;-0.2500;-0.4000;0.3350;0.0000;0.0000;0.0000;3;-0.1216;-0.0858;0.3488;0.0000;0.0000;0.0000;0;False;1
67.81618;2;0;-0.5290;-0.0600;0.3410;0.0000;0.0000;0.0000;1;-0.1216;-0.0858;0.3488;0.0000;0.0000;0.0000;2;-0.2500;-0.4000;0.3350;0.0000;0.0000;0.0000;3;-0.1216;-0.0858;0.3488;0.0000;0.0000;0.0000;0;False;1
68.03278;2;0;-0.5290;-0.0600;0.3410;0.0000;0.0000;0.0000;1;-0.1216;-0.0858;0.3488;0.0000;0.0000;0.0000;2;-0.2500;-0.4000;0.3350;0.0000;0.0000;0.0000;3;-0.1216;-0.0858;0.3488;0.0000;0.0000;0.0000;0;False;1
68.25159;2;0;-0.5290;-0.0600;0.3410;0.0000;0.0000;0.0000;1;-0.1216;-0.0858;0.3488;0.0000;0.0000;0.0000;2;-0.2500;-0.4000;0.3350;0.0000;0.0000;0.0000;3;-0.1216;-0.0858;0.3488;0.0000;0.0000;0.0000;0;False;1
68.4733;2;0;-0.5290;-0.0600;0.3410;0.0000;0.0000;0.0000;1;-0.1216;-0.0858;0.3488;0.0000;0.0000;0.0000;2;-0.2500;-0.4000;0.3350;0.0000;0.0000;0.0000;3;-0.1216;-0.0858;0.3488;0.0000;0.0000;0.0000;0;False;1
68.69143;2;0;-0.5290;-0.0600;0.3410;0.0000;0.0000;0.0000;1;-0.1216;-0.0858;0.3488;0.0000;0.0000;0.0000;2;-0.2500;-0.4000;0.3350;0.0000;0.0000;0.0000;3;-0.1216;-0.0858;0.3488;0.0000;0.0000;0.0000;0;False;1
68.91088;2;0;-0.5290;-0.0600;0.3410;0.0000;0.0000;0.0000;1;-0.1216;-0.0858;0.3488;0.0000;0.0000;0.0000;2;-0.2500;-0.4000;0.3350;0.0000;0.0000;0.0000;3;-0.1216;-0.0858;0.3488;0.0000;0.0000;0.0000;0;False;1
69.13017;2;0;-0.5290;-0.0600;0.3410;0.0000;0.0000;0.0000;1;-0.1216;-0.0858;0.3488;0.0000;0.0000;0.0000;2;-0.2500;-0.4000;0.3350;0.0000;0.0000;0.0000;3;-0.1216;-0.0858;0.3488;0.0000;0.0000;0.0000;0;False;1
69.35206;2;0;-0.5290;-0.0600;0.3410;0.0000;0.0000;0.0000;1;-0.1216;-0.0858;0.3488;0.0000;0.0000;0.0000;2;-0.2500;-0.4000;0.3350;0.0000;0.0000;0.0000;3;-0.1216;-0.0858;0.3488;0.0000;0.0000;0.0000;0;False;1
69.57168;2;0;-0.5290;-0.0600;0.3410;0.0000;0.0000;0.0000;1;-0.1216;-0.0858;0.3488;0.0000;0.0000;0.0000;2;-0.2500;-0.4000;0.3350;0.0000;0.0000;0.0000;3;-0.1216;-0.0858;0.3488;0.0000;0.0000;0.0000;0;False;1
69.80087;2;0;-0.5290;-0.0600;0.3410;0.0000;0.0000;0.0000;1;-0.1216;-0.0858;0.3488;0.0000;0.0000;0.0000;2;-0.2500;-0.4000;0.3350;0.0000;0.0000;0.0000;3;-0.1216;-0.0858;0.3488;0.0000;0.0000;0.0000;0;False;1
70.0411;2;0;-0.5290;-0.0600;0.3410;0.0000;0.0000;0.0000;1;-0.1216;-0.0858;0.3488;0.0000;0.0000;0.0000;2;-0.2500;-0.4000;0.3350;0.0000;0.0000;0.0000;3;-0.1216;-0.0858;0.3488;0.0000;0.0000;0.0000;0;False;1
70.28676;2;0;-0.5290;-0.0600;0.3410;0.0000;0.0000;0.0000;1;-0.1216;-0.0858;0.3488;0.0000;0.0000;0.0000;2;-0.2500;-0.4000;0.3350;0.0000;0.0000;0.0000;3;-0.1216;-0.0858;0.3488;0.0000;0.0000;0.0000;0;False;1
70.53242;2;0;-0.5290;-0.0600;0.3410;0.0000;0.0000;0.0000;1;-0.1216;-0.0858;0.3488;0.0000;0.0000;0.0000;2;-0.2500;-0.4000;0.3350;0.0000;0.0000;0.0000;3;-0.1216;-0.0858;0.3488;0.0000;0.0000;0.0000;0;False;1
70.77825;2;0;-0.5290;-0.0600;0.3410;0.0000;0.0000;0.0000;1;-0.1216;-0.0858;0.3488;0.0000;0.0000;0.0000;2;-0.2500;-0.4000;0.3350;0.0000;0.0000;0.0000;3;-0.1216;-0.0858;0.3488;0.0000;0.0000;0.0000;0;False;1
71.02999;2;0;-0.5290;-0.0600;0.3410;0.0000;0.0000;0.0000;1;-0.1216;-0.0858;0.3488;0.0000;0.0000;0.0000;2;-0.2500;-0.4000;0.3350;0.0000;0.0000;0.0000;3;-0.1216;-0.0858;0.3488;0.0000;0.0000;0.0000;0;False;1
71.28403;2;0;-0.5290;-0.0600;0.3410;0.0000;0.0000;0.0000;1;-0.1216;-0.0858;0.3488;0.0000;0.0000;0.0000;2;-0.2500;-0.4000;0.3350;0.0000;0.0000;0.0000;3;-0.1216;-0.0858;0.3488;0.0000;0.0000;0.0000;0;False;1
71.54027;2;0;-0.5290;-0.0600;0.3410;0.0000;0.0000;0.0000;1;-0.1216;-0.0858;0.3488;0.0000;0.0000;0.0000;2;-0.2500;-0.4000;0.3350;0.0000;0.0000;0.0000;3;-0.1216;-0.0858;0.3488;0.0000;0.0000;0.0000;0;False;1
71.80327;2;0;-0.5290;-0.0600;0.3410;0.0000;0.0000;0.0000;1;-0.1216;-0.0858;0.3488;0.0000;0.0000;0.0000;2;-0.2500;-0.4000;0.3350;0.0000;0.0000;0.0000;3;-0.1216;-0.0858;0.3488;0.0000;0.0000;0.0000;0;False;1
72.06362;2;0;-0.5290;-0.0600;0.3410;0.0000;0.0000;0.0000;1;-0.1216;-0.0858;0.3488;0.0000;0.0000;0.0000;2;-0.2500;-0.4000;0.3350;0.0000;0.0000;0.0000;3;-0.1216;-0.0858;0.3488;0.0000;0.0000;0.0000;0;False;1
72.33418;2;0;-0.5290;-0.0600;0.3410;0.0000;0.0000;0.0000;1;-0.1216;-0.0858;0.3488;0.0000;0.0000;0.0000;2;-0.2500;-0.4000;0.3350;0.0000;0.0000;0.0000;3;-0.1216;-0.0858;0.3488;0.0000;0.0000;0.0000;0;False;1
72.61736;2;0;-0.5290;-0.0600;0.3410;0.0000;0.0000;0.0000;1;-0.1216;-0.0858;0.3488;0.0000;0.0000;0.0000;2;-0.2500;-0.4000;0.3350;0.0000;0.0000;0.0000;3;-0.1216;-0.0858;0.3488;0.0000;0.0000;0.0000;0;False;1
72.90001;2;0;-0.5290;-0.0600;0.3410;0.0000;0.0000;0.0000;1;-0.1216;-0.0858;0.3488;0.0000;0.0000;0.0000;2;-0.2500;-0.4000;0.3350;0.0000;0.0000;0.0000;3;-0.1216;-0.0858;0.3488;0.0000;0.0000;0.0000;0;False;1
73.18108;2;0;-0.5290;-0.0600;0.3410;0.0000;0.0000;0.0000;1;-0.1216;-0.0858;0.3488;0.0000;0.0000;0.0000;2;-0.2500;-0.4000;0.3350;0.0000;0.0000;0.0000;3;-0.1216;-0.0858;0.3488;0.0000;0.0000;0.0000;0;False;1
73.46931;2;0;-0.5290;-0.0600;0.3410;0.0000;0.0000;0.0000;1;-0.1216;-0.0858;0.3488;0.0000;0.0000;0.0000;2;-0.2500;-0.4000;0.3350;0.0000;0.0000;0.0000;3;-0.1216;-0.0858;0.3488;0.0000;0.0000;0.0000;0;False;1
73.76247;2;0;-0.5290;-0.0600;0.3410;0.0000;0.0000;0.0000;1;-0.1216;-0.0858;0.3488;0.0000;0.0000;0.0000;2;-0.2500;-0.4000;0.3350;0.0000;0.0000;0.0000;3;-0.1216;-0.0858;0.3488;0.0000;0.0000;0.0000;0;False;1
74.04773;2;0;-0.5290;-0.0600;0.3410;0.0000;0.0000;0.0000;1;-0.1216;-0.0858;0.3488;0.0000;0.0000;0.0000;2;-0.2500;-0.4000;0.3350;0.0000;0.0000;0.0000;3;-0.1216;-0.0858;0.3488;0.0000;0.0000;0.0000;0;False;1
74.29408;2;0;-0.5290;-0.0600;0.3410;0.0000;0.0000;0.0000;1;-0.1216;-0.0858;0.3488;0.0000;0.0000;0.0000;2;-0.2500;-0.4000;0.3350;0.0000;0.0000;0.0000;3;-0.1216;-0.0858;0.3488;0.0000;0.0000;0.0000;0;False;1
74.53462;2;0;-0.5290;-0.0600;0.3410;0.0000;0.0000;0.0000;1;-0.1216;-0.0858;0.3488;0.0000;0.0000;0.0000;2;-0.2500;-0.4000;0.3350;0.0000;0.0000;0.0000;3;-0.1216;-0.0858;0.3488;0.0000;0.0000;0.0000;0;False;1
74.79774;2;0;-0.5290;-0.0600;0.3410;0.0000;0.0000;0.0000;1;-0.1216;-0.0858;0.3488;0.0000;0.0000;0.0000;2;-0.2500;-0.4000;0.3350;0.0000;0.0000;0.0000;3;-0.1216;-0.0858;0.3488;0.0000;0.0000;0.0000;0;False;1
75.1136;2;0;-0.5290;-0.0600;0.3410;0.0000;0.0000;0.0000;1;-0.1216;-0.0858;0.3488;0.0000;0.0000;0.0000;2;-0.2500;-0.4000;0.3350;0.0000;0.0000;0.0000;3;-0.1216;-0.0858;0.3488;0.0000;0.0000;0.0000;0;False;1
75.44956;2;0;-0.5290;-0.0600;0.3410;0.0000;0.0000;0.0000;1;-0.1216;-0.0858;0.3488;0.0000;0.0000;0.0000;2;-0.2500;-0.4000;0.3350;0.0000;0.0000;0.0000;3;-0.1216;-0.0858;0.3488;0.0000;0.0000;0.0000;0;False;1
75.76446;2;0;-0.5290;-0.0600;0.3410;0.0000;0.0000;0.0000;1;-0.1216;-0.0858;0.3488;0.0000;0.0000;0.0000;2;-0.2500;-0.4000;0.3350;0.0000;0.0000;0.0000;3;-0.1216;-0.0858;0.3488;0.0000;0.0000;0.0000;0;False;1
76.08972;2;0;-0.5290;-0.0600;0.3410;0.0000;0.0000;0.0000;1;-0.1216;-0.0858;0.3488;0.0000;0.0000;0.0000;2;-0.2500;-0.4000;0.3350;0.0000;0.0000;0.0000;3;-0.1216;-0.0858;0.3488;0.0000;0.0000;0.0000;0;False;1
76.43124;2;0;-0.5290;-0.0600;0.3410;0.0000;0.0000;0.0000;1;-0.1216;-0.0858;0.3488;0.0000;0.0000;0.0000;2;-0.2500;-0.4000;0.3350;0.0000;0.0000;0.0000;3;-0.1216;-0.0858;0.3488;0.0000;0.0000;0.0000;0;False;1
76.77219;2;0;-0.5290;-0.0600;0.3410;0.0000;0.0000;0.0000;1;-0.1216;-0.0858;0.3488;0.0000;0.0000;0.0000;2;-0.2500;-0.4000;0.3350;0.0000;0.0000;0.0000;3;-0.1216;-0.0858;0.3488;0.0000;0.0000;0.0000;0;False;1
77.11395;2;0;-0.5290;-0.0600;0.3410;0.0000;0.0000;0.0000;1;-0.1216;-0.0858;0.3488;0.0000;0.0000;0.0000;2;-0.2500;-0.4000;0.3350;0.0000;0.0000;0.0000;3;-0.1216;-0.0858;0.3488;0.0000;0.0000;0.0000;0;False;1
77.45499;2;0;-0.5290;-0.0600;0.3410;0.0000;0.0000;0.0000;1;-0.1216;-0.0858;0.3488;0.0000;0.0000;0.0000;2;-0.2500;-0.4000;0.3350;0.0000;0.0000;0.0000;3;-0.1216;-0.0858;0.3488;0.0000;0.0000;0.0000;0;False;1
77.79206;2;0;-0.5290;-0.0600;0.3410;0.0000;0.0000;0.0000;1;-0.1216;-0.0858;0.3488;0.0000;0.0000;0.0000;2;-0.2500;-0.4000;0.3350;0.0000;0.0000;0.0000;3;-0.1216;-0.0858;0.3488;0.0000;0.0000;0.0000;0;False;1
78.12947;2;0;-0.5290;-0.0600;0.3410;0.0000;0.0000;0.0000;1;-0.1216;-0.0858;0.3488;0.0000;0.0000;0.0000;2;-0.2500;-0.4000;0.3350;0.0000;0.0000;0.0000;3;-0.1216;-0.0858;0.3488;0.0000;0.0000;0.0000;0;False;1
78.46626;2;0;-0.5290;-0.0600;0.3410;0.0000;0.0000;0.0000;1;-0.1216;-0.0858;0.3488;0.0000;0.0000;0.0000;2;-0.2500;-0.4000;0.3350;0.0000;0.0000;0.0000;3;-0.1216;-0.0858;0.3488;0.0000;0.0000;0.0000;0;False;1
78.78893;2;0;-0.5290;-0.0600;0.3410;0.0000;0.0000;0.0000;1;-0.1216;-0.0858;0.3488;0.0000;0.0000;0.0000;2;-0.2500;-0.4000;0.3350;0.0000;0.0000;0.0000;3;-0.1216;-0.0858;0.3488;0.0000;0.0000;0.0000;0;False;1
79.06974;2;0;-0.5290;-0.0600;0.3410;0.0000;0.0000;0.0000;1;-0.1216;-0.0858;0.3488;0.0000;0.0000;0.0000;2;-0.2500;-0.4000;0.3350;0.0000;0.0000;0.0000;3;-0.1216;-0.0858;0.3488;0.0000;0.0000;0.0000;0;False;1
79.34469;2;0;-0.5290;-0.0600;0.3410;0.0000;0.0000;0.0000;1;-0.1216;-0.0858;0.3488;0.0000;0.0000;0.0000;2;-0.2500;-0.4000;0.3350;0.0000;0.0000;0.0000;3;-0.1216;-0.0858;0.3488;0.0000;0.0000;0.0000;0;False;1
79.59936;2;0;-0.5290;-0.0600;0.3410;0.0000;0.0000;0.0000;1;-0.1216;-0.0858;0.3488;0.0000;0.0000;0.0000;2;-0.2500;-0.4000;0.3350;0.0000;0.0000;0.0000;3;-0.1216;-0.0858;0.3488;0.0000;0.0000;0.0000;0;False;1
79.85905;2;0;-0.5290;-0.0600;0.3410;0.0000;0.0000;0.0000;1;-0.1216;-0.0858;0.3488;0.0000;0.0000;0.0000;2;-0.2500;-0.4000;0.3350;0.0000;0.0000;0.0000;3;-0.1216;-0.0858;0.3488;0.0000;0.0000;0.0000;0;False;1
80.10677;2;0;-0.5290;-0.0600;0.3410;0.0000;0.0000;0.0000;1;-0.1216;-0.0858;0.3488;0.0000;0.0000;0.0000;2;-0.2500;-0.4000;0.3350;0.0000;0.0000;0.0000;3;-0.1216;-0.0858;0.3488;0.0000;0.0000;0.0000;0;False;1
80.32997;2;0;-0.5290;-0.0600;0.3410;0.0000;0.0000;0.0000;1;-0.1216;-0.0858;0.3488;0.0000;0.0000;0.0000;2;-0.2500;-0.4000;0.3350;0.0000;0.0000;0.0000;3;-0.1216;-0.0858;0.3488;0.0000;0.0000;0.0000;0;False;1
80.55022;2;0;-0.5290;-0.0600;0.3410;0.0000;0.0000;0.0000;1;-0.1216;-0.0858;0.3488;0.0000;0.0000;0.0000;2;-0.2500;-0.4000;0.3350;0.0000;0.0000;0.0000;3;-0.1216;-0.0858;0.3488;0.0000;0.0000;0.0000;0;False;1
80.77467;2;0;-0.5290;-0.0600;0.3410;0.0000;0.0000;0.0000;1;-0.1216;-0.0858;0.3488;0.0000;0.0000;0.0000;2;-0.2500;-0.4000;0.3350;0.0000;0.0000;0.0000;3;-0.1216;-0.0858;0.3488;0.0000;0.0000;0.0000;0;False;1
81.00179;2;0;-0.5290;-0.0600;0.3410;0.0000;0.0000;0.0000;1;-0.1216;-0.0858;0.3488;0.0000;0.0000;0.0000;2;-0.2500;-0.4000;0.3350;0.0000;0.0000;0.0000;3;-0.1216;-0.0858;0.3488;0.0000;0.0000;0.0000;0;False;1
81.22659;2;0;-0.5290;-0.0600;0.3410;0.0000;0.0000;0.0000;1;-0.1216;-0.0858;0.3488;0.0000;0.0000;0.0000;2;-0.2500;-0.4000;0.3350;0.0000;0.0000;0.0000;3;-0.1216;-0.0858;0.3488;0.0000;0.0000;0.0000;0;False;1
81.45209;2;0;-0.5290;-0.0600;0.3410;0.0000;0.0000;0.0000;1;-0.1216;-0.0858;0.3488;0.0000;0.0000;0.0000;2;-0.2500;-0.4000;0.3350;0.0000;0.0000;0.0000;3;-0.1216;-0.0858;0.3488;0.0000;0.0000;0.0000;0;False;1
81.6777;2;0;-0.5290;-0.0600;0.3410;0.0000;0.0000;0.0000;1;-0.1216;-0.0858;0.3488;0.0000;0.0000;0.0000;2;-0.2500;-0.4000;0.3350;0.0000;0.0000;0.0000;3;-0.1216;-0.0858;0.3488;0.0000;0.0000;0.0000;0;False;1
81.90503;2;0;-0.5290;-0.0600;0.3410;0.0000;0.0000;0.0000;1;-0.1216;-0.0858;0.3488;0.0000;0.0000;0.0000;2;-0.2500;-0.4000;0.3350;0.0000;0.0000;0.0000;3;-0.1216;-0.0858;0.3488;0.0000;0.0000;0.0000;0;False;1
82.13189;2;0;-0.5290;-0.0600;0.3410;0.0000;0.0000;0.0000;1;-0.1216;-0.0858;0.3488;0.0000;0.0000;0.0000;2;-0.2500;-0.4000;0.3350;0.0000;0.0000;0.0000;3;-0.1216;-0.0858;0.3488;0.0000;0.0000;0.0000;0;False;1
82.35857;2;0;-0.5290;-0.0600;0.3410;0.0000;0.0000;0.0000;1;-0.1216;-0.0858;0.3488;0.0000;0.0000;0.0000;2;-0.2500;-0.4000;0.3350;0.0000;0.0000;0.0000;3;-0.1216;-0.0858;0.3488;0.0000;0.0000;0.0000;0;False;1
82.58585;2;0;-0.5290;-0.0600;0.3410;0.0000;0.0000;0.0000;1;-0.1216;-0.0858;0.3488;0.0000;0.0000;0.0000;2;-0.2500;-0.4000;0.3350;0.0000;0.0000;0.0000;3;-0.1216;-0.0858;0.3488;0.0000;0.0000;0.0000;0;False;1
82.81498;2;0;-0.5290;-0.0600;0.3410;0.0000;0.0000;0.0000;1;-0.1216;-0.0858;0.3488;0.0000;0.0000;0.0000;2;-0.2500;-0.4000;0.3350;0.0000;0.0000;0.0000;3;-0.1216;-0.0858;0.3488;0.0000;0.0000;0.0000;0;False;1
83.0442;2;0;-0.5290;-0.0600;0.3410;0.0000;0.0000;0.0000;1;-0.1216;-0.0858;0.3488;0.0000;0.0000;0.0000;2;-0.2500;-0.4000;0.3350;0.0000;0.0000;0.0000;3;-0.1216;-0.0858;0.3488;0.0000;0.0000;0.0000;0;False;1
83.27242;2;0;-0.5290;-0.0600;0.3410;0.0000;0.0000;0.0000;1;-0.1216;-0.0858;0.3488;0.0000;0.0000;0.0000;2;-0.2500;-0.4000;0.3350;0.0000;0.0000;0.0000;3;-0.1216;-0.0858;0.3488;0.0000;0.0000;0.0000;0;False;1
83.50011;2;0;-0.5290;-0.0600;0.3410;0.0000;0.0000;0.0000;1;-0.1216;-0.0858;0.3488;0.0000;0.0000;0.0000;2;-0.2500;-0.4000;0.3350;0.0000;0.0000;0.0000;3;-0.1216;-0.0858;0.3488;0.0000;0.0000;0.0000;0;False;1
83.72915;2;0;-0.5290;-0.0600;0.3410;0.0000;0.0000;0.0000;1;-0.1216;-0.0858;0.3488;0.0000;0.0000;0.0000;2;-0.2500;-0.4000;0.3350;0.0000;0.0000;0.0000;3;-0.1216;-0.0858;0.3488;0.0000;0.0000;0.0000;0;False;1
83.95802;2;0;-0.5290;-0.0600;0.3410;0.0000;0.0000;0.0000;1;-0.1216;-0.0858;0.3488;0.0000;0.0000;0.0000;2;-0.2500;-0.4000;0.3350;0.0000;0.0000;0.0000;3;-0.1216;-0.0858;0.3488;0.0000;0.0000;0.0000;0;False;1
84.18414;2;0;-0.5290;-0.0600;0.3410;0.0000;0.0000;0.0000;1;-0.1216;-0.0858;0.3488;0.0000;0.0000;0.0000;2;-0.2500;-0.4000;0.3350;0.0000;0.0000;0.0000;3;-0.1216;-0.0858;0.3488;0.0000;0.0000;0.0000;0;False;1
84.40852;2;0;-0.5290;-0.0600;0.3410;0.0000;0.0000;0.0000;1;-0.1216;-0.0858;0.3488;0.0000;0.0000;0.0000;2;-0.2500;-0.4000;0.3350;0.0000;0.0000;0.0000;3;-0.1216;-0.0858;0.3488;0.0000;0.0000;0.0000;0;False;1
84.62794;2;0;-0.5290;-0.0600;0.3410;0.0000;0.0000;0.0000;1;-0.1216;-0.0858;0.3488;0.0000;0.0000;0.0000;2;-0.2500;-0.4000;0.3350;0.0000;0.0000;0.0000;3;-0.1216;-0.0858;0.3488;0.0000;0.0000;0.0000;0;False;1
84.90111;2;0;-0.5290;-0.0600;0.3410;0.0000;0.0000;0.0000;1;-0.1216;-0.0858;0.3488;0.0000;0.0000;0.0000;2;-0.2500;-0.4000;0.3350;0.0000;0.0000;0.0000;3;-0.1216;-0.0858;0.3488;0.0000;0.0000;0.0000;0;False;1
85.17243;2;0;-0.5290;-0.0600;0.3410;0.0000;0.0000;0.0000;1;-0.1216;-0.0858;0.3488;0.0000;0.0000;0.0000;2;-0.2500;-0.4000;0.3350;0.0000;0.0000;0.0000;3;-0.1216;-0.0858;0.3488;0.0000;0.0000;0.0000;0;False;1
85.42538;2;0;-0.5290;-0.0600;0.3410;0.0000;0.0000;0.0000;1;-0.1216;-0.0858;0.3488;0.0000;0.0000;0.0000;2;-0.2500;-0.4000;0.3350;0.0000;0.0000;0.0000;3;-0.1216;-0.0858;0.3488;0.0000;0.0000;0.0000;0;False;1
85.66453;2;0;-0.5290;-0.0600;0.3410;0.0000;0.0000;0.0000;1;-0.1216;-0.0858;0.3488;0.0000;0.0000;0.0000;2;-0.2500;-0.4000;0.3350;0.0000;0.0000;0.0000;3;-0.1216;-0.0858;0.3488;0.0000;0.0000;0.0000;0;False;1
85.89472;2;0;-0.5290;-0.0600;0.3410;0.0000;0.0000;0.0000;1;-0.1216;-0.0858;0.3488;0.0000;0.0000;0.0000;2;-0.2500;-0.4000;0.3350;0.0000;0.0000;0.0000;3;-0.1216;-0.0858;0.3488;0.0000;0.0000;0.0000;0;False;1
86.11962;2;0;-0.5290;-0.0600;0.3410;0.0000;0.0000;0.0000;1;-0.1216;-0.0858;0.3488;0.0000;0.0000;0.0000;2;-0.2500;-0.4000;0.3350;0.0000;0.0000;0.0000;3;-0.1216;-0.0858;0.3488;0.0000;0.0000;0.0000;0;False;1
86.34505;2;0;-0.5290;-0.0600;0.3410;0.0000;0.0000;0.0000;1;-0.1216;-0.0858;0.3488;0.0000;0.0000;0.0000;2;-0.2500;-0.4000;0.3350;0.0000;0.0000;0.0000;3;-0.1216;-0.0858;0.3488;0.0000;0.0000;0.0000;0;False;1
86.57014;2;0;-0.5290;-0.0600;0.3410;0.0000;0.0000;0.0000;1;-0.1216;-0.0858;0.3488;0.0000;0.0000;0.0000;2;-0.2500;-0.4000;0.3350;0.0000;0.0000;0.0000;3;-0.1216;-0.0858;0.3488;0.0000;0.0000;0.0000;0;False;1
86.79662;2;0;-0.5290;-0.0600;0.3410;0.0000;0.0000;0.0000;1;-0.1216;-0.0858;0.3488;0.0000;0.0000;0.0000;2;-0.2500;-0.4000;0.3350;0.0000;0.0000;0.0000;3;-0.1216;-0.0858;0.3488;0.0000;0.0000;0.0000;0;False;1
87.02067;2;0;-0.5290;-0.0600;0.3410;0.0000;0.0000;0.0000;1;-0.1216;-0.0858;0.3488;0.0000;0.0000;0.0000;2;-0.2500;-0.4000;0.3350;0.0000;0.0000;0.0000;3;-0.1216;-0.0858;0.3488;0.0000;0.0000;0.0000;0;False;1
87.24332;2;0;-0.5290;-0.0600;0.3410;0.0000;0.0000;0.0000;1;-0.1216;-0.0858;0.3488;0.0000;0.0000;0.0000;2;-0.2500;-0.4000;0.3350;0.0000;0.0000;0.0000;3;-0.1216;-0.0858;0.3488;0.0000;0.0000;0.0000;0;False;1
87.46181;2;0;-0.5290;-0.0600;0.3410;0.0000;0.0000;0.0000;1;-0.1216;-0.0858;0.3488;0.0000;0.0000;0.0000;2;-0.2500;-0.4000;0.3350;0.0000;0.0000;0.0000;3;-0.1216;-0.0858;0.3488;0.0000;0.0000;0.0000;0;False;1
87.68367;2;0;-0.5290;-0.0600;0.3410;0.0000;0.0000;0.0000;1;-0.1216;-0.0858;0.3488;0.0000;0.0000;0.0000;2;-0.2500;-0.4000;0.3350;0.0000;0.0000;0.0000;3;-0.1216;-0.0858;0.3488;0.0000;0.0000;0.0000;0;False;1
87.90576;2;0;-0.5290;-0.0600;0.3410;0.0000;0.0000;0.0000;1;-0.1216;-0.0858;0.3488;0.0000;0.0000;0.0000;2;-0.2500;-0.4000;0.3350;0.0000;0.0000;0.0000;3;-0.1216;-0.0858;0.3488;0.0000;0.0000;0.0000;0;False;1
88.13103;2;0;-0.5290;-0.0600;0.3410;0.0000;0.0000;0.0000;1;-0.1216;-0.0858;0.3488;0.0000;0.0000;0.0000;2;-0.2500;-0.4000;0.3350;0.0000;0.0000;0.0000;3;-0.1216;-0.0858;0.3488;0.0000;0.0000;0.0000;0;False;1
88.35619;2;0;-0.5290;-0.0600;0.3410;0.0000;0.0000;0.0000;1;-0.1216;-0.0858;0.3488;0.0000;0.0000;0.0000;2;-0.2500;-0.4000;0.3350;0.0000;0.0000;0.0000;3;-0.1216;-0.0858;0.3488;0.0000;0.0000;0.0000;0;False;1
88.57844;2;0;-0.5290;-0.0600;0.3410;0.0000;0.0000;0.0000;1;-0.1216;-0.0858;0.3488;0.0000;0.0000;0.0000;2;-0.2500;-0.4000;0.3350;0.0000;0.0000;0.0000;3;-0.1216;-0.0858;0.3488;0.0000;0.0000;0.0000;0;False;1
88.79921;2;0;-0.5290;-0.0600;0.3410;0.0000;0.0000;0.0000;1;-0.1216;-0.0858;0.3488;0.0000;0.0000;0.0000;2;-0.2500;-0.4000;0.3350;0.0000;0.0000;0.0000;3;-0.1216;-0.0858;0.3488;0.0000;0.0000;0.0000;0;False;1
89.02279;2;0;-0.5290;-0.0600;0.3410;0.0000;0.0000;0.0000;1;-0.1216;-0.0858;0.3488;0.0000;0.0000;0.0000;2;-0.2500;-0.4000;0.3350;0.0000;0.0000;0.0000;3;-0.1216;-0.0858;0.3488;0.0000;0.0000;0.0000;0;False;1
89.24584;2;0;-0.5290;-0.0600;0.3410;0.0000;0.0000;0.0000;1;-0.1216;-0.0858;0.3488;0.0000;0.0000;0.0000;2;-0.2500;-0.4000;0.3350;0.0000;0.0000;0.0000;3;-0.1216;-0.0858;0.3488;0.0000;0.0000;0.0000;0;False;1
89.46986;2;0;-0.5290;-0.0600;0.3410;0.0000;0.0000;0.0000;1;-0.1216;-0.0858;0.3488;0.0000;0.0000;0.0000;2;-0.2500;-0.4000;0.3350;0.0000;0.0000;0.0000;3;-0.1216;-0.0858;0.3488;0.0000;0.0000;0.0000;0;False;1
89.69714;2;0;-0.5290;-0.0600;0.3410;0.0000;0.0000;0.0000;1;-0.1216;-0.0858;0.3488;0.0000;0.0000;0.0000;2;-0.2500;-0.4000;0.3350;0.0000;0.0000;0.0000;3;-0.1216;-0.0858;0.3488;0.0000;0.0000;0.0000;0;False;1
89.91999;2;0;-0.5290;-0.0600;0.3410;0.0000;0.0000;0.0000;1;-0.1216;-0.0858;0.3488;0.0000;0.0000;0.0000;2;-0.2500;-0.4000;0.3350;0.0000;0.0000;0.0000;3;-0.1216;-0.0858;0.3488;0.0000;0.0000;0.0000;0;False;1
90.14276;2;0;-0.5290;-0.0600;0.3410;0.0000;0.0000;0.0000;1;-0.1216;-0.0858;0.3488;0.0000;0.0000;0.0000;2;-0.2500;-0.4000;0.3350;0.0000;0.0000;0.0000;3;-0.1216;-0.0858;0.3488;0.0000;0.0000;0.0000;0;False;1
90.36536;2;0;-0.5290;-0.0600;0.3410;0.0000;0.0000;0.0000;1;-0.1216;-0.0858;0.3488;0.0000;0.0000;0.0000;2;-0.2500;-0.4000;0.3350;0.0000;0.0000;0.0000;3;-0.1216;-0.0858;0.3488;0.0000;0.0000;0.0000;0;False;1
90.58903;2;0;-0.5290;-0.0600;0.3410;0.0000;0.0000;0.0000;1;-0.1216;-0.0858;0.3488;0.0000;0.0000;0.0000;2;-0.2500;-0.4000;0.3350;0.0000;0.0000;0.0000;3;-0.1216;-0.0858;0.3488;0.0000;0.0000;0.0000;0;False;1
90.81258;2;0;-0.5290;-0.0600;0.3410;0.0000;0.0000;0.0000;1;-0.1216;-0.0858;0.3488;0.0000;0.0000;0.0000;2;-0.2500;-0.4000;0.3350;0.0000;0.0000;0.0000;3;-0.1216;-0.0858;0.3488;0.0000;0.0000;0.0000;0;False;1
91.03474;2;0;-0.5290;-0.0600;0.3410;0.0000;0.0000;0.0000;1;-0.1216;-0.0858;0.3488;0.0000;0.0000;0.0000;2;-0.2500;-0.4000;0.3350;0.0000;0.0000;0.0000;3;-0.1216;-0.0858;0.3488;0.0000;0.0000;0.0000;0;False;1
91.2576;2;0;-0.5290;-0.0600;0.3410;0.0000;0.0000;0.0000;1;-0.1216;-0.0858;0.3488;0.0000;0.0000;0.0000;2;-0.2500;-0.4000;0.3350;0.0000;0.0000;0.0000;3;-0.1216;-0.0858;0.3488;0.0000;0.0000;0.0000;0;False;1
91.47953;2;0;-0.5290;-0.0600;0.3410;0.0000;0.0000;0.0000;1;-0.1216;-0.0858;0.3488;0.0000;0.0000;0.0000;2;-0.2500;-0.4000;0.3350;0.0000;0.0000;0.0000;3;-0.1216;-0.0858;0.3488;0.0000;0.0000;0.0000;0;False;1
91.6983;2;0;-0.5290;-0.0600;0.3410;0.0000;0.0000;0.0000;1;-0.1216;-0.0858;0.3488;0.0000;0.0000;0.0000;2;-0.2500;-0.4000;0.3350;0.0000;0.0000;0.0000;3;-0.1216;-0.0858;0.3488;0.0000;0.0000;0.0000;0;False;1
91.9194;2;0;-0.5290;-0.0600;0.3410;0.0000;0.0000;0.0000;1;-0.1216;-0.0858;0.3488;0.0000;0.0000;0.0000;2;-0.2500;-0.4000;0.3350;0.0000;0.0000;0.0000;3;-0.1216;-0.0858;0.3488;0.0000;0.0000;0.0000;0;False;1
92.14213;2;0;-0.5290;-0.0600;0.3410;0.0000;0.0000;0.0000;1;-0.1216;-0.0858;0.3488;0.0000;0.0000;0.0000;2;-0.2500;-0.4000;0.3350;0.0000;0.0000;0.0000;3;-0.1216;-0.0858;0.3488;0.0000;0.0000;0.0000;0;False;1
92.36536;2;0;-0.5290;-0.0600;0.3410;0.0000;0.0000;0.0000;1;-0.1216;-0.0858;0.3488;0.0000;0.0000;0.0000;2;-0.2500;-0.4000;0.3350;0.0000;0.0000;0.0000;3;-0.1216;-0.0858;0.3488;0.0000;0.0000;0.0000;0;False;1
92.58945;2;0;-0.5290;-0.0600;0.3410;0.0000;0.0000;0.0000;1;-0.1216;-0.0858;0.3488;0.0000;0.0000;0.0000;2;-0.2500;-0.4000;0.3350;0.0000;0.0000;0.0000;3;-0.1216;-0.0858;0.3488;0.0000;0.0000;0.0000;0;False;1
92.81779;2;0;-0.5290;-0.0600;0.3410;0.0000;0.0000;0.0000;1;-0.1216;-0.0858;0.3488;0.0000;0.0000;0.0000;2;-0.2500;-0.4000;0.3350;0.0000;0.0000;0.0000;3;-0.1216;-0.0858;0.3488;0.0000;0.0000;0.0000;0;False;1
93.04089;2;0;-0.5290;-0.0600;0.3410;0.0000;0.0000;0.0000;1;-0.1216;-0.0858;0.3488;0.0000;0.0000;0.0000;2;-0.2500;-0.4000;0.3350;0.0000;0.0000;0.0000;3;-0.1216;-0.0858;0.3488;0.0000;0.0000;0.0000;0;False;1
93.26328;2;0;-0.5290;-0.0600;0.3410;0.0000;0.0000;0.0000;1;-0.1216;-0.0858;0.3488;0.0000;0.0000;0.0000;2;-0.2500;-0.4000;0.3350;0.0000;0.0000;0.0000;3;-0.1216;-0.0858;0.3488;0.0000;0.0000;0.0000;0;False;1
93.47431;2;0;-0.5290;-0.0600;0.3410;0.0000;0.0000;0.0000;1;-0.1216;-0.0858;0.3488;0.0000;0.0000;0.0000;2;-0.2500;-0.4000;0.3350;0.0000;0.0000;0.0000;3;-0.1216;-0.0858;0.3488;0.0000;0.0000;0.0000;0;False;1
93.68639;2;0;-0.5290;-0.0600;0.3410;0.0000;0.0000;0.0000;1;-0.1216;-0.0858;0.3488;0.0000;0.0000;0.0000;2;-0.2500;-0.4000;0.3350;0.0000;0.0000;0.0000;3;-0.1216;-0.0858;0.3488;0.0000;0.0000;0.0000;0;False;1
93.89608;2;0;-0.5290;-0.0600;0.3410;0.0000;0.0000;0.0000;1;-0.1216;-0.0858;0.3488;0.0000;0.0000;0.0000;2;-0.2500;-0.4000;0.3350;0.0000;0.0000;0.0000;3;-0.1216;-0.0858;0.3488;0.0000;0.0000;0.0000;0;False;1
94.10318;2;0;-0.5290;-0.0600;0.3410;0.0000;0.0000;0.0000;1;-0.1216;-0.0858;0.3488;0.0000;0.0000;0.0000;2;-0.2500;-0.4000;0.3350;0.0000;0.0000;0.0000;3;-0.1216;-0.0858;0.3488;0.0000;0.0000;0.0000;0;False;1
94.30873;2;0;-0.5290;-0.0600;0.3410;0.0000;0.0000;0.0000;1;-0.1216;-0.0858;0.3488;0.0000;0.0000;0.0000;2;-0.2500;-0.4000;0.3350;0.0000;0.0000;0.0000;3;-0.1216;-0.0858;0.3488;0.0000;0.0000;0.0000;0;False;1
94.51986;2;0;-0.5290;-0.0600;0.3410;0.0000;0.0000;0.0000;1;-0.1216;-0.0858;0.3488;0.0000;0.0000;0.0000;2;-0.2500;-0.4000;0.3350;0.0000;0.0000;0.0000;3;-0.1216;-0.0858;0.3488;0.0000;0.0000;0.0000;0;False;1
94.73086;2;0;-0.5290;-0.0600;0.3410;0.0000;0.0000;0.0000;1;-0.1216;-0.0858;0.3488;0.0000;0.0000;0.0000;2;-0.2500;-0.4000;0.3350;0.0000;0.0000;0.0000;3;-0.1216;-0.0858;0.3488;0.0000;0.0000;0.0000;0;False;1
94.94341;2;0;-0.5290;-0.0600;0.3410;0.0000;0.0000;0.0000;1;-0.1216;-0.0858;0.3488;0.0000;0.0000;0.0000;2;-0.2500;-0.4000;0.3350;0.0000;0.0000;0.0000;3;-0.1216;-0.0858;0.3488;0.0000;0.0000;0.0000;0;False;1
95.15578;2;0;-0.5290;-0.0600;0.3410;0.0000;0.0000;0.0000;1;-0.1216;-0.0858;0.3488;0.0000;0.0000;0.0000;2;-0.2500;-0.4000;0.3350;0.0000;0.0000;0.0000;3;-0.1216;-0.0858;0.3488;0.0000;0.0000;0.0000;0;False;1
95.36513;2;0;-0.5290;-0.0600;0.3410;0.0000;0.0000;0.0000;1;-0.1216;-0.0858;0.3488;0.0000;0.0000;0.0000;2;-0.2500;-0.4000;0.3350;0.0000;0.0000;0.0000;3;-0.1216;-0.0858;0.3488;0.0000;0.0000;0.0000;0;False;1
95.57367;2;0;-0.5290;-0.0600;0.3410;0.0000;0.0000;0.0000;1;-0.1216;-0.0858;0.3488;0.0000;0.0000;0.0000;2;-0.2500;-0.4000;0.3350;0.0000;0.0000;0.0000;3;-0.1216;-0.0858;0.3488;0.0000;0.0000;0.0000;0;False;1
95.78362;2;0;-0.5290;-0.0600;0.3410;0.0000;0.0000;0.0000;1;-0.1216;-0.0858;0.3488;0.0000;0.0000;0.0000;2;-0.2500;-0.4000;0.3350;0.0000;0.0000;0.0000;3;-0.1216;-0.0858;0.3488;0.0000;0.0000;0.0000;0;False;1
95.9968;2;0;-0.5290;-0.0600;0.3410;0.0000;0.0000;0.0000;1;-0.1216;-0.0858;0.3488;0.0000;0.0000;0.0000;2;-0.2500;-0.4000;0.3350;0.0000;0.0000;0.0000;3;-0.1216;-0.0858;0.3488;0.0000;0.0000;0.0000;0;False;1
96.21256;2;0;-0.5290;-0.0600;0.3410;0.0000;0.0000;0.0000;1;-0.1216;-0.0858;0.3488;0.0000;0.0000;0.0000;2;-0.2500;-0.4000;0.3350;0.0000;0.0000;0.0000;3;-0.1216;-0.0858;0.3488;0.0000;0.0000;0.0000;0;False;1
96.42871;2;0;-0.5290;-0.0600;0.3410;0.0000;0.0000;0.0000;1;-0.1216;-0.0858;0.3488;0.0000;0.0000;0.0000;2;-0.2500;-0.4000;0.3350;0.0000;0.0000;0.0000;3;-0.1216;-0.0858;0.3488;0.0000;0.0000;0.0000;0;False;1
96.64542;2;0;-0.5290;-0.0600;0.3410;0.0000;0.0000;0.0000;1;-0.1216;-0.0858;0.3488;0.0000;0.0000;0.0000;2;-0.2500;-0.4000;0.3350;0.0000;0.0000;0.0000;3;-0.1216;-0.0858;0.3488;0.0000;0.0000;0.0000;0;False;1
96.86078;2;0;-0.5290;-0.0600;0.3410;0.0000;0.0000;0.0000;1;-0.1216;-0.0858;0.3488;0.0000;0.0000;0.0000;2;-0.2500;-0.4000;0.3350;0.0000;0.0000;0.0000;3;-0.1216;-0.0858;0.3488;0.0000;0.0000;0.0000;0;False;1
97.07648;2;0;-0.5290;-0.0600;0.3410;0.0000;0.0000;0.0000;1;-0.1216;-0.0858;0.3488;0.0000;0.0000;0.0000;2;-0.2500;-0.4000;0.3350;0.0000;0.0000;0.0000;3;-0.1216;-0.0858;0.3488;0.0000;0.0000;0.0000;0;False;1
97.29343;2;0;-0.5290;-0.0600;0.3410;0.0000;0.0000;0.0000;1;-0.1216;-0.0858;0.3488;0.0000;0.0000;0.0000;2;-0.2500;-0.4000;0.3350;0.0000;0.0000;0.0000;3;-0.1216;-0.0858;0.3488;0.0000;0.0000;0.0000;0;False;1
97.50325;2;0;-0.5290;-0.0600;0.3410;0.0000;0.0000;0.0000;1;-0.1216;-0.0858;0.3488;0.0000;0.0000;0.0000;2;-0.2500;-0.4000;0.3350;0.0000;0.0000;0.0000;3;-0.1216;-0.0858;0.3488;0.0000;0.0000;0.0000;0;False;1
97.71767;2;0;-0.5290;-0.0600;0.3410;0.0000;0.0000;0.0000;1;-0.1216;-0.0858;0.3488;0.0000;0.0000;0.0000;2;-0.2500;-0.4000;0.3350;0.0000;0.0000;0.0000;3;-0.1216;-0.0858;0.3488;0.0000;0.0000;0.0000;0;False;1
97.93193;2;0;-0.5290;-0.0600;0.3410;0.0000;0.0000;0.0000;1;-0.1216;-0.0858;0.3488;0.0000;0.0000;0.0000;2;-0.2500;-0.4000;0.3350;0.0000;0.0000;0.0000;3;-0.1216;-0.0858;0.3488;0.0000;0.0000;0.0000;0;False;1
98.14722;2;0;-0.5290;-0.0600;0.3410;0.0000;0.0000;0.0000;1;-0.1216;-0.0858;0.3488;0.0000;0.0000;0.0000;2;-0.2500;-0.4000;0.3350;0.0000;0.0000;0.0000;3;-0.1216;-0.0858;0.3488;0.0000;0.0000;0.0000;0;False;1
98.36227;2;0;-0.5290;-0.0600;0.3410;0.0000;0.0000;0.0000;1;-0.1216;-0.0858;0.3488;0.0000;0.0000;0.0000;2;-0.2500;-0.4000;0.3350;0.0000;0.0000;0.0000;3;-0.1216;-0.0858;0.3488;0.0000;0.0000;0.0000;0;False;1
98.57729;2;0;-0.5290;-0.0600;0.3410;0.0000;0.0000;0.0000;1;-0.1216;-0.0858;0.3488;0.0000;0.0000;0.0000;2;-0.2500;-0.4000;0.3350;0.0000;0.0000;0.0000;3;-0.1216;-0.0858;0.3488;0.0000;0.0000;0.0000;0;False;1
98.78906;2;0;-0.5290;-0.0600;0.3410;0.0000;0.0000;0.0000;1;-0.1216;-0.0858;0.3488;0.0000;0.0000;0.0000;2;-0.2500;-0.4000;0.3350;0.0000;0.0000;0.0000;3;-0.1216;-0.0858;0.3488;0.0000;0.0000;0.0000;0;False;1
99.00454;2;0;-0.5290;-0.0600;0.3410;0.0000;0.0000;0.0000;1;-0.1216;-0.0858;0.3488;0.0000;0.0000;0.0000;2;-0.2500;-0.4000;0.3350;0.0000;0.0000;0.0000;3;-0.1216;-0.0858;0.3488;0.0000;0.0000;0.0000;0;False;1
99.22044;2;0;-0.5290;-0.0600;0.3410;0.0000;0.0000;0.0000;1;-0.1216;-0.0858;0.3488;0.0000;0.0000;0.0000;2;-0.2500;-0.4000;0.3350;0.0000;0.0000;0.0000;3;-0.1216;-0.0858;0.3488;0.0000;0.0000;0.0000;0;False;1
99.43722;2;0;-0.5290;-0.0600;0.3410;0.0000;0.0000;0.0000;1;-0.1216;-0.0858;0.3488;0.0000;0.0000;0.0000;2;-0.2500;-0.4000;0.3350;0.0000;0.0000;0.0000;3;-0.1216;-0.0858;0.3488;0.0000;0.0000;0.0000;0;False;1
99.65591;2;0;-0.5290;-0.0600;0.3410;0.0000;0.0000;0.0000;1;-0.1216;-0.0858;0.3488;0.0000;0.0000;0.0000;2;-0.2500;-0.4000;0.3350;0.0000;0.0000;0.0000;3;-0.1216;-0.0858;0.3488;0.0000;0.0000;0.0000;0;False;1
99.87283;2;0;-0.5290;-0.0600;0.3410;0.0000;0.0000;0.0000;1;-0.1216;-0.0858;0.3488;0.0000;0.0000;0.0000;2;-0.2500;-0.4000;0.3350;0.0000;0.0000;0.0000;3;-0.1216;-0.0858;0.3488;0.0000;0.0000;0.0000;0;False;1
100.0914;2;0;-0.5290;-0.0600;0.3410;0.0000;0.0000;0.0000;1;-0.1216;-0.0858;0.3488;0.0000;0.0000;0.0000;2;-0.2500;-0.4000;0.3350;0.0000;0.0000;0.0000;3;-0.1216;-0.0858;0.3488;0.0000;0.0000;0.0000;0;False;1
100.3075;2;0;-0.5290;-0.0600;0.3410;0.0000;0.0000;0.0000;1;-0.1216;-0.0858;0.3488;0.0000;0.0000;0.0000;2;-0.2500;-0.4000;0.3350;0.0000;0.0000;0.0000;3;-0.1216;-0.0858;0.3488;0.0000;0.0000;0.0000;0;False;1
100.5234;2;0;-0.5290;-0.0600;0.3410;0.0000;0.0000;0.0000;1;-0.1216;-0.0858;0.3488;0.0000;0.0000;0.0000;2;-0.2500;-0.4000;0.3350;0.0000;0.0000;0.0000;3;-0.1216;-0.0858;0.3488;0.0000;0.0000;0.0000;0;False;1
100.7405;2;0;-0.5290;-0.0600;0.3410;0.0000;0.0000;0.0000;1;-0.1216;-0.0858;0.3488;0.0000;0.0000;0.0000;2;-0.2500;-0.4000;0.3350;0.0000;0.0000;0.0000;3;-0.1216;-0.0858;0.3488;0.0000;0.0000;0.0000;0;False;1
100.9598;2;0;-0.5290;-0.0600;0.3410;0.0000;0.0000;0.0000;1;-0.1216;-0.0858;0.3488;0.0000;0.0000;0.0000;2;-0.2500;-0.4000;0.3350;0.0000;0.0000;0.0000;3;-0.1216;-0.0858;0.3488;0.0000;0.0000;0.0000;0;False;1
101.181;2;0;-0.5290;-0.0600;0.3410;0.0000;0.0000;0.0000;1;-0.1216;-0.0858;0.3488;0.0000;0.0000;0.0000;2;-0.2500;-0.4000;0.3350;0.0000;0.0000;0.0000;3;-0.1216;-0.0858;0.3488;0.0000;0.0000;0.0000;0;False;1
101.3997;2;0;-0.5290;-0.0600;0.3410;0.0000;0.0000;0.0000;1;-0.1216;-0.0858;0.3488;0.0000;0.0000;0.0000;2;-0.2500;-0.4000;0.3350;0.0000;0.0000;0.0000;3;-0.1216;-0.0858;0.3488;0.0000;0.0000;0.0000;0;False;1
101.618;2;0;-0.5290;-0.0600;0.3410;0.0000;0.0000;0.0000;1;-0.1216;-0.0858;0.3488;0.0000;0.0000;0.0000;2;-0.2500;-0.4000;0.3350;0.0000;0.0000;0.0000;3;-0.1216;-0.0858;0.3488;0.0000;0.0000;0.0000;0;False;1
101.8335;2;0;-0.5290;-0.0600;0.3410;0.0000;0.0000;0.0000;1;-0.1216;-0.0858;0.3488;0.0000;0.0000;0.0000;2;-0.2500;-0.4000;0.3350;0.0000;0.0000;0.0000;3;-0.1216;-0.0858;0.3488;0.0000;0.0000;0.0000;0;False;1
102.049;2;0;-0.5290;-0.0600;0.3410;0.0000;0.0000;0.0000;1;-0.1216;-0.0858;0.3488;0.0000;0.0000;0.0000;2;-0.2500;-0.4000;0.3350;0.0000;0.0000;0.0000;3;-0.1216;-0.0858;0.3488;0.0000;0.0000;0.0000;0;False;1
102.2638;2;0;-0.5290;-0.0600;0.3410;0.0000;0.0000;0.0000;1;-0.1216;-0.0858;0.3488;0.0000;0.0000;0.0000;2;-0.2500;-0.4000;0.3350;0.0000;0.0000;0.0000;3;-0.1216;-0.0858;0.3488;0.0000;0.0000;0.0000;0;False;1
102.4783;2;0;-0.5290;-0.0600;0.3410;0.0000;0.0000;0.0000;1;-0.1216;-0.0858;0.3488;0.0000;0.0000;0.0000;2;-0.2500;-0.4000;0.3350;0.0000;0.0000;0.0000;3;-0.1216;-0.0858;0.3488;0.0000;0.0000;0.0000;0;False;1
102.6943;2;0;-0.5290;-0.0600;0.3410;0.0000;0.0000;0.0000;1;-0.1216;-0.0858;0.3488;0.0000;0.0000;0.0000;2;-0.2500;-0.4000;0.3350;0.0000;0.0000;0.0000;3;-0.1216;-0.0858;0.3488;0.0000;0.0000;0.0000;0;False;1
102.91;2;0;-0.5290;-0.0600;0.3410;0.0000;0.0000;0.0000;1;-0.1216;-0.0858;0.3488;0.0000;0.0000;0.0000;2;-0.2500;-0.4000;0.3350;0.0000;0.0000;0.0000;3;-0.1216;-0.0858;0.3488;0.0000;0.0000;0.0000;0;False;1
103.1268;2;0;-0.5290;-0.0600;0.3410;0.0000;0.0000;0.0000;1;-0.1216;-0.0858;0.3488;0.0000;0.0000;0.0000;2;-0.2500;-0.4000;0.3350;0.0000;0.0000;0.0000;3;-0.1216;-0.0858;0.3488;0.0000;0.0000;0.0000;0;False;1
103.3433;2;0;-0.5290;-0.0600;0.3410;0.0000;0.0000;0.0000;1;-0.1216;-0.0858;0.3488;0.0000;0.0000;0.0000;2;-0.2500;-0.4000;0.3350;0.0000;0.0000;0.0000;3;-0.1216;-0.0858;0.3488;0.0000;0.0000;0.0000;0;False;1
103.557;2;0;-0.5290;-0.0600;0.3410;0.0000;0.0000;0.0000;1;-0.1216;-0.0858;0.3488;0.0000;0.0000;0.0000;2;-0.2500;-0.4000;0.3350;0.0000;0.0000;0.0000;3;-0.1216;-0.0858;0.3488;0.0000;0.0000;0.0000;0;False;1
103.772;2;0;-0.5290;-0.0600;0.3410;0.0000;0.0000;0.0000;1;-0.1216;-0.0858;0.3488;0.0000;0.0000;0.0000;2;-0.2500;-0.4000;0.3350;0.0000;0.0000;0.0000;3;-0.1216;-0.0858;0.3488;0.0000;0.0000;0.0000;0;False;1
103.9884;2;0;-0.5290;-0.0600;0.3410;0.0000;0.0000;0.0000;1;-0.1216;-0.0858;0.3488;0.0000;0.0000;0.0000;2;-0.2500;-0.4000;0.3350;0.0000;0.0000;0.0000;3;-0.1216;-0.0858;0.3488;0.0000;0.0000;0.0000;0;False;1
104.2053;2;0;-0.5290;-0.0600;0.3410;0.0000;0.0000;0.0000;1;-0.1216;-0.0858;0.3488;0.0000;0.0000;0.0000;2;-0.2500;-0.4000;0.3350;0.0000;0.0000;0.0000;3;-0.1216;-0.0858;0.3488;0.0000;0.0000;0.0000;0;False;1
104.4214;2;0;-0.5290;-0.0600;0.3410;0.0000;0.0000;0.0000;1;-0.1216;-0.0858;0.3488;0.0000;0.0000;0.0000;2;-0.2500;-0.4000;0.3350;0.0000;0.0000;0.0000;3;-0.1216;-0.0858;0.3488;0.0000;0.0000;0.0000;0;False;1
104.6371;2;0;-0.5290;-0.0600;0.3410;0.0000;0.0000;0.0000;1;-0.1216;-0.0858;0.3488;0.0000;0.0000;0.0000;2;-0.2500;-0.4000;0.3350;0.0000;0.0000;0.0000;3;-0.1216;-0.0858;0.3488;0.0000;0.0000;0.0000;0;False;1
104.8529;2;0;-0.5290;-0.0600;0.3410;0.0000;0.0000;0.0000;1;-0.1216;-0.0858;0.3488;0.0000;0.0000;0.0000;2;-0.2500;-0.4000;0.3350;0.0000;0.0000;0.0000;3;-0.1216;-0.0858;0.3488;0.0000;0.0000;0.0000;0;False;1
105.0777;2;0;-0.5290;-0.0600;0.3410;0.0000;0.0000;0.0000;1;-0.1216;-0.0858;0.3488;0.0000;0.0000;0.0000;2;-0.2500;-0.4000;0.3350;0.0000;0.0000;0.0000;3;-0.1216;-0.0858;0.3488;0.0000;0.0000;0.0000;0;False;1
105.2938;2;0;-0.5290;-0.0600;0.3410;0.0000;0.0000;0.0000;1;-0.1216;-0.0858;0.3488;0.0000;0.0000;0.0000;2;-0.2500;-0.4000;0.3350;0.0000;0.0000;0.0000;3;-0.1216;-0.0858;0.3488;0.0000;0.0000;0.0000;0;False;1
105.5122;2;0;-0.5290;-0.0600;0.3410;0.0000;0.0000;0.0000;1;-0.1216;-0.0858;0.3488;0.0000;0.0000;0.0000;2;-0.2500;-0.4000;0.3350;0.0000;0.0000;0.0000;3;-0.1216;-0.0858;0.3488;0.0000;0.0000;0.0000;0;False;1
105.7322;2;0;-0.5290;-0.0600;0.3410;0.0000;0.0000;0.0000;1;-0.1216;-0.0858;0.3488;0.0000;0.0000;0.0000;2;-0.2500;-0.4000;0.3350;0.0000;0.0000;0.0000;3;-0.1216;-0.0858;0.3488;0.0000;0.0000;0.0000;0;False;1
105.9507;2;0;-0.5290;-0.0600;0.3410;0.0000;0.0000;0.0000;1;-0.1216;-0.0858;0.3488;0.0000;0.0000;0.0000;2;-0.2500;-0.4000;0.3350;0.0000;0.0000;0.0000;3;-0.1216;-0.0858;0.3488;0.0000;0.0000;0.0000;0;False;1
106.1581;2;0;-0.5290;-0.0600;0.3410;0.0000;0.0000;0.0000;1;-0.1216;-0.0858;0.3488;0.0000;0.0000;0.0000;2;-0.2500;-0.4000;0.3350;0.0000;0.0000;0.0000;3;-0.1216;-0.0858;0.3488;0.0000;0.0000;0.0000;0;False;1
106.3694;2;0;-0.5290;-0.0600;0.3410;0.0000;0.0000;0.0000;1;-0.1216;-0.0858;0.3488;0.0000;0.0000;0.0000;2;-0.2500;-0.4000;0.3350;0.0000;0.0000;0.0000;3;-0.1216;-0.0858;0.3488;0.0000;0.0000;0.0000;0;False;1
106.5812;2;0;-0.5290;-0.0600;0.3410;0.0000;0.0000;0.0000;1;-0.1216;-0.0858;0.3488;0.0000;0.0000;0.0000;2;-0.2500;-0.4000;0.3350;0.0000;0.0000;0.0000;3;-0.1216;-0.0858;0.3488;0.0000;0.0000;0.0000;0;False;1
106.7906;2;0;-0.5290;-0.0600;0.3410;0.0000;0.0000;0.0000;1;-0.1216;-0.0858;0.3488;0.0000;0.0000;0.0000;2;-0.2500;-0.4000;0.3350;0.0000;0.0000;0.0000;3;-0.1216;-0.0858;0.3488;0.0000;0.0000;0.0000;0;False;1
106.99;2;0;-0.5290;-0.0600;0.3410;0.0000;0.0000;0.0000;1;-0.1216;-0.0858;0.3488;0.0000;0.0000;0.0000;2;-0.2500;-0.4000;0.3350;0.0000;0.0000;0.0000;3;-0.1216;-0.0858;0.3488;0.0000;0.0000;0.0000;0;False;1
107.1911;2;0;-0.5290;-0.0600;0.3410;0.0000;0.0000;0.0000;1;-0.1216;-0.0858;0.3488;0.0000;0.0000;0.0000;2;-0.2500;-0.4000;0.3350;0.0000;0.0000;0.0000;3;-0.1216;-0.0858;0.3488;0.0000;0.0000;0.0000;0;False;1
107.3923;2;0;-0.5290;-0.0600;0.3410;0.0000;0.0000;0.0000;1;-0.1216;-0.0858;0.3488;0.0000;0.0000;0.0000;2;-0.2500;-0.4000;0.3350;0.0000;0.0000;0.0000;3;-0.1216;-0.0858;0.3488;0.0000;0.0000;0.0000;0;False;1
107.6106;2;0;-0.5290;-0.0600;0.3410;0.0000;0.0000;0.0000;1;-0.1216;-0.0858;0.3488;0.0000;0.0000;0.0000;2;-0.2500;-0.4000;0.3350;0.0000;0.0000;0.0000;3;-0.1216;-0.0858;0.3488;0.0000;0.0000;0.0000;0;False;1
107.8277;2;0;-0.5290;-0.0600;0.3410;0.0000;0.0000;0.0000;1;-0.1216;-0.0858;0.3488;0.0000;0.0000;0.0000;2;-0.2500;-0.4000;0.3350;0.0000;0.0000;0.0000;3;-0.1216;-0.0858;0.3488;0.0000;0.0000;0.0000;0;False;1
108.0484;2;0;-0.5290;-0.0600;0.3410;0.0000;0.0000;0.0000;1;-0.1216;-0.0858;0.3488;0.0000;0.0000;0.0000;2;-0.2500;-0.4000;0.3350;0.0000;0.0000;0.0000;3;-0.1216;-0.0858;0.3488;0.0000;0.0000;0.0000;0;False;1
108.2596;2;0;-0.5290;-0.0600;0.3410;0.0000;0.0000;0.0000;1;-0.1216;-0.0858;0.3488;0.0000;0.0000;0.0000;2;-0.2500;-0.4000;0.3350;0.0000;0.0000;0.0000;3;-0.1216;-0.0858;0.3488;0.0000;0.0000;0.0000;0;False;1
108.4586;2;0;-0.5290;-0.0600;0.3410;0.0000;0.0000;0.0000;1;-0.1216;-0.0858;0.3488;0.0000;0.0000;0.0000;2;-0.2500;-0.4000;0.3350;0.0000;0.0000;0.0000;3;-0.1216;-0.0858;0.3488;0.0000;0.0000;0.0000;0;False;1
108.6433;2;0;-0.5290;-0.0600;0.3410;0.0000;0.0000;0.0000;1;-0.1216;-0.0858;0.3488;0.0000;0.0000;0.0000;2;-0.2500;-0.4000;0.3350;0.0000;0.0000;0.0000;3;-0.1216;-0.0858;0.3488;0.0000;0.0000;0.0000;0;False;1
108.8298;2;0;-0.5290;-0.0600;0.3410;0.0000;0.0000;0.0000;1;-0.1216;-0.0858;0.3488;0.0000;0.0000;0.0000;2;-0.2500;-0.4000;0.3350;0.0000;0.0000;0.0000;3;-0.1216;-0.0858;0.3488;0.0000;0.0000;0.0000;0;False;1
109.0324;2;0;-0.5290;-0.0600;0.3410;0.0000;0.0000;0.0000;1;-0.1216;-0.0858;0.3488;0.0000;0.0000;0.0000;2;-0.2500;-0.4000;0.3350;0.0000;0.0000;0.0000;3;-0.1216;-0.0858;0.3488;0.0000;0.0000;0.0000;0;False;1
109.2351;2;0;-0.5290;-0.0600;0.3410;0.0000;0.0000;0.0000;1;-0.1216;-0.0858;0.3488;0.0000;0.0000;0.0000;2;-0.2500;-0.4000;0.3350;0.0000;0.0000;0.0000;3;-0.1216;-0.0858;0.3488;0.0000;0.0000;0.0000;0;False;1
109.4489;2;0;-0.5290;-0.0600;0.3410;0.0000;0.0000;0.0000;1;-0.1216;-0.0858;0.3488;0.0000;0.0000;0.0000;2;-0.2500;-0.4000;0.3350;0.0000;0.0000;0.0000;3;-0.1216;-0.0858;0.3488;0.0000;0.0000;0.0000;0;False;1
109.6652;2;0;-0.5290;-0.0600;0.3410;0.0000;0.0000;0.0000;1;-0.1216;-0.0858;0.3488;0.0000;0.0000;0.0000;2;-0.2500;-0.4000;0.3350;0.0000;0.0000;0.0000;3;-0.1216;-0.0858;0.3488;0.0000;0.0000;0.0000;0;False;1
109.8843;2;0;-0.5290;-0.0600;0.3410;0.0000;0.0000;0.0000;1;-0.1216;-0.0858;0.3488;0.0000;0.0000;0.0000;2;-0.2500;-0.4000;0.3350;0.0000;0.0000;0.0000;3;-0.1216;-0.0858;0.3488;0.0000;0.0000;0.0000;0;False;1
110.1008;2;0;-0.5290;-0.0600;0.3410;0.0000;0.0000;0.0000;1;-0.1216;-0.0858;0.3488;0.0000;0.0000;0.0000;2;-0.2500;-0.4000;0.3350;0.0000;0.0000;0.0000;3;-0.1216;-0.0858;0.3488;0.0000;0.0000;0.0000;0;False;1
110.3142;2;0;-0.5290;-0.0600;0.3410;0.0000;0.0000;0.0000;1;-0.1216;-0.0858;0.3488;0.0000;0.0000;0.0000;2;-0.2500;-0.4000;0.3350;0.0000;0.0000;0.0000;3;-0.1216;-0.0858;0.3488;0.0000;0.0000;0.0000;0;False;1
110.5352;2;0;-0.5290;-0.0600;0.3410;0.0000;0.0000;0.0000;1;-0.1216;-0.0858;0.3488;0.0000;0.0000;0.0000;2;-0.2500;-0.4000;0.3350;0.0000;0.0000;0.0000;3;-0.1216;-0.0858;0.3488;0.0000;0.0000;0.0000;0;False;1
110.7503;2;0;-0.5290;-0.0600;0.3410;0.0000;0.0000;0.0000;1;-0.1216;-0.0858;0.3488;0.0000;0.0000;0.0000;2;-0.2500;-0.4000;0.3350;0.0000;0.0000;0.0000;3;-0.1216;-0.0858;0.3488;0.0000;0.0000;0.0000;0;False;1
110.9636;2;0;-0.5290;-0.0600;0.3410;0.0000;0.0000;0.0000;1;-0.1216;-0.0858;0.3488;0.0000;0.0000;0.0000;2;-0.2500;-0.4000;0.3350;0.0000;0.0000;0.0000;3;-0.1216;-0.0858;0.3488;0.0000;0.0000;0.0000;0;False;1
111.1748;2;0;-0.5290;-0.0600;0.3410;0.0000;0.0000;0.0000;1;-0.1216;-0.0858;0.3488;0.0000;0.0000;0.0000;2;-0.2500;-0.4000;0.3350;0.0000;0.0000;0.0000;3;-0.1216;-0.0858;0.3488;0.0000;0.0000;0.0000;0;False;1
111.388;2;0;-0.5290;-0.0600;0.3410;0.0000;0.0000;0.0000;1;-0.1216;-0.0858;0.3488;0.0000;0.0000;0.0000;2;-0.2500;-0.4000;0.3350;0.0000;0.0000;0.0000;3;-0.1216;-0.0858;0.3488;0.0000;0.0000;0.0000;0;False;1
111.5996;2;0;-0.5290;-0.0600;0.3410;0.0000;0.0000;0.0000;1;-0.1216;-0.0858;0.3488;0.0000;0.0000;0.0000;2;-0.2500;-0.4000;0.3350;0.0000;0.0000;0.0000;3;-0.1216;-0.0858;0.3488;0.0000;0.0000;0.0000;0;False;1
111.8135;2;0;-0.5290;-0.0600;0.3410;0.0000;0.0000;0.0000;1;-0.1216;-0.0858;0.3488;0.0000;0.0000;0.0000;2;-0.2500;-0.4000;0.3350;0.0000;0.0000;0.0000;3;-0.1216;-0.0858;0.3488;0.0000;0.0000;0.0000;0;False;1
112.0272;2;0;-0.5290;-0.0600;0.3410;0.0000;0.0000;0.0000;1;-0.1216;-0.0858;0.3488;0.0000;0.0000;0.0000;2;-0.2500;-0.4000;0.3350;0.0000;0.0000;0.0000;3;-0.1216;-0.0858;0.3488;0.0000;0.0000;0.0000;0;False;1
112.2436;2;0;-0.5290;-0.0600;0.3410;0.0000;0.0000;0.0000;1;-0.1216;-0.0858;0.3488;0.0000;0.0000;0.0000;2;-0.2500;-0.4000;0.3350;0.0000;0.0000;0.0000;3;-0.1216;-0.0858;0.3488;0.0000;0.0000;0.0000;0;False;1
112.4604;2;0;-0.5290;-0.0600;0.3410;0.0000;0.0000;0.0000;1;-0.1216;-0.0858;0.3488;0.0000;0.0000;0.0000;2;-0.2500;-0.4000;0.3350;0.0000;0.0000;0.0000;3;-0.1216;-0.0858;0.3488;0.0000;0.0000;0.0000;0;False;1
112.6774;2;0;-0.5290;-0.0600;0.3410;0.0000;0.0000;0.0000;1;-0.1216;-0.0858;0.3488;0.0000;0.0000;0.0000;2;-0.2500;-0.4000;0.3350;0.0000;0.0000;0.0000;3;-0.1216;-0.0858;0.3488;0.0000;0.0000;0.0000;0;False;1
112.8946;2;0;-0.5290;-0.0600;0.3410;0.0000;0.0000;0.0000;1;-0.1216;-0.0858;0.3488;0.0000;0.0000;0.0000;2;-0.2500;-0.4000;0.3350;0.0000;0.0000;0.0000;3;-0.1216;-0.0858;0.3488;0.0000;0.0000;0.0000;0;False;1
113.1078;2;0;-0.5290;-0.0600;0.3410;0.0000;0.0000;0.0000;1;-0.1216;-0.0858;0.3488;0.0000;0.0000;0.0000;2;-0.2500;-0.4000;0.3350;0.0000;0.0000;0.0000;3;-0.1216;-0.0858;0.3488;0.0000;0.0000;0.0000;0;False;1
113.3236;2;0;-0.5290;-0.0600;0.3410;0.0000;0.0000;0.0000;1;-0.1216;-0.0858;0.3488;0.0000;0.0000;0.0000;2;-0.2500;-0.4000;0.3350;0.0000;0.0000;0.0000;3;-0.1216;-0.0858;0.3488;0.0000;0.0000;0.0000;0;False;1
113.5369;2;0;-0.5290;-0.0600;0.3410;0.0000;0.0000;0.0000;1;-0.1216;-0.0858;0.3488;0.0000;0.0000;0.0000;2;-0.2500;-0.4000;0.3350;0.0000;0.0000;0.0000;3;-0.1216;-0.0858;0.3488;0.0000;0.0000;0.0000;0;False;1
113.7512;2;0;-0.5290;-0.0600;0.3410;0.0000;0.0000;0.0000;1;-0.1216;-0.0858;0.3488;0.0000;0.0000;0.0000;2;-0.2500;-0.4000;0.3350;0.0000;0.0000;0.0000;3;-0.1216;-0.0858;0.3488;0.0000;0.0000;0.0000;0;False;1
113.9665;2;0;-0.5290;-0.0600;0.3410;0.0000;0.0000;0.0000;1;-0.1216;-0.0858;0.3488;0.0000;0.0000;0.0000;2;-0.2500;-0.4000;0.3350;0.0000;0.0000;0.0000;3;-0.1216;-0.0858;0.3488;0.0000;0.0000;0.0000;0;False;1
114.1786;2;0;-0.5290;-0.0600;0.3410;0.0000;0.0000;0.0000;1;-0.1216;-0.0858;0.3488;0.0000;0.0000;0.0000;2;-0.2500;-0.4000;0.3350;0.0000;0.0000;0.0000;3;-0.1216;-0.0858;0.3488;0.0000;0.0000;0.0000;0;False;1
114.3938;2;0;-0.5290;-0.0600;0.3410;0.0000;0.0000;0.0000;1;-0.1216;-0.0858;0.3488;0.0000;0.0000;0.0000;2;-0.2500;-0.4000;0.3350;0.0000;0.0000;0.0000;3;-0.1216;-0.0858;0.3488;0.0000;0.0000;0.0000;0;False;1
114.6109;2;0;-0.5290;-0.0600;0.3410;0.0000;0.0000;0.0000;1;-0.1216;-0.0858;0.3488;0.0000;0.0000;0.0000;2;-0.2500;-0.4000;0.3350;0.0000;0.0000;0.0000;3;-0.1216;-0.0858;0.3488;0.0000;0.0000;0.0000;0;False;1
114.8282;2;0;-0.5290;-0.0600;0.3410;0.0000;0.0000;0.0000;1;-0.1216;-0.0858;0.3488;0.0000;0.0000;0.0000;2;-0.2500;-0.4000;0.3350;0.0000;0.0000;0.0000;3;-0.1216;-0.0858;0.3488;0.0000;0.0000;0.0000;0;False;1
115.0447;2;0;-0.5290;-0.0600;0.3410;0.0000;0.0000;0.0000;1;-0.1216;-0.0858;0.3488;0.0000;0.0000;0.0000;2;-0.2500;-0.4000;0.3350;0.0000;0.0000;0.0000;3;-0.1216;-0.0858;0.3488;0.0000;0.0000;0.0000;0;False;1
115.3274;2;0;-0.5290;-0.0600;0.3410;0.0000;0.0000;0.0000;1;-0.1216;-0.0858;0.3488;0.0000;0.0000;0.0000;2;-0.2500;-0.4000;0.3350;0.0000;0.0000;0.0000;3;-0.1216;-0.0858;0.3488;0.0000;0.0000;0.0000;0;False;1
115.6157;2;0;-0.5290;-0.0600;0.3410;0.0000;0.0000;0.0000;1;-0.1216;-0.0858;0.3488;0.0000;0.0000;0.0000;2;-0.2500;-0.4000;0.3350;0.0000;0.0000;0.0000;3;-0.1216;-0.0858;0.3488;0.0000;0.0000;0.0000;0;False;1
115.8807;2;0;-0.5290;-0.0600;0.3410;0.0000;0.0000;0.0000;1;-0.1216;-0.0858;0.3488;0.0000;0.0000;0.0000;2;-0.2500;-0.4000;0.3350;0.0000;0.0000;0.0000;3;-0.1216;-0.0858;0.3488;0.0000;0.0000;0.0000;0;False;1
116.1064;2;0;-0.5290;-0.0600;0.3410;0.0000;0.0000;0.0000;1;-0.1216;-0.0858;0.3488;0.0000;0.0000;0.0000;2;-0.2500;-0.4000;0.3350;0.0000;0.0000;0.0000;3;-0.1216;-0.0858;0.3488;0.0000;0.0000;0.0000;0;False;1
116.324;2;0;-0.5290;-0.0600;0.3410;0.0000;0.0000;0.0000;1;-0.1216;-0.0858;0.3488;0.0000;0.0000;0.0000;2;-0.2500;-0.4000;0.3350;0.0000;0.0000;0.0000;3;-0.1216;-0.0858;0.3488;0.0000;0.0000;0.0000;0;False;1
116.5422;2;0;-0.5290;-0.0600;0.3410;0.0000;0.0000;0.0000;1;-0.1216;-0.0858;0.3488;0.0000;0.0000;0.0000;2;-0.2500;-0.4000;0.3350;0.0000;0.0000;0.0000;3;-0.1216;-0.0858;0.3488;0.0000;0.0000;0.0000;0;False;1
116.7605;2;0;-0.5290;-0.0600;0.3410;0.0000;0.0000;0.0000;1;-0.1216;-0.0858;0.3488;0.0000;0.0000;0.0000;2;-0.2500;-0.4000;0.3350;0.0000;0.0000;0.0000;3;-0.1216;-0.0858;0.3488;0.0000;0.0000;0.0000;0;False;1
116.9805;2;0;-0.5290;-0.0600;0.3410;0.0000;0.0000;0.0000;1;-0.1216;-0.0858;0.3488;0.0000;0.0000;0.0000;2;-0.2500;-0.4000;0.3350;0.0000;0.0000;0.0000;3;-0.1216;-0.0858;0.3488;0.0000;0.0000;0.0000;0;False;1
117.1981;2;0;-0.5290;-0.0600;0.3410;0.0000;0.0000;0.0000;1;-0.1216;-0.0858;0.3488;0.0000;0.0000;0.0000;2;-0.2500;-0.4000;0.3350;0.0000;0.0000;0.0000;3;-0.1216;-0.0858;0.3488;0.0000;0.0000;0.0000;0;False;1
117.4155;2;0;-0.5290;-0.0600;0.3410;0.0000;0.0000;0.0000;1;-0.1216;-0.0858;0.3488;0.0000;0.0000;0.0000;2;-0.2500;-0.4000;0.3350;0.0000;0.0000;0.0000;3;-0.1216;-0.0858;0.3488;0.0000;0.0000;0.0000;0;False;1
117.6336;2;0;-0.5290;-0.0600;0.3410;0.0000;0.0000;0.0000;1;-0.1216;-0.0858;0.3488;0.0000;0.0000;0.0000;2;-0.2500;-0.4000;0.3350;0.0000;0.0000;0.0000;3;-0.1216;-0.0858;0.3488;0.0000;0.0000;0.0000;0;False;1
117.8543;2;0;-0.5290;-0.0600;0.3410;0.0000;0.0000;0.0000;1;-0.1216;-0.0858;0.3488;0.0000;0.0000;0.0000;2;-0.2500;-0.4000;0.3350;0.0000;0.0000;0.0000;3;-0.1216;-0.0858;0.3488;0.0000;0.0000;0.0000;0;False;1
118.074;2;0;-0.5290;-0.0600;0.3410;0.0000;0.0000;0.0000;1;-0.1216;-0.0858;0.3488;0.0000;0.0000;0.0000;2;-0.2500;-0.4000;0.3350;0.0000;0.0000;0.0000;3;-0.1216;-0.0858;0.3488;0.0000;0.0000;0.0000;0;False;1
118.2978;2;0;-0.5290;-0.0600;0.3410;0.0000;0.0000;0.0000;1;-0.1216;-0.0858;0.3488;0.0000;0.0000;0.0000;2;-0.2500;-0.4000;0.3350;0.0000;0.0000;0.0000;3;-0.1216;-0.0858;0.3488;0.0000;0.0000;0.0000;0;False;1
118.519;2;0;-0.5290;-0.0600;0.3410;0.0000;0.0000;0.0000;1;-0.1216;-0.0858;0.3488;0.0000;0.0000;0.0000;2;-0.2500;-0.4000;0.3350;0.0000;0.0000;0.0000;3;-0.1216;-0.0858;0.3488;0.0000;0.0000;0.0000;0;False;1
118.7398;2;0;-0.5290;-0.0600;0.3410;0.0000;0.0000;0.0000;1;-0.1216;-0.0858;0.3488;0.0000;0.0000;0.0000;2;-0.2500;-0.4000;0.3350;0.0000;0.0000;0.0000;3;-0.1216;-0.0858;0.3488;0.0000;0.0000;0.0000;0;False;1
118.9501;2;0;-0.5290;-0.0600;0.3410;0.0000;0.0000;0.0000;1;-0.1216;-0.0858;0.3488;0.0000;0.0000;0.0000;2;-0.2500;-0.4000;0.3350;0.0000;0.0000;0.0000;3;-0.1216;-0.0858;0.3488;0.0000;0.0000;0.0000;0;False;1
119.1664;2;0;-0.5290;-0.0600;0.3410;0.0000;0.0000;0.0000;1;-0.1216;-0.0858;0.3488;0.0000;0.0000;0.0000;2;-0.2500;-0.4000;0.3350;0.0000;0.0000;0.0000;3;-0.1216;-0.0858;0.3488;0.0000;0.0000;0.0000;0;False;1
119.3792;2;0;-0.5290;-0.0600;0.3410;0.0000;0.0000;0.0000;1;-0.1216;-0.0858;0.3488;0.0000;0.0000;0.0000;2;-0.2500;-0.4000;0.3350;0.0000;0.0000;0.0000;3;-0.1216;-0.0858;0.3488;0.0000;0.0000;0.0000;0;False;1
119.5758;2;0;-0.5290;-0.0600;0.3410;0.0000;0.0000;0.0000;1;-0.1216;-0.0858;0.3488;0.0000;0.0000;0.0000;2;-0.2500;-0.4000;0.3350;0.0000;0.0000;0.0000;3;-0.1216;-0.0858;0.3488;0.0000;0.0000;0.0000;0;False;1
119.6636;2;0;-0.5290;-0.0600;0.3410;0.0000;0.0000;0.0000;1;-0.1216;-0.0858;0.3488;0.0000;0.0000;0.0000;2;-0.2500;-0.4000;0.3350;0.0000;0.0000;0.0000;3;-0.1216;-0.0858;0.3488;0.0000;0.0000;0.0000;0;False;1
119.8222;2;0;-0.5290;-0.0600;0.3410;0.0000;0.0000;0.0000;1;-0.1216;-0.0858;0.3488;0.0000;0.0000;0.0000;2;-0.2500;-0.4000;0.3350;0.0000;0.0000;0.0000;3;-0.1216;-0.0858;0.3488;0.0000;0.0000;0.0000;0;False;1
120.041;2;0;-0.5290;-0.0600;0.3410;0.0000;0.0000;0.0000;1;-0.1216;-0.0858;0.3488;0.0000;0.0000;0.0000;2;-0.2500;-0.4000;0.3350;0.0000;0.0000;0.0000;3;-0.1216;-0.0858;0.3488;0.0000;0.0000;0.0000;0;False;1
120.2657;2;0;-0.5290;-0.0600;0.3410;0.0000;0.0000;0.0000;1;-0.1216;-0.0858;0.3488;0.0000;0.0000;0.0000;2;-0.2500;-0.4000;0.3350;0.0000;0.0000;0.0000;3;-0.1216;-0.0858;0.3488;0.0000;0.0000;0.0000;0;False;1
120.4889;2;0;-0.5290;-0.0600;0.3410;0.0000;0.0000;0.0000;1;-0.1216;-0.0858;0.3488;0.0000;0.0000;0.0000;2;-0.2500;-0.4000;0.3350;0.0000;0.0000;0.0000;3;-0.1216;-0.0858;0.3488;0.0000;0.0000;0.0000;0;False;1
120.7112;2;0;-0.5290;-0.0600;0.3410;0.0000;0.0000;0.0000;1;-0.1216;-0.0858;0.3488;0.0000;0.0000;0.0000;2;-0.2500;-0.4000;0.3350;0.0000;0.0000;0.0000;3;-0.1216;-0.0858;0.3488;0.0000;0.0000;0.0000;0;False;1
120.9373;2;0;-0.5290;-0.0600;0.3410;0.0000;0.0000;0.0000;1;-0.1216;-0.0858;0.3488;0.0000;0.0000;0.0000;2;-0.2500;-0.4000;0.3350;0.0000;0.0000;0.0000;3;-0.1216;-0.0858;0.3488;0.0000;0.0000;0.0000;0;False;1
121.1609;2;0;-0.5290;-0.0600;0.3410;0.0000;0.0000;0.0000;1;-0.1216;-0.0858;0.3488;0.0000;0.0000;0.0000;2;-0.2500;-0.4000;0.3350;0.0000;0.0000;0.0000;3;-0.1216;-0.0858;0.3488;0.0000;0.0000;0.0000;0;False;1
121.3852;2;0;-0.5290;-0.0600;0.3410;0.0000;0.0000;0.0000;1;-0.1216;-0.0858;0.3488;0.0000;0.0000;0.0000;2;-0.2500;-0.4000;0.3350;0.0000;0.0000;0.0000;3;-0.1216;-0.0858;0.3488;0.0000;0.0000;0.0000;0;False;1
121.6078;2;0;-0.5290;-0.0600;0.3410;0.0000;0.0000;0.0000;1;-0.1216;-0.0858;0.3488;0.0000;0.0000;0.0000;2;-0.2500;-0.4000;0.3350;0.0000;0.0000;0.0000;3;-0.1216;-0.0858;0.3488;0.0000;0.0000;0.0000;0;False;1
121.832;2;0;-0.5290;-0.0600;0.3410;0.0000;0.0000;0.0000;1;-0.1216;-0.0858;0.3488;0.0000;0.0000;0.0000;2;-0.2500;-0.4000;0.3350;0.0000;0.0000;0.0000;3;-0.1216;-0.0858;0.3488;0.0000;0.0000;0.0000;0;False;1
122.0589;2;0;-0.5290;-0.0600;0.3410;0.0000;0.0000;0.0000;1;-0.1216;-0.0858;0.3488;0.0000;0.0000;0.0000;2;-0.2500;-0.4000;0.3350;0.0000;0.0000;0.0000;3;-0.1216;-0.0858;0.3488;0.0000;0.0000;0.0000;0;False;1
122.2852;2;0;-0.5290;-0.0600;0.3410;0.0000;0.0000;0.0000;1;-0.1216;-0.0858;0.3488;0.0000;0.0000;0.0000;2;-0.2500;-0.4000;0.3350;0.0000;0.0000;0.0000;3;-0.1216;-0.0858;0.3488;0.0000;0.0000;0.0000;0;False;1
122.5072;2;0;-0.5290;-0.0600;0.3410;0.0000;0.0000;0.0000;1;-0.1216;-0.0858;0.3488;0.0000;0.0000;0.0000;2;-0.2500;-0.4000;0.3350;0.0000;0.0000;0.0000;3;-0.1216;-0.0858;0.3488;0.0000;0.0000;0.0000;0;False;1
122.7292;2;0;-0.5290;-0.0600;0.3410;0.0000;0.0000;0.0000;1;-0.1216;-0.0858;0.3488;0.0000;0.0000;0.0000;2;-0.2500;-0.4000;0.3350;0.0000;0.0000;0.0000;3;-0.1216;-0.0858;0.3488;0.0000;0.0000;0.0000;0;False;1
122.9557;2;0;-0.5290;-0.0600;0.3410;0.0000;0.0000;0.0000;1;-0.1216;-0.0858;0.3488;0.0000;0.0000;0.0000;2;-0.2500;-0.4000;0.3350;0.0000;0.0000;0.0000;3;-0.1216;-0.0858;0.3488;0.0000;0.0000;0.0000;0;False;1
123.1876;2;0;-0.5290;-0.0600;0.3410;0.0000;0.0000;0.0000;1;-0.1216;-0.0858;0.3488;0.0000;0.0000;0.0000;2;-0.2500;-0.4000;0.3350;0.0000;0.0000;0.0000;3;-0.1216;-0.0858;0.3488;0.0000;0.0000;0.0000;0;False;1
123.4118;2;0;-0.5290;-0.0600;0.3410;0.0000;0.0000;0.0000;1;-0.1216;-0.0858;0.3488;0.0000;0.0000;0.0000;2;-0.2500;-0.4000;0.3350;0.0000;0.0000;0.0000;3;-0.1216;-0.0858;0.3488;0.0000;0.0000;0.0000;0;False;1
123.6363;2;0;-0.5290;-0.0600;0.3410;0.0000;0.0000;0.0000;1;-0.1216;-0.0858;0.3488;0.0000;0.0000;0.0000;2;-0.2500;-0.4000;0.3350;0.0000;0.0000;0.0000;3;-0.1216;-0.0858;0.3488;0.0000;0.0000;0.0000;0;False;1
123.8609;2;0;-0.5290;-0.0600;0.3410;0.0000;0.0000;0.0000;1;-0.1216;-0.0858;0.3488;0.0000;0.0000;0.0000;2;-0.2500;-0.4000;0.3350;0.0000;0.0000;0.0000;3;-0.1216;-0.0858;0.3488;0.0000;0.0000;0.0000;0;False;1
124.0837;2;0;-0.5290;-0.0600;0.3410;0.0000;0.0000;0.0000;1;-0.1216;-0.0858;0.3488;0.0000;0.0000;0.0000;2;-0.2500;-0.4000;0.3350;0.0000;0.0000;0.0000;3;-0.1216;-0.0858;0.3488;0.0000;0.0000;0.0000;0;False;1
124.3058;2;0;-0.5290;-0.0600;0.3410;0.0000;0.0000;0.0000;1;-0.1216;-0.0858;0.3488;0.0000;0.0000;0.0000;2;-0.2500;-0.4000;0.3350;0.0000;0.0000;0.0000;3;-0.1216;-0.0858;0.3488;0.0000;0.0000;0.0000;0;False;1
124.5271;2;0;-0.5290;-0.0600;0.3410;0.0000;0.0000;0.0000;1;-0.1216;-0.0858;0.3488;0.0000;0.0000;0.0000;2;-0.2500;-0.4000;0.3350;0.0000;0.0000;0.0000;3;-0.1216;-0.0858;0.3488;0.0000;0.0000;0.0000;0;False;1
124.751;2;0;-0.5290;-0.0600;0.3410;0.0000;0.0000;0.0000;1;-0.1216;-0.0858;0.3488;0.0000;0.0000;0.0000;2;-0.2500;-0.4000;0.3350;0.0000;0.0000;0.0000;3;-0.1216;-0.0858;0.3488;0.0000;0.0000;0.0000;0;False;1
124.9732;2;0;-0.5290;-0.0600;0.3410;0.0000;0.0000;0.0000;1;-0.1216;-0.0858;0.3488;0.0000;0.0000;0.0000;2;-0.2500;-0.4000;0.3350;0.0000;0.0000;0.0000;3;-0.1216;-0.0858;0.3488;0.0000;0.0000;0.0000;0;False;1
125.1959;2;0;-0.5290;-0.0600;0.3410;0.0000;0.0000;0.0000;1;-0.1216;-0.0858;0.3488;0.0000;0.0000;0.0000;2;-0.2500;-0.4000;0.3350;0.0000;0.0000;0.0000;3;-0.1216;-0.0858;0.3488;0.0000;0.0000;0.0000;0;False;1
125.4223;2;0;-0.5290;-0.0600;0.3410;0.0000;0.0000;0.0000;1;-0.1216;-0.0858;0.3488;0.0000;0.0000;0.0000;2;-0.2500;-0.4000;0.3350;0.0000;0.0000;0.0000;3;-0.1216;-0.0858;0.3488;0.0000;0.0000;0.0000;0;False;1
125.6462;2;0;-0.5290;-0.0600;0.3410;0.0000;0.0000;0.0000;1;-0.1216;-0.0858;0.3488;0.0000;0.0000;0.0000;2;-0.2500;-0.4000;0.3350;0.0000;0.0000;0.0000;3;-0.1216;-0.0858;0.3488;0.0000;0.0000;0.0000;0;False;1
125.8714;2;0;-0.5290;-0.0600;0.3410;0.0000;0.0000;0.0000;1;-0.1216;-0.0858;0.3488;0.0000;0.0000;0.0000;2;-0.2500;-0.4000;0.3350;0.0000;0.0000;0.0000;3;-0.1216;-0.0858;0.3488;0.0000;0.0000;0.0000;0;False;1
126.0982;2;0;-0.5290;-0.0600;0.3410;0.0000;0.0000;0.0000;1;-0.1216;-0.0858;0.3488;0.0000;0.0000;0.0000;2;-0.2500;-0.4000;0.3350;0.0000;0.0000;0.0000;3;-0.1216;-0.0858;0.3488;0.0000;0.0000;0.0000;0;False;1
126.3275;2;0;-0.5290;-0.0600;0.3410;0.0000;0.0000;0.0000;1;-0.1216;-0.0858;0.3488;0.0000;0.0000;0.0000;2;-0.2500;-0.4000;0.3350;0.0000;0.0000;0.0000;3;-0.1216;-0.0858;0.3488;0.0000;0.0000;0.0000;0;False;1
126.5528;2;0;-0.5290;-0.0600;0.3410;0.0000;0.0000;0.0000;1;-0.1216;-0.0858;0.3488;0.0000;0.0000;0.0000;2;-0.2500;-0.4000;0.3350;0.0000;0.0000;0.0000;3;-0.1216;-0.0858;0.3488;0.0000;0.0000;0.0000;0;False;1
126.7814;2;0;-0.5290;-0.0600;0.3410;0.0000;0.0000;0.0000;1;-0.1216;-0.0858;0.3488;0.0000;0.0000;0.0000;2;-0.2500;-0.4000;0.3350;0.0000;0.0000;0.0000;3;-0.1216;-0.0858;0.3488;0.0000;0.0000;0.0000;0;False;1
127.0073;2;0;-0.5290;-0.0600;0.3410;0.0000;0.0000;0.0000;1;-0.1216;-0.0858;0.3488;0.0000;0.0000;0.0000;2;-0.2500;-0.4000;0.3350;0.0000;0.0000;0.0000;3;-0.1216;-0.0858;0.3488;0.0000;0.0000;0.0000;0;False;1
127.2322;2;0;-0.5290;-0.0600;0.3410;0.0000;0.0000;0.0000;1;-0.1216;-0.0858;0.3488;0.0000;0.0000;0.0000;2;-0.2500;-0.4000;0.3350;0.0000;0.0000;0.0000;3;-0.1216;-0.0858;0.3488;0.0000;0.0000;0.0000;0;False;1
127.4582;2;0;-0.5290;-0.0600;0.3410;0.0000;0.0000;0.0000;1;-0.1216;-0.0858;0.3488;0.0000;0.0000;0.0000;2;-0.2500;-0.4000;0.3350;0.0000;0.0000;0.0000;3;-0.1216;-0.0858;0.3488;0.0000;0.0000;0.0000;0;False;1
127.6831;2;0;-0.5290;-0.0600;0.3410;0.0000;0.0000;0.0000;1;-0.1216;-0.0858;0.3488;0.0000;0.0000;0.0000;2;-0.2500;-0.4000;0.3350;0.0000;0.0000;0.0000;3;-0.1216;-0.0858;0.3488;0.0000;0.0000;0.0000;0;False;1
127.9059;2;0;-0.5290;-0.0600;0.3410;0.0000;0.0000;0.0000;1;-0.1216;-0.0858;0.3488;0.0000;0.0000;0.0000;2;-0.2500;-0.4000;0.3350;0.0000;0.0000;0.0000;3;-0.1216;-0.0858;0.3488;0.0000;0.0000;0.0000;0;False;1
128.1307;2;0;-0.5290;-0.0600;0.3410;0.0000;0.0000;0.0000;1;-0.1216;-0.0858;0.3488;0.0000;0.0000;0.0000;2;-0.2500;-0.4000;0.3350;0.0000;0.0000;0.0000;3;-0.1216;-0.0858;0.3488;0.0000;0.0000;0.0000;0;False;1
128.3553;2;0;-0.5290;-0.0600;0.3410;0.0000;0.0000;0.0000;1;-0.1216;-0.0858;0.3488;0.0000;0.0000;0.0000;2;-0.2500;-0.4000;0.3350;0.0000;0.0000;0.0000;3;-0.1216;-0.0858;0.3488;0.0000;0.0000;0.0000;0;False;1
128.5793;2;0;-0.5290;-0.0600;0.3410;0.0000;0.0000;0.0000;1;-0.1216;-0.0858;0.3488;0.0000;0.0000;0.0000;2;-0.2500;-0.4000;0.3350;0.0000;0.0000;0.0000;3;-0.1216;-0.0858;0.3488;0.0000;0.0000;0.0000;0;False;1
128.8019;2;0;-0.5290;-0.0600;0.3410;0.0000;0.0000;0.0000;1;-0.1216;-0.0858;0.3488;0.0000;0.0000;0.0000;2;-0.2500;-0.4000;0.3350;0.0000;0.0000;0.0000;3;-0.1216;-0.0858;0.3488;0.0000;0.0000;0.0000;0;False;1
129.0259;2;0;-0.5290;-0.0600;0.3410;0.0000;0.0000;0.0000;1;-0.1216;-0.0858;0.3488;0.0000;0.0000;0.0000;2;-0.2500;-0.4000;0.3350;0.0000;0.0000;0.0000;3;-0.1216;-0.0858;0.3488;0.0000;0.0000;0.0000;0;False;1
129.253;2;0;-0.5290;-0.0600;0.3410;0.0000;0.0000;0.0000;1;-0.1216;-0.0858;0.3488;0.0000;0.0000;0.0000;2;-0.2500;-0.4000;0.3350;0.0000;0.0000;0.0000;3;-0.1216;-0.0858;0.3488;0.0000;0.0000;0.0000;0;False;1
129.4766;2;0;-0.5290;-0.0600;0.3410;0.0000;0.0000;0.0000;1;-0.1216;-0.0858;0.3488;0.0000;0.0000;0.0000;2;-0.2500;-0.4000;0.3350;0.0000;0.0000;0.0000;3;-0.1216;-0.0858;0.3488;0.0000;0.0000;0.0000;0;False;1
129.7008;2;0;-0.5290;-0.0600;0.3410;0.0000;0.0000;0.0000;1;-0.1216;-0.0858;0.3488;0.0000;0.0000;0.0000;2;-0.2500;-0.4000;0.3350;0.0000;0.0000;0.0000;3;-0.1216;-0.0858;0.3488;0.0000;0.0000;0.0000;0;False;1
129.9225;2;0;-0.5290;-0.0600;0.3410;0.0000;0.0000;0.0000;1;-0.1216;-0.0858;0.3488;0.0000;0.0000;0.0000;2;-0.2500;-0.4000;0.3350;0.0000;0.0000;0.0000;3;-0.1216;-0.0858;0.3488;0.0000;0.0000;0.0000;0;False;1
130.1467;2;0;-0.5290;-0.0600;0.3410;0.0000;0.0000;0.0000;1;-0.1216;-0.0858;0.3488;0.0000;0.0000;0.0000;2;-0.2500;-0.4000;0.3350;0.0000;0.0000;0.0000;3;-0.1216;-0.0858;0.3488;0.0000;0.0000;0.0000;0;False;1
130.3703;2;0;-0.5290;-0.0600;0.3410;0.0000;0.0000;0.0000;1;-0.1216;-0.0858;0.3488;0.0000;0.0000;0.0000;2;-0.2500;-0.4000;0.3350;0.0000;0.0000;0.0000;3;-0.1216;-0.0858;0.3488;0.0000;0.0000;0.0000;0;False;1
130.5922;2;0;-0.5290;-0.0600;0.3410;0.0000;0.0000;0.0000;1;-0.1216;-0.0858;0.3488;0.0000;0.0000;0.0000;2;-0.2500;-0.4000;0.3350;0.0000;0.0000;0.0000;3;-0.1216;-0.0858;0.3488;0.0000;0.0000;0.0000;0;False;1
130.8161;2;0;-0.5290;-0.0600;0.3410;0.0000;0.0000;0.0000;1;-0.1216;-0.0858;0.3488;0.0000;0.0000;0.0000;2;-0.2500;-0.4000;0.3350;0.0000;0.0000;0.0000;3;-0.1216;-0.0858;0.3488;0.0000;0.0000;0.0000;0;False;1
131.0402;2;0;-0.5290;-0.0600;0.3410;0.0000;0.0000;0.0000;1;-0.1216;-0.0858;0.3488;0.0000;0.0000;0.0000;2;-0.2500;-0.4000;0.3350;0.0000;0.0000;0.0000;3;-0.1216;-0.0858;0.3488;0.0000;0.0000;0.0000;0;False;1
131.2617;2;0;-0.5290;-0.0600;0.3410;0.0000;0.0000;0.0000;1;-0.1216;-0.0858;0.3488;0.0000;0.0000;0.0000;2;-0.2500;-0.4000;0.3350;0.0000;0.0000;0.0000;3;-0.1216;-0.0858;0.3488;0.0000;0.0000;0.0000;0;False;1
131.485;2;0;-0.5290;-0.0600;0.3410;0.0000;0.0000;0.0000;1;-0.1216;-0.0858;0.3488;0.0000;0.0000;0.0000;2;-0.2500;-0.4000;0.3350;0.0000;0.0000;0.0000;3;-0.1216;-0.0858;0.3488;0.0000;0.0000;0.0000;0;False;1
131.7066;2;0;-0.5290;-0.0600;0.3410;0.0000;0.0000;0.0000;1;-0.1216;-0.0858;0.3488;0.0000;0.0000;0.0000;2;-0.2500;-0.4000;0.3350;0.0000;0.0000;0.0000;3;-0.1216;-0.0858;0.3488;0.0000;0.0000;0.0000;0;False;1
131.9298;2;0;-0.5290;-0.0600;0.3410;0.0000;0.0000;0.0000;1;-0.1216;-0.0858;0.3488;0.0000;0.0000;0.0000;2;-0.2500;-0.4000;0.3350;0.0000;0.0000;0.0000;3;-0.1216;-0.0858;0.3488;0.0000;0.0000;0.0000;0;False;1
132.1521;2;0;-0.5290;-0.0600;0.3410;0.0000;0.0000;0.0000;1;-0.1216;-0.0858;0.3488;0.0000;0.0000;0.0000;2;-0.2500;-0.4000;0.3350;0.0000;0.0000;0.0000;3;-0.1216;-0.0858;0.3488;0.0000;0.0000;0.0000;0;False;1
132.3766;2;0;-0.5290;-0.0600;0.3410;0.0000;0.0000;0.0000;1;-0.1216;-0.0858;0.3488;0.0000;0.0000;0.0000;2;-0.2500;-0.4000;0.3350;0.0000;0.0000;0.0000;3;-0.1216;-0.0858;0.3488;0.0000;0.0000;0.0000;0;False;1
132.6018;2;0;-0.5290;-0.0600;0.3410;0.0000;0.0000;0.0000;1;-0.1216;-0.0858;0.3488;0.0000;0.0000;0.0000;2;-0.2500;-0.4000;0.3350;0.0000;0.0000;0.0000;3;-0.1216;-0.0858;0.3488;0.0000;0.0000;0.0000;0;False;1
132.8254;2;0;-0.5290;-0.0600;0.3410;0.0000;0.0000;0.0000;1;-0.1216;-0.0858;0.3488;0.0000;0.0000;0.0000;2;-0.2500;-0.4000;0.3350;0.0000;0.0000;0.0000;3;-0.1216;-0.0858;0.3488;0.0000;0.0000;0.0000;0;False;1
133.0514;2;0;-0.5290;-0.0600;0.3410;0.0000;0.0000;0.0000;1;-0.1216;-0.0858;0.3488;0.0000;0.0000;0.0000;2;-0.2500;-0.4000;0.3350;0.0000;0.0000;0.0000;3;-0.1216;-0.0858;0.3488;0.0000;0.0000;0.0000;0;False;1
133.2789;2;0;-0.5290;-0.0600;0.3410;0.0000;0.0000;0.0000;1;-0.1216;-0.0858;0.3488;0.0000;0.0000;0.0000;2;-0.2500;-0.4000;0.3350;0.0000;0.0000;0.0000;3;-0.1216;-0.0858;0.3488;0.0000;0.0000;0.0000;0;False;1
133.514;2;0;-0.5290;-0.0600;0.3410;0.0000;0.0000;0.0000;1;-0.1216;-0.0858;0.3488;0.0000;0.0000;0.0000;2;-0.2500;-0.4000;0.3350;0.0000;0.0000;0.0000;3;-0.1216;-0.0858;0.3488;0.0000;0.0000;0.0000;0;False;1
133.7225;2;0;-0.5290;-0.0600;0.3410;0.0000;0.0000;0.0000;1;-0.1216;-0.0858;0.3488;0.0000;0.0000;0.0000;2;-0.2500;-0.4000;0.3350;0.0000;0.0000;0.0000;3;-0.1216;-0.0858;0.3488;0.0000;0.0000;0.0000;0;False;1
133.9338;2;0;-0.5290;-0.0600;0.3410;0.0000;0.0000;0.0000;1;-0.1216;-0.0858;0.3488;0.0000;0.0000;0.0000;2;-0.2500;-0.4000;0.3350;0.0000;0.0000;0.0000;3;-0.1216;-0.0858;0.3488;0.0000;0.0000;0.0000;0;False;1
134.1395;2;0;-0.5290;-0.0600;0.3410;0.0000;0.0000;0.0000;1;-0.1216;-0.0858;0.3488;0.0000;0.0000;0.0000;2;-0.2500;-0.4000;0.3350;0.0000;0.0000;0.0000;3;-0.1216;-0.0858;0.3488;0.0000;0.0000;0.0000;0;False;1
134.3595;2;0;-0.5290;-0.0600;0.3410;0.0000;0.0000;0.0000;1;-0.1216;-0.0858;0.3488;0.0000;0.0000;0.0000;2;-0.2500;-0.4000;0.3350;0.0000;0.0000;0.0000;3;-0.1216;-0.0858;0.3488;0.0000;0.0000;0.0000;0;False;1
134.5926;2;0;-0.5290;-0.0600;0.3410;0.0000;0.0000;0.0000;1;-0.1216;-0.0858;0.3488;0.0000;0.0000;0.0000;2;-0.2500;-0.4000;0.3350;0.0000;0.0000;0.0000;3;-0.1216;-0.0858;0.3488;0.0000;0.0000;0.0000;0;False;1
134.8238;2;0;-0.5290;-0.0600;0.3410;0.0000;0.0000;0.0000;1;-0.1216;-0.0858;0.3488;0.0000;0.0000;0.0000;2;-0.2500;-0.4000;0.3350;0.0000;0.0000;0.0000;3;-0.1216;-0.0858;0.3488;0.0000;0.0000;0.0000;0;False;1
135.0544;2;0;-0.5290;-0.0600;0.3410;0.0000;0.0000;0.0000;1;-0.1216;-0.0858;0.3488;0.0000;0.0000;0.0000;2;-0.2500;-0.4000;0.3350;0.0000;0.0000;0.0000;3;-0.1216;-0.0858;0.3488;0.0000;0.0000;0.0000;0;False;1
135.3011;2;0;-0.5290;-0.0600;0.3410;0.0000;0.0000;0.0000;1;-0.1216;-0.0858;0.3488;0.0000;0.0000;0.0000;2;-0.2500;-0.4000;0.3350;0.0000;0.0000;0.0000;3;-0.1216;-0.0858;0.3488;0.0000;0.0000;0.0000;0;False;1
135.5554;2;0;-0.5290;-0.0600;0.3410;0.0000;0.0000;0.0000;1;-0.1216;-0.0858;0.3488;0.0000;0.0000;0.0000;2;-0.2500;-0.4000;0.3350;0.0000;0.0000;0.0000;3;-0.1216;-0.0858;0.3488;0.0000;0.0000;0.0000;0;False;1
135.8133;2;0;-0.5290;-0.0600;0.3410;0.0000;0.0000;0.0000;1;-0.1216;-0.0858;0.3488;0.0000;0.0000;0.0000;2;-0.2500;-0.4000;0.3350;0.0000;0.0000;0.0000;3;-0.1216;-0.0858;0.3488;0.0000;0.0000;0.0000;0;False;1
136.0728;2;0;-0.5290;-0.0600;0.3410;0.0000;0.0000;0.0000;1;-0.1216;-0.0858;0.3488;0.0000;0.0000;0.0000;2;-0.2500;-0.4000;0.3350;0.0000;0.0000;0.0000;3;-0.1216;-0.0858;0.3488;0.0000;0.0000;0.0000;0;False;1
136.3245;2;0;-0.5290;-0.0600;0.3410;0.0000;0.0000;0.0000;1;-0.1216;-0.0858;0.3488;0.0000;0.0000;0.0000;2;-0.2500;-0.4000;0.3350;0.0000;0.0000;0.0000;3;-0.1216;-0.0858;0.3488;0.0000;0.0000;0.0000;0;False;1
136.5631;2;0;-0.5290;-0.0600;0.3410;0.0000;0.0000;0.0000;1;-0.1216;-0.0858;0.3488;0.0000;0.0000;0.0000;2;-0.2500;-0.4000;0.3350;0.0000;0.0000;0.0000;3;-0.1216;-0.0858;0.3488;0.0000;0.0000;0.0000;0;False;1
136.8002;2;0;-0.5290;-0.0600;0.3410;0.0000;0.0000;0.0000;1;-0.1216;-0.0858;0.3488;0.0000;0.0000;0.0000;2;-0.2500;-0.4000;0.3350;0.0000;0.0000;0.0000;3;-0.1216;-0.0858;0.3488;0.0000;0.0000;0.0000;0;False;1
137.0599;2;0;-0.5290;-0.0600;0.3410;0.0000;0.0000;0.0000;1;-0.1216;-0.0858;0.3488;0.0000;0.0000;0.0000;2;-0.2500;-0.4000;0.3350;0.0000;0.0000;0.0000;3;-0.1216;-0.0858;0.3488;0.0000;0.0000;0.0000;0;False;1
137.3221;2;0;-0.5290;-0.0600;0.3410;0.0000;0.0000;0.0000;1;-0.1216;-0.0858;0.3488;0.0000;0.0000;0.0000;2;-0.2500;-0.4000;0.3350;0.0000;0.0000;0.0000;3;-0.1216;-0.0858;0.3488;0.0000;0.0000;0.0000;0;False;1
137.5848;2;0;-0.5290;-0.0600;0.3410;0.0000;0.0000;0.0000;1;-0.1216;-0.0858;0.3488;0.0000;0.0000;0.0000;2;-0.2500;-0.4000;0.3350;0.0000;0.0000;0.0000;3;-0.1216;-0.0858;0.3488;0.0000;0.0000;0.0000;0;False;1
137.8496;2;0;-0.5290;-0.0600;0.3410;0.0000;0.0000;0.0000;1;-0.1216;-0.0858;0.3488;0.0000;0.0000;0.0000;2;-0.2500;-0.4000;0.3350;0.0000;0.0000;0.0000;3;-0.1216;-0.0858;0.3488;0.0000;0.0000;0.0000;0;False;1
138.1162;2;0;-0.5290;-0.0600;0.3410;0.0000;0.0000;0.0000;1;-0.1216;-0.0858;0.3488;0.0000;0.0000;0.0000;2;-0.2500;-0.4000;0.3350;0.0000;0.0000;0.0000;3;-0.1216;-0.0858;0.3488;0.0000;0.0000;0.0000;0;False;1
138.3808;2;0;-0.5290;-0.0600;0.3410;0.0000;0.0000;0.0000;1;-0.1216;-0.0858;0.3488;0.0000;0.0000;0.0000;2;-0.2500;-0.4000;0.3350;0.0000;0.0000;0.0000;3;-0.1216;-0.0858;0.3488;0.0000;0.0000;0.0000;0;False;1
138.6441;2;0;-0.5290;-0.0600;0.3410;0.0000;0.0000;0.0000;1;-0.1216;-0.0858;0.3488;0.0000;0.0000;0.0000;2;-0.2500;-0.4000;0.3350;0.0000;0.0000;0.0000;3;-0.1216;-0.0858;0.3488;0.0000;0.0000;0.0000;0;False;1
138.9088;2;0;-0.5290;-0.0600;0.3410;0.0000;0.0000;0.0000;1;-0.1216;-0.0858;0.3488;0.0000;0.0000;0.0000;2;-0.2500;-0.4000;0.3350;0.0000;0.0000;0.0000;3;-0.1216;-0.0858;0.3488;0.0000;0.0000;0.0000;0;False;1
139.114;2;0;-0.5290;-0.0600;0.3410;0.0000;0.0000;0.0000;1;-0.1216;-0.0858;0.3488;0.0000;0.0000;0.0000;2;-0.2500;-0.4000;0.3350;0.0000;0.0000;0.0000;3;-0.1216;-0.0858;0.3488;0.0000;0.0000;0.0000;0;False;1
139.2172;2;0;-0.5290;-0.0600;0.3410;0.0000;0.0000;0.0000;1;-0.1216;-0.0858;0.3488;0.0000;0.0000;0.0000;2;-0.2500;-0.4000;0.3350;0.0000;0.0000;0.0000;3;-0.1216;-0.0858;0.3488;0.0000;0.0000;0.0000;0;False;1
139.3293;2;0;-0.5290;-0.0600;0.3410;0.0000;0.0000;0.0000;1;-0.1216;-0.0858;0.3488;0.0000;0.0000;0.0000;2;-0.2500;-0.4000;0.3350;0.0000;0.0000;0.0000;3;-0.1216;-0.0858;0.3488;0.0000;0.0000;0.0000;0;False;1
139.4406;2;0;-0.5290;-0.0600;0.3410;0.0000;0.0000;0.0000;1;-0.1216;-0.0858;0.3488;0.0000;0.0000;0.0000;2;-0.2500;-0.4000;0.3350;0.0000;0.0000;0.0000;3;-0.1216;-0.0858;0.3488;0.0000;0.0000;0.0000;0;False;1
139.552;2;0;-0.5290;-0.0600;0.3410;0.0000;0.0000;0.0000;1;-0.1216;-0.0858;0.3488;0.0000;0.0000;0.0000;2;-0.2500;-0.4000;0.3350;0.0000;0.0000;0.0000;3;-0.1216;-0.0858;0.3488;0.0000;0.0000;0.0000;0;False;1
139.6655;2;0;-0.5290;-0.0600;0.3410;0.0000;0.0000;0.0000;1;-0.1216;-0.0858;0.3488;0.0000;0.0000;0.0000;2;-0.2500;-0.4000;0.3350;0.0000;0.0000;0.0000;3;-0.1216;-0.0858;0.3488;0.0000;0.0000;0.0000;0;False;1
139.7781;2;0;-0.5290;-0.0600;0.3410;0.0000;0.0000;0.0000;1;-0.1216;-0.0858;0.3488;0.0000;0.0000;0.0000;2;-0.2500;-0.4000;0.3350;0.0000;0.0000;0.0000;3;-0.1216;-0.0858;0.3488;0.0000;0.0000;0.0000;0;False;1
139.8901;2;0;-0.5290;-0.0600;0.3410;0.0000;0.0000;0.0000;1;-0.1216;-0.0858;0.3488;0.0000;0.0000;0.0000;2;-0.2500;-0.4000;0.3350;0.0000;0.0000;0.0000;3;-0.1216;-0.0858;0.3488;0.0000;0.0000;0.0000;0;False;1
140.0013;2;0;-0.5290;-0.0600;0.3410;0.0000;0.0000;0.0000;1;-0.1216;-0.0858;0.3488;0.0000;0.0000;0.0000;2;-0.2500;-0.4000;0.3350;0.0000;0.0000;0.0000;3;-0.1216;-0.0858;0.3488;0.0000;0.0000;0.0000;0;False;1
140.1145;2;0;-0.5290;-0.0600;0.3410;0.0000;0.0000;0.0000;1;-0.1216;-0.0858;0.3488;0.0000;0.0000;0.0000;2;-0.2500;-0.4000;0.3350;0.0000;0.0000;0.0000;3;-0.1216;-0.0858;0.3488;0.0000;0.0000;0.0000;0;False;1
140.2258;2;0;-0.5290;-0.0600;0.3410;0.0000;0.0000;0.0000;1;-0.1216;-0.0858;0.3488;0.0000;0.0000;0.0000;2;-0.2500;-0.4000;0.3350;0.0000;0.0000;0.0000;3;-0.1216;-0.0858;0.3488;0.0000;0.0000;0.0000;0;False;1
140.3372;2;0;-0.5290;-0.0600;0.3410;0.0000;0.0000;0.0000;1;-0.1216;-0.0858;0.3488;0.0000;0.0000;0.0000;2;-0.2500;-0.4000;0.3350;0.0000;0.0000;0.0000;3;-0.1216;-0.0858;0.3488;0.0000;0.0000;0.0000;0;False;1
140.4487;2;0;-0.5290;-0.0600;0.3410;0.0000;0.0000;0.0000;1;-0.1216;-0.0858;0.3488;0.0000;0.0000;0.0000;2;-0.2500;-0.4000;0.3350;0.0000;0.0000;0.0000;3;-0.1216;-0.0858;0.3488;0.0000;0.0000;0.0000;0;False;1
140.5607;2;0;-0.5290;-0.0600;0.3410;0.0000;0.0000;0.0000;1;-0.1216;-0.0858;0.3488;0.0000;0.0000;0.0000;2;-0.2500;-0.4000;0.3350;0.0000;0.0000;0.0000;3;-0.1216;-0.0858;0.3488;0.0000;0.0000;0.0000;0;False;1
140.6737;2;0;-0.5290;-0.0600;0.3410;0.0000;0.0000;0.0000;1;-0.1216;-0.0858;0.3488;0.0000;0.0000;0.0000;2;-0.2500;-0.4000;0.3350;0.0000;0.0000;0.0000;3;-0.1216;-0.0858;0.3488;0.0000;0.0000;0.0000;0;False;1
140.7854;2;0;-0.5290;-0.0600;0.3410;0.0000;0.0000;0.0000;1;-0.1216;-0.0858;0.3488;0.0000;0.0000;0.0000;2;-0.2500;-0.4000;0.3350;0.0000;0.0000;0.0000;3;-0.1216;-0.0858;0.3488;0.0000;0.0000;0.0000;0;False;1
140.8968;2;0;-0.5290;-0.0600;0.3410;0.0000;0.0000;0.0000;1;-0.1216;-0.0858;0.3488;0.0000;0.0000;0.0000;2;-0.2500;-0.4000;0.3350;0.0000;0.0000;0.0000;3;-0.1216;-0.0858;0.3488;0.0000;0.0000;0.0000;0;False;1
141.0084;2;0;-0.5290;-0.0600;0.3410;0.0000;0.0000;0.0000;1;-0.1216;-0.0858;0.3488;0.0000;0.0000;0.0000;2;-0.2500;-0.4000;0.3350;0.0000;0.0000;0.0000;3;-0.1216;-0.0858;0.3488;0.0000;0.0000;0.0000;0;False;1
141.1199;2;0;-0.5290;-0.0600;0.3410;0.0000;0.0000;0.0000;1;-0.1216;-0.0858;0.3488;0.0000;0.0000;0.0000;2;-0.2500;-0.4000;0.3350;0.0000;0.0000;0.0000;3;-0.1216;-0.0858;0.3488;0.0000;0.0000;0.0000;0;False;1
141.2313;2;0;-0.5290;-0.0600;0.3410;0.0000;0.0000;0.0000;1;-0.1216;-0.0858;0.3488;0.0000;0.0000;0.0000;2;-0.2500;-0.4000;0.3350;0.0000;0.0000;0.0000;3;-0.1216;-0.0858;0.3488;0.0000;0.0000;0.0000;0;False;1
141.3428;2;0;-0.5290;-0.0600;0.3410;0.0000;0.0000;0.0000;1;-0.1216;-0.0858;0.3488;0.0000;0.0000;0.0000;2;-0.2500;-0.4000;0.3350;0.0000;0.0000;0.0000;3;-0.1216;-0.0858;0.3488;0.0000;0.0000;0.0000;0;False;1
141.4538;2;0;-0.5290;-0.0600;0.3410;0.0000;0.0000;0.0000;1;-0.1216;-0.0858;0.3488;0.0000;0.0000;0.0000;2;-0.2500;-0.4000;0.3350;0.0000;0.0000;0.0000;3;-0.1216;-0.0858;0.3488;0.0000;0.0000;0.0000;0;False;1
141.5648;2;0;-0.5290;-0.0600;0.3410;0.0000;0.0000;0.0000;1;-0.1216;-0.0858;0.3488;0.0000;0.0000;0.0000;2;-0.2500;-0.4000;0.3350;0.0000;0.0000;0.0000;3;-0.1216;-0.0858;0.3488;0.0000;0.0000;0.0000;0;False;1