{
  "applications": "*",
  "changelogDate": "20220714173216",
  "dto": "no",
  "embedded": false,
  "entityTableName": "setting",
  "fields": [],
  "fluentMethods": true,
  "jpaMetamodelFiltering": false,
  "name": "Setting",
  "pagination": "pagination",
  "readOnly": false,
  "relationships": [
    {
      "otherEntityName": "restaurant",
      "otherEntityRelationshipName": "setting",
      "relationshipName": "restaurant",
      "relationshipType": "many-to-one"
    },
    {
      "otherEntityName": "menu",
      "otherEntityRelationshipName": "setting",
      "relationshipName": "menu",
      "relationshipType": "many-to-one"
    },
    {
      "otherEntityName": "article",
      "otherEntityRelationshipName": "setting",
      "relationshipName": "article",
      "relationshipType": "many-to-one"
    },
    {
      "otherEntityName": "posUser",
      "otherEntityRelationshipName": "setting",
      "relationshipName": "user",
      "relationshipType": "many-to-one"
    }
  ],
  "service": "serviceImpl"
}
