{
    "project_name": "my-app",
    "project_slug": "{{ cookiecutter.project_name.lower().replace(' ', '_').replace('-', '_') }}",
    "project_title": "This is a title",
    "project_description": "This is a description"
}
