{
  "m_GameObject": {
    "m_FileID": 0,
    "m_PathID": 0
  },
  "m_Enabled": 1,
  "m_Script": {
    "m_FileID": 0,
    "m_PathID": -2033692801501575607
  },
  "m_Name": "PopupSlimeRelay[box_slot_on]",
  "address": "PopupSlimeRelay[box_slot_on]"
}