{
  "m_GameObject": {
    "m_FileID": 0,
    "m_PathID": -1343562447100749212
  },
  "m_Enabled": 1,
  "m_Script": {
    "m_FileID": 0,
    "m_PathID": 8962903080549542158
  },
  "m_Name": "",
  "localizeKey": "MINE_INFO_DESC_2",
  "fontMaterial": {
    "m_FileID": 0,
    "m_PathID": -1275919911617737738
  },
  "overrideFonts": []
}