{
  "m_GameObject": {
    "m_FileID": 0,
    "m_PathID": -5471846661061636119
  },
  "m_Enabled": 1,
  "m_Script": {
    "m_FileID": 0,
    "m_PathID": 2846645518634712971
  },
  "m_Name": "",
  "animTime": 0.5,
  "maskTransform": {
    "m_FileID": 0,
    "m_PathID": 8744067659580935568
  }
}