{
  "m_GameObject": {
    "m_FileID": 0,
    "m_PathID": 6355346190017740816
  },
  "m_Enabled": 1,
  "m_Script": {
    "m_FileID": 0,
    "m_PathID": -8826248144273319766
  },
  "m_Name": "",
  "m_Content": {
    "m_FileID": 0,
    "m_PathID": 8213891184352818712
  },
  "m_Horizontal": 0,
  "m_Vertical": 1,
  "m_MovementType": 1,
  "m_Elasticity": 0.1,
  "m_Inertia": 1,
  "m_DecelerationRate": 0.135,
  "m_ScrollSensitivity": 1.0,
  "m_Viewport": {
    "m_FileID": 0,
    "m_PathID": 8823394730222616307
  },
  "m_HorizontalScrollbar": {
    "m_FileID": 0,
    "m_PathID": 0
  },
  "m_VerticalScrollbar": {
    "m_FileID": 0,
    "m_PathID": 0
  },
  "m_HorizontalScrollbarVisibility": 0,
  "m_VerticalScrollbarVisibility": 0,
  "m_HorizontalScrollbarSpacing": 0.0,
  "m_VerticalScrollbarSpacing": 0.0,
  "m_OnValueChanged": {
    "m_PersistentCalls": {
      "m_Calls": []
    }
  }
}