{
  "m_GameObject": {
    "m_FileID": 0,
    "m_PathID": 0
  },
  "m_Enabled": 1,
  "m_Script": {
    "m_FileID": 0,
    "m_PathID": -657477701292886207
  },
  "m_Name": "Appear",
  "m_Version": 0,
  "m_Tracks": [
    {
      "m_FileID": 0,
      "m_PathID": -6159282640610420200
    },
    {
      "m_FileID": 0,
      "m_PathID": 1938567467434192857
    },
    {
      "m_FileID": 0,
      "m_PathID": -8032651232399807424
    },
    {
      "m_FileID": 0,
      "m_PathID": -5687260466622119503
    },
    {
      "m_FileID": 0,
      "m_PathID": -5878669724715825168
    }
  ],
  "m_FixedDuration": 0.0,
  "m_EditorSettings": {
    "m_Framerate": 60.0,
    "m_ScenePreview": 1
  },
  "m_DurationMode": 0,
  "m_MarkerTrack": {
    "m_FileID": 0,
    "m_PathID": -6096570024275039871
  }
}