
ornis_chicken.png
size: 128,256
format: RGBA8888
filter: Linear,Linear
repeat: none
Body
  rotate: false
  xy: 2, 48
  size: 95, 100
  orig: 95, 100
  offset: 0, 0
  index: -1
Eye1
  rotate: false
  xy: 100, 35
  size: 16, 15
  orig: 18, 17
  offset: 1, 1
  index: -1
L_leg
  rotate: false
  xy: 67, 34
  size: 32, 35
  orig: 32, 35
  offset: 0, 0
  index: -1
Nose
  rotate: false
  xy: 87, 69
  size: 28, 24
  orig: 30, 26
  offset: 1, 1
  index: -1
R_leg
  rotate: true
  xy: 71, 4
  size: 32, 34
  orig: 32, 35
  offset: 0, 1
  index: -1
R_wing
  rotate: 180
  xy: 92, 116
  size: 28, 33
  orig: 28, 38
  offset: 0, 5
  index: -1
Eye2
  rotate: false
  xy: 2, 2
  size: 67, 44
  orig: 69, 46
  offset: 1, 1
  index: -1
