{
  "m_GameObject": {
    "m_FileID": 0,
    "m_PathID": 4170991454037446071
  },
  "m_Enabled": 1,
  "m_Script": {
    "m_FileID": 0,
    "m_PathID": 7837370324791630998
  },
  "m_Name": "",
  "view": {
    "m_FileID": 0,
    "m_PathID": -3796946016538392822
  },
  "timerIndicator": {
    "m_FileID": 0,
    "m_PathID": 9198977361458055257
  },
  "earnSfx": {
    "m_FileID": 6,
    "m_PathID": -2448843806791463484
  }
}