{
  "m_GameObject": {
    "m_FileID": 0,
    "m_PathID": 85276667270446614
  },
  "m_Enabled": 1,
  "m_Script": {
    "m_FileID": 0,
    "m_PathID": 8806312759750168707
  },
  "m_Name": "",
  "bindKey": "OnClickQuickRaid"
}