{
  "m_GameObject": {
    "m_FileID": 0,
    "m_PathID": -8547089157105343663
  },
  "m_Enabled": 1,
  "m_Script": {
    "m_FileID": 0,
    "m_PathID": 8962903080549542158
  },
  "m_Name": "",
  "localizeKey": "",
  "fontMaterial": {
    "m_FileID": 0,
    "m_PathID": 5553381187085637640
  },
  "overrideFonts": []
}