{
  "m_GameObject": {
    "m_FileID": 0,
    "m_PathID": 7746050447203179169
  },
  "m_Enabled": 1,
  "m_Script": {
    "m_FileID": 3,
    "m_PathID": -787143586316466668
  },
  "m_Name": "",
  "m_Navigation": {
    "m_Mode": 3,
    "m_WrapAround": 0,
    "m_SelectOnUp": {
      "m_FileID": 0,
      "m_PathID": 0
    },
    "m_SelectOnDown": {
      "m_FileID": 0,
      "m_PathID": 0
    },
    "m_SelectOnLeft": {
      "m_FileID": 0,
      "m_PathID": 0
    },
    "m_SelectOnRight": {
      "m_FileID": 0,
      "m_PathID": 0
    }
  },
  "m_Transition": 0,
  "m_Colors": {
    "m_NormalColor": {
      "r": 1.0,
      "g": 1.0,
      "b": 1.0,
      "a": 1.0
    },
    "m_HighlightedColor": {
      "r": 0.9607843,
      "g": 0.9607843,
      "b": 0.9607843,
      "a": 1.0
    },
    "m_PressedColor": {
      "r": 0.784313738,
      "g": 0.784313738,
      "b": 0.784313738,
      "a": 1.0
    },
    "m_SelectedColor": {
      "r": 0.9607843,
      "g": 0.9607843,
      "b": 0.9607843,
      "a": 1.0
    },
    "m_DisabledColor": {
      "r": 0.784313738,
      "g": 0.784313738,
      "b": 0.784313738,
      "a": 0.5019608
    },
    "m_ColorMultiplier": 1.0,
    "m_FadeDuration": 0.1
  },
  "m_SpriteState": {
    "m_HighlightedSprite": {
      "m_FileID": 0,
      "m_PathID": 0
    },
    "m_PressedSprite": {
      "m_FileID": 0,
      "m_PathID": 0
    },
    "m_SelectedSprite": {
      "m_FileID": 0,
      "m_PathID": 0
    },
    "m_DisabledSprite": {
      "m_FileID": 0,
      "m_PathID": 0
    }
  },
  "m_AnimationTriggers": {
    "m_NormalTrigger": "Normal",
    "m_HighlightedTrigger": "Highlighted",
    "m_PressedTrigger": "Pressed",
    "m_SelectedTrigger": "Selected",
    "m_DisabledTrigger": "Disabled"
  },
  "m_Interactable": 1,
  "m_TargetGraphic": {
    "m_FileID": 0,
    "m_PathID": -8229455274199114502
  },
  "m_OnClick": {
    "m_PersistentCalls": {
      "m_Calls": [
        {
          "m_Target": {
            "m_FileID": 0,
            "m_PathID": -4902995263277454473
          },
          "m_TargetAssemblyTypeName": "LoadComplete.UI.SkillUseButton, Slime.Core",
          "m_MethodName": "OnClick",
          "m_Mode": 1,
          "m_Arguments": {
            "m_ObjectArgument": {
              "m_FileID": 0,
              "m_PathID": 0
            },
            "m_ObjectArgumentAssemblyTypeName": "UnityEngine.Object, UnityEngine",
            "m_IntArgument": 0,
            "m_FloatArgument": 0.0,
            "m_StringArgument": "",
            "m_BoolArgument": 0
          },
          "m_CallState": 2
        }
      ]
    }
  }
}