{
  "m_GameObject": {
    "m_FileID": 0,
    "m_PathID": -3745556120580029428
  },
  "m_Enabled": 1,
  "m_Script": {
    "m_FileID": 0,
    "m_PathID": -8977966306559289082
  },
  "m_Name": "",
  "m_Material": {
    "m_FileID": 0,
    "m_PathID": 0
  },
  "m_Color": {
    "r": 1.0,
    "g": 1.0,
    "b": 1.0,
    "a": 1.0
  },
  "m_RaycastTarget": 1,
  "m_RaycastPadding": {
    "x": 0.0,
    "y": 0.0,
    "z": 0.0,
    "w": 0.0
  }
}