{
  "m_GameObject": {
    "m_FileID": 0,
    "m_PathID": 5976054831604301127
  },
  "m_Enabled": 1,
  "m_Script": {
    "m_FileID": 0,
    "m_PathID": -2951491050043632102
  },
  "m_Name": "",
  "hpText": {
    "m_FileID": 0,
    "m_PathID": 0
  },
  "_fgFillImage": {
    "m_FileID": 0,
    "m_PathID": 3769121855696314634
  },
  "_bgFillImage": {
    "m_FileID": 0,
    "m_PathID": 3237105272660345962
  }
}