{
  "m_GameObject": {
    "m_FileID": 0,
    "m_PathID": 3220085805829698618
  },
  "m_Enabled": 1,
  "m_Script": {
    "m_FileID": 0,
    "m_PathID": 1117752915966211304
  },
  "m_Name": "",
  "width": 0.84,
  "scaleSyncTarget": {
    "m_FileID": 0,
    "m_PathID": 2670806627121220814
  }
}