{
  "m_GameObject": {
    "m_FileID": 0,
    "m_PathID": 879324091191141328
  },
  "m_Enabled": 1,
  "m_Script": {
    "m_FileID": 0,
    "m_PathID": 8390977652835490180
  },
  "m_Name": "",
  "m_IgnoreReversedGraphics": 1,
  "m_BlockingObjects": 0,
  "m_BlockingMask": {
    "m_Bits": 255
  }
}