{
  "m_GameObject": {
    "m_FileID": 0,
    "m_PathID": 0
  },
  "m_Enabled": 1,
  "m_Script": {
    "m_FileID": 0,
    "m_PathID": -657477701292886207
  },
  "m_Name": "ArtifactGachaResult",
  "m_Version": 0,
  "m_Tracks": [
    {
      "m_FileID": 0,
      "m_PathID": -4836213940990598398
    },
    {
      "m_FileID": 0,
      "m_PathID": -6658180001024939114
    },
    {
      "m_FileID": 0,
      "m_PathID": 1680311591559995477
    },
    {
      "m_FileID": 0,
      "m_PathID": -4911351888210659263
    },
    {
      "m_FileID": 0,
      "m_PathID": 2774052571133297137
    },
    {
      "m_FileID": 0,
      "m_PathID": 2714322217114306237
    },
    {
      "m_FileID": 0,
      "m_PathID": 6170260015549775338
    },
    {
      "m_FileID": 0,
      "m_PathID": 3857254566272061515
    },
    {
      "m_FileID": 0,
      "m_PathID": -5091291137960641563
    },
    {
      "m_FileID": 0,
      "m_PathID": 4005443936390573658
    },
    {
      "m_FileID": 0,
      "m_PathID": -9029777362658550371
    },
    {
      "m_FileID": 0,
      "m_PathID": -3744425130736160515
    },
    {
      "m_FileID": 0,
      "m_PathID": -7864301714895685639
    },
    {
      "m_FileID": 0,
      "m_PathID": -369348596335021669
    },
    {
      "m_FileID": 0,
      "m_PathID": 750781175199201200
    },
    {
      "m_FileID": 0,
      "m_PathID": 4358761340474160028
    },
    {
      "m_FileID": 0,
      "m_PathID": -1038731452926877352
    },
    {
      "m_FileID": 0,
      "m_PathID": 8369124299783990591
    },
    {
      "m_FileID": 0,
      "m_PathID": 5850920583794477304
    },
    {
      "m_FileID": 0,
      "m_PathID": -382073945109572202
    }
  ],
  "m_FixedDuration": 0.0,
  "m_EditorSettings": {
    "m_Framerate": 60.0,
    "m_ScenePreview": 1
  },
  "m_DurationMode": 0,
  "m_MarkerTrack": {
    "m_FileID": 0,
    "m_PathID": 5246381531041262718
  }
}