{
  "m_GameObject": {
    "m_FileID": 0,
    "m_PathID": 7156657475348757700
  },
  "m_Enabled": 1,
  "m_Script": {
    "m_FileID": 0,
    "m_PathID": -6380373314413769357
  },
  "m_Name": "",
  "updateType": 0,
  "isSpeedBased": 0,
  "hasOnStart": 0,
  "hasOnPlay": 0,
  "hasOnUpdate": 0,
  "hasOnStepComplete": 0,
  "hasOnComplete": 0,
  "hasOnTweenCreated": 0,
  "hasOnRewind": 0,
  "onStart": {
    "m_PersistentCalls": {
      "m_Calls": []
    }
  },
  "onPlay": {
    "m_PersistentCalls": {
      "m_Calls": []
    }
  },
  "onUpdate": {
    "m_PersistentCalls": {
      "m_Calls": []
    }
  },
  "onStepComplete": {
    "m_PersistentCalls": {
      "m_Calls": []
    }
  },
  "onComplete": {
    "m_PersistentCalls": {
      "m_Calls": []
    }
  },
  "onTweenCreated": {
    "m_PersistentCalls": {
      "m_Calls": []
    }
  },
  "onRewind": {
    "m_PersistentCalls": {
      "m_Calls": []
    }
  },
  "targetIsSelf": 1,
  "targetGO": {
    "m_FileID": 0,
    "m_PathID": 0
  },
  "tweenTargetIsTargetGO": 1,
  "delay": 0.0,
  "duration": 1.5,
  "easeType": 4,
  "easeCurve": {
    "m_Curve": [
      {
        "time": 0.0,
        "value": 0.0,
        "inSlope": 0.0,
        "outSlope": 0.0,
        "weightedMode": 0,
        "inWeight": 0.0,
        "outWeight": 0.0
      },
      {
        "time": 1.0,
        "value": 1.0,
        "inSlope": 0.0,
        "outSlope": 0.0,
        "weightedMode": 0,
        "inWeight": 0.0,
        "outWeight": 0.0
      }
    ],
    "m_PreInfinity": 2,
    "m_PostInfinity": 2,
    "m_RotationOrder": 4
  },
  "loopType": 1,
  "loops": -1,
  "id": "",
  "isRelative": 1,
  "isFrom": 0,
  "isIndependentUpdate": 0,
  "autoKill": 1,
  "autoGenerate": 1,
  "isActive": 1,
  "isValid": 1,
  "target": {
    "m_FileID": 0,
    "m_PathID": 6064191275529500786
  },
  "animationType": 2,
  "targetType": 11,
  "forcedTargetType": 0,
  "autoPlay": 1,
  "useTargetAsV3": 0,
  "endValueFloat": 0.0,
  "endValueV3": {
    "x": 0.0,
    "y": 15.0,
    "z": 0.0
  },
  "endValueV2": {
    "x": 0.0,
    "y": 0.0
  },
  "endValueColor": {
    "r": 1.0,
    "g": 1.0,
    "b": 1.0,
    "a": 1.0
  },
  "endValueString": "",
  "endValueRect": {
    "x": 0.0,
    "y": 0.0,
    "width": 0.0,
    "height": 0.0
  },
  "endValueTransform": {
    "m_FileID": 0,
    "m_PathID": 0
  },
  "optionalBool0": 0,
  "optionalBool1": 0,
  "optionalFloat0": 0.0,
  "optionalInt0": 0,
  "optionalRotationMode": 0,
  "optionalScrambleMode": 0,
  "optionalString": ""
}