{
  "m_GameObject": {
    "m_FileID": 0,
    "m_PathID": -1367215017558641830
  },
  "m_Enabled": 1,
  "m_Script": {
    "m_FileID": 0,
    "m_PathID": -1791820170714463082
  },
  "m_Name": "",
  "_serializedExposedParameters": [],
  "_boundGraphSerialization": "",
  "_boundGraphObjectReferences": [],
  "_boundGraphSource": {
    "_version": 0.0,
    "_category": "",
    "_comments": "",
    "_translation": {
      "x": 0.0,
      "y": 0.0
    },
    "_zoomFactor": 1.0
  },
  "_firstActivation": 0,
  "_enableAction": 1,
  "_disableAction": 0,
  "_lockBoundGraphPrefabOverrides": 1,
  "_preInitializeSubGraphs": 1,
  "_updateMode": 2,
  "_graph": {
    "m_FileID": 0,
    "m_PathID": -2437219340635859346
  },
  "_blackboard": {
    "m_FileID": 0,
    "m_PathID": -8785903434807001278
  }
}