{
  "m_GameObject": {
    "m_FileID": 0,
    "m_PathID": -5939558418529538497
  },
  "m_Enabled": 1,
  "m_Script": {
    "m_FileID": 0,
    "m_PathID": 8962903080549542158
  },
  "m_Name": "",
  "localizeKey": "",
  "fontMaterial": {
    "m_FileID": 39,
    "m_PathID": -1452784136474669910
  },
  "overrideFonts": []
}