{
  "m_GameObject": {
    "m_FileID": 0,
    "m_PathID": -3715745624981006169
  },
  "m_Enabled": 1,
  "m_Script": {
    "m_FileID": 0,
    "m_PathID": 1578755072864384144
  },
  "m_Name": "",
  "gcEmptyIcon": {
    "m_FileID": 0,
    "m_PathID": -3737570791283379141
  },
  "goFullLight": {
    "m_FileID": 0,
    "m_PathID": -4393139373674025881
  },
  "imgInnerCircle": {
    "m_FileID": 0,
    "m_PathID": -152424811766963261
  },
  "imgOuterCircle": {
    "m_FileID": 0,
    "m_PathID": -3450838159922292890
  },
  "gaugeFillImage": {
    "m_FileID": 0,
    "m_PathID": -5740403065438431877
  },
  "txtEarnAmount": {
    "m_FileID": 0,
    "m_PathID": -8875084892142819649
  },
  "imgEarnIcon": {
    "m_FileID": 0,
    "m_PathID": 5564189174108892799
  },
  "imgEarnIconEffect": {
    "m_FileID": 0,
    "m_PathID": 5195593923284686031
  },
  "imgFullIcon": {
    "m_FileID": 0,
    "m_PathID": 4536375883345031188
  },
  "imgNotReadyIcon": {
    "m_FileID": 0,
    "m_PathID": -9198819340502433358
  },
  "scaleBase": {
    "m_FileID": 0,
    "m_PathID": -3484556169075099470
  },
  "animator": {
    "m_FileID": 0,
    "m_PathID": -4769562760390385712
  },
  "redDotImage": {
    "m_FileID": 0,
    "m_PathID": -7582841404625272289
  },
  "emptyInColor": {
    "r": 0.298039228,
    "g": 0.2901961,
    "b": 0.411764741,
    "a": 1.0
  },
  "emptyOutColor": {
    "r": 0.46274513,
    "g": 0.454902,
    "b": 0.6039216,
    "a": 1.0
  },
  "progressInColor": {
    "r": 0.180392161,
    "g": 0.168627456,
    "b": 0.156862751,
    "a": 1.0
  },
  "progressOutColor": {
    "r": 0.305882365,
    "g": 0.3529412,
    "b": 0.2392157,
    "a": 1.0
  },
  "fullInColor": {
    "r": 0.435294151,
    "g": 0.400000036,
    "b": 0.2392157,
    "a": 1.0
  },
  "fullOutColor": {
    "r": 1.0,
    "g": 0.850980461,
    "b": 0.164705887,
    "a": 1.0
  },
  "NotReadyInColor": {
    "r": 0.235294133,
    "g": 0.482352972,
    "b": 0.21960786,
    "a": 1.0
  },
  "NotReadyOutColor": {
    "r": 0.396078467,
    "g": 0.6901961,
    "b": 0.368627459,
    "a": 1.0
  }
}