{
  "m_GameObject": {
    "m_FileID": 0,
    "m_PathID": -2807732784166935292
  },
  "m_Enabled": 1,
  "m_Script": {
    "m_FileID": 0,
    "m_PathID": 1117752915966211304
  },
  "m_Name": "",
  "width": 0.73,
  "scaleSyncTarget": {
    "m_FileID": 0,
    "m_PathID": 0
  }
}