{
  "m_GameObject": {
    "m_FileID": 0,
    "m_PathID": 44181658001347530
  },
  "m_Enabled": 1,
  "m_Script": {
    "m_FileID": 0,
    "m_PathID": -601302166165027579
  },
  "m_Name": "",
  "rtBody": {
    "m_FileID": 0,
    "m_PathID": 8825540077586196672
  }
}