{
  "m_GameObject": {
    "m_FileID": 0,
    "m_PathID": 7228017942298745146
  },
  "m_Enabled": 1,
  "m_Script": {
    "m_FileID": 0,
    "m_PathID": -3242970711442325531
  },
  "m_Name": "",
  "bindKey": "SkillIsLock",
  "isReverse": 0
}