{
  "m_GameObject": {
    "m_FileID": 0,
    "m_PathID": 1792534615101863700
  },
  "m_Enabled": 1,
  "m_Script": {
    "m_FileID": 0,
    "m_PathID": 2846645518634712971
  },
  "m_Name": "",
  "animTime": 0.2,
  "maskTransform": {
    "m_FileID": 0,
    "m_PathID": -7270435244089503826
  }
}