{
  "m_GameObject": {
    "m_FileID": 0,
    "m_PathID": 3278254368773415139
  },
  "m_Enabled": 1,
  "m_Script": {
    "m_FileID": 0,
    "m_PathID": -3242970711442325531
  },
  "m_Name": "",
  "bindKey": "IsLoading",
  "isReverse": 1
}