{
  "skeleton": {
    "hash": "Vg7PXOckYte3Z+bSvEE8zi/RxdU",
    "spine": "3.8.94",
    "x": -168.02,
    "y": -1.77,
    "width": 346.34,
    "height": 384.4,
    "images": "./images/",
    "audio": "../psd/"
  },
  "bones": [
    {
      "name": "root"
    },
    {
      "name": "base2",
      "parent": "root",
      "x": 55.5,
      "y": 111.54
    },
    {
      "name": "body3",
      "parent": "base2",
      "length": 89.74,
      "rotation": 105.77,
      "x": -48.14,
      "y": 4.07
    },
    {
      "name": "wing",
      "parent": "body3",
      "rotation": -105.77,
      "x": 29.03,
      "y": -74.71
    },
    {
      "name": "leg_1",
      "parent": "base2",
      "length": 54.44,
      "rotation": -90,
      "x": -15.9,
      "y": -27.02
    },
    {
      "name": "leg_2",
      "parent": "base2",
      "length": 56.06,
      "rotation": -90,
      "x": -76.27,
      "y": -28.27
    },
    {
      "name": "2_5",
      "parent": "body3",
      "rotation": -105.77,
      "x": 141.06,
      "y": 23.63
    },
    {
      "name": "2_7",
      "parent": "body3",
      "length": 44.85,
      "rotation": 174.95,
      "x": 110.81,
      "y": 11.46
    },
    {
      "name": "2_8",
      "parent": "body3",
      "length": 41.19,
      "rotation": 153.68,
      "x": 124.51,
      "y": 55.52
    },
    {
      "name": "2_11",
      "parent": "body3",
      "length": 63.92,
      "rotation": 74.23,
      "x": 117.97,
      "y": 21.75
    },
    {
      "name": "2_10",
      "parent": "body3",
      "length": 86.55,
      "rotation": 74.23,
      "x": 40.34,
      "y": 46.97
    },
    {
      "name": "2_12",
      "parent": "root",
      "x": -143.68,
      "y": 318.32
    }
  ],
  "slots": [
    {
      "name": "2_1",
      "bone": "leg_2",
      "attachment": "2_1"
    },
    {
      "name": "2_2",
      "bone": "leg_1",
      "attachment": "2_2"
    },
    {
      "name": "2_3",
      "bone": "body3",
      "attachment": "2_3"
    },
    {
      "name": "2_4",
      "bone": "2_5",
      "attachment": "2_4"
    },
    {
      "name": "2_5",
      "bone": "2_5",
      "attachment": "2_5"
    },
    {
      "name": "2_6",
      "bone": "wing",
      "attachment": "2_6"
    },
    {
      "name": "2_7",
      "bone": "2_7",
      "attachment": "2_7"
    },
    {
      "name": "2_8",
      "bone": "2_8",
      "attachment": "2_8"
    },
    {
      "name": "2_9",
      "bone": "2_11"
    },
    {
      "name": "2_10",
      "bone": "2_10"
    },
    {
      "name": "2_11",
      "bone": "2_11",
      "attachment": "2_15"
    },
    {
      "name": "2_12",
      "bone": "2_5",
      "attachment": "2_12"
    },
    {
      "name": "2_13",
      "bone": "2_5",
      "attachment": "2_13"
    },
    {
      "name": "2_14",
      "bone": "2_12",
      "attachment": "2_14"
    }
  ],
  "skins": [
    {
      "name": "default",
      "attachments": {
        "2_1": {
          "2_1": {
            "x": 25.19,
            "y": -9.91,
            "rotation": 90,
            "width": 100,
            "height": 117
          }
        },
        "2_2": {
          "2_2": {
            "x": 27.8,
            "y": -9.28,
            "rotation": 90,
            "width": 100,
            "height": 117
          }
        },
        "2_3": {
          "2_3": {
            "x": 92.85,
            "y": -35.53,
            "rotation": -105.77,
            "width": 324,
            "height": 336
          }
        },
        "2_4": {
          "2_4": {
            "x": -14.96,
            "y": 2.68,
            "width": 26,
            "height": 58
          }
        },
        "2_5": {
          "2_5": {
            "x": 15.54,
            "y": 2.68,
            "width": 26,
            "height": 58
          }
        },
        "2_6": {
          "2_6": {
            "x": 31.45,
            "y": -0.73,
            "width": 87,
            "height": 103
          }
        },
        "2_7": {
          "2_7": {
            "x": 34.95,
            "y": -0.91,
            "rotation": 79.29,
            "width": 59,
            "height": 97
          }
        },
        "2_8": {
          "2_8": {
            "x": 36.09,
            "y": 1.36,
            "rotation": 100.55,
            "width": 59,
            "height": 97
          }
        },
        "2_9": {
          "2_9": {
            "type": "mesh",
            "uvs": [
              1,
              1,
              0,
              1,
              0,
              0,
              1,
              0
            ],
            "triangles": [
              1,
              3,
              0,
              1,
              2,
              3
            ],
            "vertices": [
              1,
              10,
              -19.63,
              2.05,
              1,
              1,
              10,
              48.37,
              2.05,
              1,
              1,
              9,
              51.55,
              4.6,
              1,
              1,
              9,
              -16.45,
              4.6,
              1
            ],
            "hull": 4,
            "edges": [
              0,
              2,
              2,
              4,
              4,
              6,
              0,
              6
            ],
            "width": 68,
            "height": 79
          }
        },
        "2_10": {
          "2_10": {
            "x": 22.87,
            "y": -3.95,
            "rotation": 180,
            "width": 94,
            "height": 59
          }
        },
        "2_11": {
          "2_11": {
            "x": 26.05,
            "y": -1.05,
            "rotation": 180,
            "width": 94,
            "height": 59
          },
          "2_15": {
            "x": 26.55,
            "y": 23.45,
            "rotation": 180,
            "width": 94,
            "height": 85
          }
        },
        "2_12": {
          "2_12": {
            "x": 28.04,
            "y": 31.18,
            "width": 60,
            "height": 45
          }
        },
        "2_13": {
          "2_13": {
            "x": -26.96,
            "y": 31.18,
            "width": 60,
            "height": 45
          }
        },
        "2_14": {
          "2_14": {
            "x": -0.34,
            "y": 0.44,
            "width": 48,
            "height": 49
          }
        }
      }
    }
  ],
  "events": {
    "KeyEventAttack": {

    }
  },
  "animations": {
    "idle": {
      "bones": {
        "body3": {
          "translate": [
            {
              "y": -3,
              "curve": 0.363,
              "c3": 0.3
            },
            {
              "time": 0.85,
              "y": 3,
              "curve": 0.363,
              "c2": 0.44,
              "c3": 0.755
            },
            {
              "y": -3,
              "time": 1.7
            }
          ]
        }
      }
    },
    "attack": {
      "slots": {
        "2_14": {
          "attachment": [
            {
              "name": null
            }
          ]
        }
      },
      "bones": {
        "base2": {
          "rotate": [
            {
              "curve": 0.363,
              "c3": 0.3
            },
            {
              "time": 0.4,
              "angle": -2,
              "curve": 0.363,
              "c2": 0.44,
              "c3": 0.755
            },
            {
              "time": 0.5,
              "angle": 5,
              "curve": 0.384,
              "c3": 0.691,
              "c4": 0.55
            },
            {
              "time": 0.6,
              "angle": -1,
              "curve": 0.258,
              "c3": 0.619,
              "c4": 0.45
            },
            {
              "time": 0.7
            }
          ],
          "translate": [
            {
              "curve": 0.363,
              "c3": 0.3
            },
            {
              "time": 0.4,
              "x": 1,
              "y": -1,
              "curve": 0.363,
              "c2": 0.44,
              "c3": 0.755
            },
            {
              "time": 0.5,
              "x": -13,
              "y": 0,
              "curve": 0.384,
              "c3": 0.691,
              "c4": 0.55
            },
            {
              "time": 0.6,
              "x": 0,
              "y": 0,
              "curve": 0.258,
              "c3": 0.619,
              "c4": 0.45
            },
            {
              "time": 0.7
            }
          ],
          "scale": [
            {

            },
            {
              "time": 0.4,
              "x": 0.95,
              "y": 1.05,
              "curve": 0.349,
              "c3": 0.661
            },
            {
              "time": 0.5,
              "x": 1.05,
              "y": 0.95,
              "curve": 0.293,
              "c3": 0.69
            },
            {
              "time": 0.6,
              "x": 1,
              "y": 1
            },
            {
              "time": 0.7,
              "x": 1,
              "y": 1
            }
          ]
        },
        "body3": {
          "rotate": [
            {
              "curve": 0.363,
              "c3": 0.3
            },
            {
              "time": 0.4,
              "angle": -20,
              "curve": 0.363,
              "c2": 0.44,
              "c3": 0.755
            },
            {
              "time": 0.5,
              "angle": 26,
              "curve": 0.384,
              "c3": 0.691,
              "c4": 0.55
            },
            {
              "time": 0.6,
              "angle": -4,
              "curve": 0.258,
              "c3": 0.619,
              "c4": 0.45
            },
            {
              "time": 0.7
            }
          ]
        },
        "2_11": {
          "translate": [
            {

            },
            {
              "time": 0.4,
              "x": 0,
              "y": 0,
              "curve": 0.349,
              "c3": 0.661
            },
            {
              "time": 0.5,
              "x": 13,
              "y": 13,
              "curve": 0.293,
              "c3": 0.69
            },
            {
              "time": 0.6,
              "x": 4,
              "y": -3
            },
            {
              "time": 0.7
            }
          ],
          "scale": [
            {

            },
            {
              "time": 0.4,
              "x": 1,
              "y": 1,
              "curve": 0.349,
              "c3": 0.661
            },
            {
              "time": 0.5,
              "x": 2.2,
              "y": 1.5,
              "curve": 0.293,
              "c3": 0.69
            },
            {
              "time": 0.6,
              "x": 0.8,
              "y": 1.3
            },
            {
              "time": 0.7
            }
          ]
        },
        "leg_1": {
          "translate": [
            {

            },
            {
              "time": 0.4,
              "curve": 0.389,
              "c3": 0.646
            },
            {
              "time": 0.5,
              "x": 8,
              "curve": 0.323,
              "c2": 0.5,
              "c3": 0.636
            },
            {
              "time": 0.6,
              "curve": 0.379,
              "c3": 0.694,
              "c4": 0.5
            },
            {
              "time": 0.7
            }
          ]
        },
        "leg_2": {
          "translate": [
            {

            },
            {
              "time": 0.4,
              "curve": 0.389,
              "c3": 0.646
            },
            {
              "time": 0.5,
              "y": 10,
              "curve": 0.323,
              "c2": 0.5,
              "c3": 0.636
            },
            {
              "time": 0.6,
              "curve": 0.379,
              "c3": 0.694,
              "c4": 0.5
            },
            {
              "time": 0.7
            }
          ]
        }
      },
      "events": [
        {
          "time": 0.5,
          "name": "KeyEventAttack"
        }
      ]
    },
    "skill_walk": {
      "slots": {
        "2_9": {
          "attachment": [
            {
              "name": "2_9"
            }
          ]
        },
        "2_10": {
          "attachment": [
            {
              "name": "2_10"
            }
          ]
        },
        "2_11": {
          "attachment": [
            {
              "name": "2_11"
            }
          ]
        }
      },
      "bones": {
        "base2": {
          "translate": [
            {
              "curve": 0.389,
              "c3": 0.646
            },
            {
              "time": 0.1,
              "y": -6.88,
              "curve": 0.389,
              "c3": 0.646
            },
            {
              "time": 0.1667,
              "curve": 0.389,
              "c3": 0.646
            },
            {
              "time": 0.2667,
              "y": -6.88,
              "curve": 0.389,
              "c3": 0.646
            },
            {
              "time": 0.3333
            }
          ]
        },
        "body3": {
          "rotate": [
            {
              "angle": -0.89,
              "curve": 0.363,
              "c2": 0.44,
              "c3": 0.755
            },
            {
              "time": 0.0667,
              "angle": -2.41,
              "curve": 0.384,
              "c3": 0.691,
              "c4": 0.55
            },
            {
              "time": 0.1,
              "angle": -0.88,
              "curve": 0.319,
              "c2": 0.55,
              "c3": 0.64
            },
            {
              "time": 0.1333,
              "curve": 0.25,
              "c3": 0.75
            },
            {
              "time": 0.2333,
              "angle": -2.41,
              "curve": 0.384,
              "c3": 0.691,
              "c4": 0.55
            },
            {
              "time": 0.2667,
              "angle": -0.88,
              "curve": 0.319,
              "c2": 0.55,
              "c3": 0.64
            },
            {
              "time": 0.3,
              "curve": 0.258,
              "c3": 0.619,
              "c4": 0.45
            },
            {
              "time": 0.3333,
              "angle": -0.89
            }
          ],
          "translate": [
            {
              "x": -2.58,
              "curve": 0.368,
              "c3": 0.444
            },
            {
              "time": 0.1,
              "x": 2.26,
              "curve": 0.556,
              "c3": 0.729
            },
            {
              "time": 0.1667,
              "x": -2.58,
              "curve": 0.368,
              "c3": 0.444
            },
            {
              "time": 0.2667,
              "x": 2.26,
              "curve": 0.556,
              "c3": 0.729
            },
            {
              "time": 0.3333,
              "x": -2.58
            }
          ]
        },
        "leg_1": {
          "rotate": [
            {
              "angle": 7.44,
              "curve": 0.325,
              "c2": 0.5,
              "c3": 0.64
            },
            {
              "time": 0.1,
              "angle": -38.89,
              "curve": 0.389,
              "c3": 0.651
            },
            {
              "time": 0.2667,
              "angle": 49.46,
              "curve": 0.378,
              "c3": 0.694,
              "c4": 0.5
            },
            {
              "time": 0.3333,
              "angle": 7.44
            }
          ],
          "translate": [
            {
              "x": -2.51,
              "y": 1.8,
              "curve": 0.325,
              "c2": 0.5,
              "c3": 0.64
            },
            {
              "time": 0.1,
              "x": -5.27,
              "y": -3.64,
              "curve": 0.389,
              "c3": 0.651
            },
            {
              "time": 0.2667,
              "y": 6.72,
              "curve": 0.378,
              "c3": 0.694,
              "c4": 0.5
            },
            {
              "time": 0.3333,
              "x": -2.51,
              "y": 1.8
            }
          ]
        },
        "leg_2": {
          "rotate": [
            {
              "angle": 10.89,
              "curve": 0.323,
              "c2": 0.5,
              "c3": 0.636
            },
            {
              "time": 0.1,
              "angle": 56.64,
              "curve": 0.389,
              "c3": 0.646
            },
            {
              "time": 0.2667,
              "angle": -31.08,
              "curve": 0.379,
              "c3": 0.694,
              "c4": 0.5
            },
            {
              "time": 0.3333,
              "angle": 10.89
            }
          ],
          "translate": [
            {
              "x": 2.52,
              "y": 0.36,
              "curve": 0.323,
              "c2": 0.5,
              "c3": 0.636
            },
            {
              "time": 0.1,
              "x": 5.27,
              "y": 0.75,
              "curve": 0.389,
              "c3": 0.646
            },
            {
              "time": 0.1667,
              "x": 2.75,
              "y": 3.4,
              "curve": 0.323,
              "c2": 0.5,
              "c3": 0.636
            },
            {
              "time": 0.2667,
              "curve": 0.379,
              "c3": 0.694,
              "c4": 0.5
            },
            {
              "time": 0.3333,
              "x": 2.52,
              "y": 0.36
            }
          ]
        },
        "wing": {
          "rotate": [
            {
              "angle": 2.98,
              "curve": 0.359,
              "c2": 0.44,
              "c3": 0.729
            },
            {
              "time": 0.1,
              "angle": -11.47,
              "curve": 0.25,
              "c3": 0.75
            },
            {
              "time": 0.2667,
              "angle": 10.73,
              "curve": 0.295,
              "c3": 0.644,
              "c4": 0.45
            },
            {
              "time": 0.3333,
              "angle": 2.98
            }
          ]
        },
        "2_12": {
          "scale": [
            {
              "x": 1.16,
              "y": 1.16,
              "curve": 0.349,
              "c3": 0.661
            },
            {
              "time": 0.0667,
              "x": 0.892,
              "y": 0.892,
              "curve": 0.349,
              "c3": 0.661
            },
            {
              "time": 0.1333,
              "x": 1.613,
              "y": 1.613,
              "curve": 0.293,
              "c3": 0.69
            },
            {
              "time": 0.2667,
              "x": 1.16,
              "y": 1.16
            }
          ]
        },
        "2_11": {
          "translate": [
            {
              "x": -9.15,
              "y": 2.43,
              "curve": 0.3,
              "c3": 0.71
            },
            {
              "time": 0.1667,
              "x": 0.66,
              "y": -0.18,
              "curve": 0.3,
              "c3": 0.71
            },
            {
              "time": 0.3333,
              "x": -9.15,
              "y": 2.43
            }
          ]
        },
        "2_10": {
          "translate": [
            {
              "x": 6.53,
              "y": -1.74,
              "curve": 0.3,
              "c3": 0.71
            },
            {
              "time": 0.1667,
              "x": -5.29,
              "y": 1.43,
              "curve": 0.3,
              "c3": 0.71
            },
            {
              "time": 0.3333,
              "x": 6.53,
              "y": -1.74
            }
          ]
        }
      }
    }
  }
}