{
  "m_GameObject": {
    "m_FileID": 0,
    "m_PathID": -3271234774010195611
  },
  "m_Enabled": 1,
  "m_Script": {
    "m_FileID": 0,
    "m_PathID": -2411305003636244336
  },
  "m_Name": "",
  "rtBody": {
    "m_FileID": 0,
    "m_PathID": 1084444642788587692
  },
  "slots": [
    {
      "m_FileID": 0,
      "m_PathID": -5586377825298172162
    },
    {
      "m_FileID": 0,
      "m_PathID": 135157689347046638
    },
    {
      "m_FileID": 0,
      "m_PathID": 184813409055349489
    },
    {
      "m_FileID": 0,
      "m_PathID": 7736879492158967546
    },
    {
      "m_FileID": 0,
      "m_PathID": 5214275079390254681
    }
  ]
}