{
  "m_GameObject": {
    "m_FileID": 0,
    "m_PathID": 4915993471134638184
  },
  "m_Enabled": 1,
  "m_Script": {
    "m_FileID": 0,
    "m_PathID": -3470914107750874984
  },
  "m_Name": "",
  "mapLayers": [
    {
      "layerTransform": {
        "m_FileID": 0,
        "m_PathID": -6993146372869320224
      },
      "movementMultiply": 1.0,
      "intervalX": 0.0
    },
    {
      "layerTransform": {
        "m_FileID": 0,
        "m_PathID": -8023834771559577056
      },
      "movementMultiply": 0.8,
      "intervalX": 37.3
    },
    {
      "layerTransform": {
        "m_FileID": 0,
        "m_PathID": -2923445941486634754
      },
      "movementMultiply": 0.0,
      "intervalX": 23.0
    },
    {
      "layerTransform": {
        "m_FileID": 0,
        "m_PathID": -8695070800059888461
      },
      "movementMultiply": 0.1,
      "intervalX": 23.01
    },
    {
      "layerTransform": {
        "m_FileID": 0,
        "m_PathID": 7855195723733183291
      },
      "movementMultiply": 0.3,
      "intervalX": 18.19
    },
    {
      "layerTransform": {
        "m_FileID": 0,
        "m_PathID": -1549476035695214026
      },
      "movementMultiply": 0.5,
      "intervalX": 23.9
    },
    {
      "layerTransform": {
        "m_FileID": 0,
        "m_PathID": -286081512345170043
      },
      "movementMultiply": 0.6,
      "intervalX": 24.49
    },
    {
      "layerTransform": {
        "m_FileID": 0,
        "m_PathID": -3423215203386234834
      },
      "movementMultiply": 0.7,
      "intervalX": 32.1
    },
    {
      "layerTransform": {
        "m_FileID": 0,
        "m_PathID": 8963930073071389423
      },
      "movementMultiply": 0.0,
      "intervalX": 26.57
    }
  ]
}