{
  "m_GameObject": {
    "m_FileID": 0,
    "m_PathID": -2533447302113918769
  },
  "m_Enabled": 1,
  "m_Script": {
    "m_FileID": 0,
    "m_PathID": -3242970711442325531
  },
  "m_Name": "",
  "bindKey": "item.IsUnlocked",
  "isReverse": 0
}