{
  "m_GameObject": {
    "m_FileID": 0,
    "m_PathID": -7401236178198775861
  },
  "m_Enabled": 1,
  "m_Script": {
    "m_FileID": 0,
    "m_PathID": -3242970711442325531
  },
  "m_Name": "",
  "bindKey": "Highlight",
  "isReverse": 0
}