{
  "m_GameObject": {
    "m_FileID": 0,
    "m_PathID": 3483819030113444994
  },
  "m_Enabled": 1,
  "m_Script": {
    "m_FileID": 0,
    "m_PathID": 4705255670138841947
  },
  "m_Name": "",
  "bindKey": "BatterySlider"
}