{
  "m_GameObject": {
    "m_FileID": 0,
    "m_PathID": 2687515801418543405
  },
  "m_Enabled": 1,
  "m_Script": {
    "m_FileID": 4,
    "m_PathID": -1698081802803219195
  },
  "m_Name": "",
  "preset": 1,
  "onEnableBehaviour": 3,
  "onDisableBehaviour": 2
}