{
  "m_GameObject": {
    "m_FileID": 0,
    "m_PathID": 0
  },
  "m_Enabled": 1,
  "m_Script": {
    "m_FileID": 0,
    "m_PathID": 5017138534136241537
  },
  "m_Name": "Spanish (Spain) (es-ES)",
  "m_Identifier": {
    "m_Code": "es-ES"
  },
  "m_Metadata": {
    "m_Items": [
      {
        "id": 0
      }
    ]
  },
  "m_LocaleName": "Spanish (Spain) (es-ES)",
  "m_CustomFormatCultureCode": "",
  "m_UseCustomFormatter": 0,
  "m_SortOrder": 9,
  "references": {
    "version": 1,
    "00000000": {
      "type": {
        "class": "FallbackLocale",
        "ns": "UnityEngine.Localization.Metadata",
        "asm": "Unity.Localization"
      },
      "data": {}
    }
  }
}