{
  "m_GameObject": {
    "m_FileID": 0,
    "m_PathID": -8942607975531743799
  },
  "m_Enabled": 1,
  "m_Script": {
    "m_FileID": 0,
    "m_PathID": -3470914107750874984
  },
  "m_Name": "",
  "mapLayers": [
    {
      "layerTransform": {
        "m_FileID": 0,
        "m_PathID": -6338609547516464323
      },
      "movementMultiply": 1.0,
      "intervalX": 0.0
    },
    {
      "layerTransform": {
        "m_FileID": 0,
        "m_PathID": 3610812819323065238
      },
      "movementMultiply": 0.6,
      "intervalX": 33.94
    },
    {
      "layerTransform": {
        "m_FileID": 0,
        "m_PathID": 3295120896532248134
      },
      "movementMultiply": 0.0,
      "intervalX": 21.78
    },
    {
      "layerTransform": {
        "m_FileID": 0,
        "m_PathID": -2924983190321317703
      },
      "movementMultiply": 0.2,
      "intervalX": 21.18
    },
    {
      "layerTransform": {
        "m_FileID": 0,
        "m_PathID": -1373032290747113421
      },
      "movementMultiply": 0.4,
      "intervalX": 20.61
    },
    {
      "layerTransform": {
        "m_FileID": 0,
        "m_PathID": -4928475092336928640
      },
      "movementMultiply": 0.6,
      "intervalX": 28.03
    },
    {
      "layerTransform": {
        "m_FileID": 0,
        "m_PathID": 7046718809070185667
      },
      "movementMultiply": 0.8,
      "intervalX": 25.6
    },
    {
      "layerTransform": {
        "m_FileID": 0,
        "m_PathID": 3784651466007540216
      },
      "movementMultiply": 0.995,
      "intervalX": 0.0
    }
  ]
}