{
  "m_GameObject": {
    "m_FileID": 0,
    "m_PathID": -6668895281457943150
  },
  "m_Enabled": 1,
  "m_Script": {
    "m_FileID": 0,
    "m_PathID": -7599779979218967398
  },
  "m_Name": "",
  "rtBody": {
    "m_FileID": 0,
    "m_PathID": 3531150123228822576
  },
  "icon": {
    "m_FileID": 0,
    "m_PathID": 1269920056441960468
  },
  "txtName": {
    "m_FileID": 0,
    "m_PathID": -1129784390937511562
  },
  "txtDesc": {
    "m_FileID": 0,
    "m_PathID": 3580648532360430791
  },
  "sfx": {
    "m_FileID": 0,
    "m_PathID": -5599797519441250985
  }
}