{
  "m_GameObject": {
    "m_FileID": 0,
    "m_PathID": 0
  },
  "m_Enabled": 1,
  "m_Script": {
    "m_FileID": 0,
    "m_PathID": 8302033850027404168
  },
  "m_Name": "10100_pet_SkeletonData",
  "atlasAssets": [
    {
      "m_FileID": 0,
      "m_PathID": 5250867662557618349
    }
  ],
  "scale": 0.01,
  "skeletonJSON": {
    "m_FileID": 0,
    "m_PathID": 3105448739889190445
  },
  "isUpgradingBlendModeMaterials": 0,
  "blendModeMaterials": {
    "requiresBlendModeMaterials": 0,
    "applyAdditiveMaterial": 0,
    "additiveMaterials": [],
    "multiplyMaterials": [],
    "screenMaterials": []
  },
  "skeletonDataModifiers": [],
  "fromAnimation": [],
  "toAnimation": [],
  "duration": [],
  "defaultMix": 0.0,
  "controller": {
    "m_FileID": 0,
    "m_PathID": 0
  }
}