{
  "m_GameObject": {
    "m_FileID": 0,
    "m_PathID": 0
  },
  "m_Enabled": 1,
  "m_Script": {
    "m_FileID": 0,
    "m_PathID": -2766267126516050984
  },
  "m_Name": "AppInfo_ja-JP",
  "m_LocaleId": {
    "m_Code": "ja-JP"
  },
  "m_SharedData": {
    "m_FileID": 1,
    "m_PathID": 8302962764450955531
  },
  "m_Metadata": {
    "m_Items": []
  },
  "m_TableData": [
    {
      "m_Id": 68728557568,
      "m_Localized": "スライム伝説",
      "m_Metadata": {
        "m_Items": []
      }
    }
  ],
  "references": {
    "version": 1,
    "00000000": {
      "type": {
        "class": "Terminus",
        "ns": "UnityEngine.DMAT",
        "asm": "FAKE_ASM"
      },
      "data": {}
    }
  }
}