{
  "m_GameObject": {
    "m_FileID": 0,
    "m_PathID": -2861177058734605232
  },
  "m_Enabled": 1,
  "m_Script": {
    "m_FileID": 0,
    "m_PathID": 2232859162703197723
  },
  "m_Name": "",
  "delay": 1.3,
  "isGameTime": 0
}