{
  "m_GameObject": {
    "m_FileID": 0,
    "m_PathID": 5430707156993573952
  },
  "m_Enabled": 1,
  "m_Script": {
    "m_FileID": 0,
    "m_PathID": -7030229213176759517
  },
  "m_Name": "",
  "m_Material": {
    "m_FileID": 0,
    "m_PathID": 0
  },
  "m_Color": {
    "r": 1.0,
    "g": 1.0,
    "b": 1.0,
    "a": 1.0
  },
  "m_RaycastTarget": 1,
  "m_RaycastPadding": {
    "x": 0.0,
    "y": 0.0,
    "z": 0.0,
    "w": 0.0
  },
  "m_Maskable": 1,
  "m_OnCullStateChanged": {
    "m_PersistentCalls": {
      "m_Calls": []
    }
  },
  "m_Sprite": {
    "m_FileID": 40,
    "m_PathID": -3980525179055782303
  },
  "m_Type": 0,
  "m_PreserveAspect": 1,
  "m_FillCenter": 1,
  "m_FillMethod": 4,
  "m_FillAmount": 1.0,
  "m_FillClockwise": 1,
  "m_FillOrigin": 0,
  "m_UseSpriteMesh": 0,
  "m_PixelsPerUnitMultiplier": 1.0
}