{
  "m_GameObject": {
    "m_FileID": 0,
    "m_PathID": 0
  },
  "m_Enabled": 1,
  "m_Script": {
    "m_FileID": 0,
    "m_PathID": -1326188021205359011
  },
  "m_Name": "Animation Track (5)",
  "m_Version": 3,
  "m_AnimClip": {
    "m_FileID": 0,
    "m_PathID": 0
  },
  "m_Locked": 0,
  "m_Muted": 0,
  "m_CustomPlayableFullTypename": "",
  "m_Curves": {
    "m_FileID": 0,
    "m_PathID": 0
  },
  "m_Parent": {
    "m_FileID": 0,
    "m_PathID": 1938567467434192857
  },
  "m_Children": [],
  "m_Clips": [
    {
      "m_Version": 1,
      "m_Start": 0.58333333333333359,
      "m_ClipIn": 0.0,
      "m_Asset": {
        "m_FileID": 0,
        "m_PathID": 7534717543809765759
      },
      "m_Duration": 0.26666666666666672,
      "m_TimeScale": 1.0,
      "m_ParentTrack": {
        "m_FileID": 0,
        "m_PathID": 3131251861202549431
      },
      "m_EaseInDuration": 0.0,
      "m_EaseOutDuration": 0.0,
      "m_BlendInDuration": -1.0,
      "m_BlendOutDuration": -1.0,
      "m_MixInCurve": {
        "m_Curve": [
          {
            "time": 0.0,
            "value": 0.0,
            "inSlope": 0.0,
            "outSlope": 0.0,
            "weightedMode": 0,
            "inWeight": 0.0,
            "outWeight": 0.0
          },
          {
            "time": 1.0,
            "value": 1.0,
            "inSlope": 0.0,
            "outSlope": 0.0,
            "weightedMode": 0,
            "inWeight": 0.0,
            "outWeight": 0.0
          }
        ],
        "m_PreInfinity": 2,
        "m_PostInfinity": 2,
        "m_RotationOrder": 4
      },
      "m_MixOutCurve": {
        "m_Curve": [
          {
            "time": 0.0,
            "value": 1.0,
            "inSlope": 0.0,
            "outSlope": 0.0,
            "weightedMode": 0,
            "inWeight": 0.0,
            "outWeight": 0.0
          },
          {
            "time": 1.0,
            "value": 0.0,
            "inSlope": 0.0,
            "outSlope": 0.0,
            "weightedMode": 0,
            "inWeight": 0.0,
            "outWeight": 0.0
          }
        ],
        "m_PreInfinity": 2,
        "m_PostInfinity": 2,
        "m_RotationOrder": 4
      },
      "m_BlendInCurveMode": 0,
      "m_BlendOutCurveMode": 0,
      "m_ExposedParameterNames": [],
      "m_AnimationCurves": {
        "m_FileID": 0,
        "m_PathID": 0
      },
      "m_Recordable": 1,
      "m_PostExtrapolationMode": 1,
      "m_PreExtrapolationMode": 1,
      "m_PostExtrapolationTime": "Infinity",
      "m_PreExtrapolationTime": 0.0,
      "m_DisplayName": "Recorded_3"
    },
    {
      "m_Version": 1,
      "m_Start": 0.0,
      "m_ClipIn": 0.33333333333333331,
      "m_Asset": {
        "m_FileID": 0,
        "m_PathID": -3441814733114035191
      },
      "m_Duration": 0.41666666666666669,
      "m_TimeScale": 1.0,
      "m_ParentTrack": {
        "m_FileID": 0,
        "m_PathID": 3131251861202549431
      },
      "m_EaseInDuration": 0.0,
      "m_EaseOutDuration": 0.0,
      "m_BlendInDuration": -1.0,
      "m_BlendOutDuration": -1.0,
      "m_MixInCurve": {
        "m_Curve": [
          {
            "time": 0.0,
            "value": 0.0,
            "inSlope": 0.0,
            "outSlope": 0.0,
            "weightedMode": 0,
            "inWeight": 0.0,
            "outWeight": 0.0
          },
          {
            "time": 1.0,
            "value": 1.0,
            "inSlope": 0.0,
            "outSlope": 0.0,
            "weightedMode": 0,
            "inWeight": 0.0,
            "outWeight": 0.0
          }
        ],
        "m_PreInfinity": 2,
        "m_PostInfinity": 2,
        "m_RotationOrder": 4
      },
      "m_MixOutCurve": {
        "m_Curve": [
          {
            "time": 0.0,
            "value": 1.0,
            "inSlope": 0.0,
            "outSlope": 0.0,
            "weightedMode": 0,
            "inWeight": 0.0,
            "outWeight": 0.0
          },
          {
            "time": 1.0,
            "value": 0.0,
            "inSlope": 0.0,
            "outSlope": 0.0,
            "weightedMode": 0,
            "inWeight": 0.0,
            "outWeight": 0.0
          }
        ],
        "m_PreInfinity": 2,
        "m_PostInfinity": 2,
        "m_RotationOrder": 4
      },
      "m_BlendInCurveMode": 0,
      "m_BlendOutCurveMode": 0,
      "m_ExposedParameterNames": [],
      "m_AnimationCurves": {
        "m_FileID": 0,
        "m_PathID": 0
      },
      "m_Recordable": 1,
      "m_PostExtrapolationMode": 1,
      "m_PreExtrapolationMode": 1,
      "m_PostExtrapolationTime": 0.16666666666666691,
      "m_PreExtrapolationTime": 0.0,
      "m_DisplayName": "Recorded_16"
    }
  ],
  "m_Markers": {
    "m_Objects": []
  },
  "m_InfiniteClipPreExtrapolation": 1,
  "m_InfiniteClipPostExtrapolation": 1,
  "m_InfiniteClipOffsetPosition": {
    "x": 0.0,
    "y": 0.0,
    "z": 0.0
  },
  "m_InfiniteClipOffsetEulerAngles": {
    "x": 0.0,
    "y": 0.0,
    "z": 0.0
  },
  "m_InfiniteClipTimeOffset": 0.0,
  "m_InfiniteClipRemoveOffset": 0,
  "m_InfiniteClipApplyFootIK": 1,
  "mInfiniteClipLoop": 0,
  "m_MatchTargetFields": 63,
  "m_Position": {
    "x": 0.0,
    "y": 0.0,
    "z": 0.0
  },
  "m_EulerAngles": {
    "x": 0.0,
    "y": 0.0,
    "z": 0.0
  },
  "m_AvatarMask": {
    "m_FileID": 0,
    "m_PathID": 0
  },
  "m_ApplyAvatarMask": 1,
  "m_TrackOffset": 0,
  "m_InfiniteClip": {
    "m_FileID": 0,
    "m_PathID": 0
  },
  "m_OpenClipOffsetRotation": {
    "x": 0.0,
    "y": 0.0,
    "z": 0.0,
    "w": 1.0
  },
  "m_Rotation": {
    "x": 0.0,
    "y": 0.0,
    "z": 0.0,
    "w": 1.0
  },
  "m_ApplyOffsets": 0
}