{
  "m_GameObject": {
    "m_FileID": 0,
    "m_PathID": 6724541457454168383
  },
  "m_Enabled": 1,
  "m_Script": {
    "m_FileID": 0,
    "m_PathID": 8783603140513068743
  },
  "m_Name": "",
  "moveOffsetPerSec": {
    "x": -0.2,
    "y": 0.2
  },
  "isIgnoreTimeScale": 0
}