{
  "m_GameObject": {
    "m_FileID": 0,
    "m_PathID": -2228427442340386390
  },
  "m_Enabled": 1,
  "m_Script": {
    "m_FileID": 0,
    "m_PathID": -2496028358499895848
  },
  "m_Name": "",
  "flareImage": {
    "m_FileID": 0,
    "m_PathID": 8493062503298789920
  },
  "iconImage": {
    "m_FileID": 0,
    "m_PathID": 6695838935144984572
  },
  "bgImage": {
    "m_FileID": 0,
    "m_PathID": 9181317335078778266
  },
  "typeIconImage": {
    "m_FileID": 0,
    "m_PathID": 7603126314055959823
  }
}