{
  "m_GameObject": {
    "m_FileID": 0,
    "m_PathID": 717655517865544097
  },
  "m_Enabled": 1,
  "m_Script": {
    "m_FileID": 0,
    "m_PathID": -4500489124341479608
  },
  "m_Name": "",
  "border": {
    "m_FileID": 0,
    "m_PathID": 723003342368799825
  },
  "bgLevel": {
    "m_FileID": 0,
    "m_PathID": 7921111723080209390
  },
  "txtLevel": {
    "m_FileID": 0,
    "m_PathID": 4544593325455685362
  },
  "premium": {
    "m_FileID": 0,
    "m_PathID": 3671596335829372202
  },
  "normal": {
    "m_FileID": 0,
    "m_PathID": 6897200394263036483
  }
}