{
  "m_GameObject": {
    "m_FileID": 0,
    "m_PathID": -4512146460554841226
  },
  "m_Enabled": 1,
  "m_Script": {
    "m_FileID": 0,
    "m_PathID": 2583973574143635226
  },
  "m_Name": "",
  "prefab": {
    "m_FileID": 0,
    "m_PathID": -421954288418351591
  },
  "notification": 0,
  "strategy": 0,
  "preload": 0,
  "capacity": 0,
  "recycle": 0,
  "persist": 0,
  "stamp": 0,
  "warnings": 1,
  "spawnedClonesList": [],
  "despawnedClones": [],
  "delays": [],
  "deactivatedChild": {
    "m_FileID": 0,
    "m_PathID": 0
  }
}