{
  "m_GameObject": {
    "m_FileID": 0,
    "m_PathID": 0
  },
  "m_Enabled": 1,
  "m_Script": {
    "m_FileID": 0,
    "m_PathID": 1008803689438726606
  },
  "m_Name": "10002_slime_skill_hydra_Atlas",
  "atlasFile": {
    "m_FileID": 0,
    "m_PathID": -1257165596004664002
  },
  "materials": [
    {
      "m_FileID": 0,
      "m_PathID": -3921477765879675313
    }
  ]
}