{
  "m_GameObject": {
    "m_FileID": 0,
    "m_PathID": -3704255301749470447
  },
  "m_Enabled": 1,
  "m_Script": {
    "m_FileID": 0,
    "m_PathID": 5399837883549229853
  },
  "m_Name": "",
  "idleAnim": "idle",
  "attackAnim": "attack",
  "vfxHit": {
    "m_FileID": 15,
    "m_PathID": 216740879095649614
  },
  "sfxHit": {
    "m_FileID": 13,
    "m_PathID": 2250040703668492235
  },
  "speed": 18.0,
  "attackDelay": 0.3,
  "targetingOffset": {
    "x": 0.0,
    "y": 0.0,
    "z": 0.0
  }
}