{
  "m_GameObject": {
    "m_FileID": 0,
    "m_PathID": 4189477317710863377
  },
  "m_Enabled": 1,
  "m_Script": {
    "m_FileID": 0,
    "m_PathID": -3292782308001767655
  },
  "m_Name": "",
  "onDeathUnityEvent": {
    "m_PersistentCalls": {
      "m_Calls": [
        {
          "m_Target": {
            "m_FileID": 0,
            "m_PathID": -7035416122979171842
          },
          "m_TargetAssemblyTypeName": "UnityEngine.GameObject, UnityEngine",
          "m_MethodName": "SetActive",
          "m_Mode": 6,
          "m_Arguments": {
            "m_ObjectArgument": {
              "m_FileID": 0,
              "m_PathID": 0
            },
            "m_ObjectArgumentAssemblyTypeName": "UnityEngine.Object, UnityEngine",
            "m_IntArgument": 0,
            "m_FloatArgument": 0.0,
            "m_StringArgument": "",
            "m_BoolArgument": 0
          },
          "m_CallState": 2
        }
      ]
    }
  },
  "onInitUnityEvent": {
    "m_PersistentCalls": {
      "m_Calls": [
        {
          "m_Target": {
            "m_FileID": 0,
            "m_PathID": -7035416122979171842
          },
          "m_TargetAssemblyTypeName": "UnityEngine.GameObject, UnityEngine",
          "m_MethodName": "SetActive",
          "m_Mode": 6,
          "m_Arguments": {
            "m_ObjectArgument": {
              "m_FileID": 0,
              "m_PathID": 0
            },
            "m_ObjectArgumentAssemblyTypeName": "UnityEngine.Object, UnityEngine",
            "m_IntArgument": 0,
            "m_FloatArgument": 0.0,
            "m_StringArgument": "",
            "m_BoolArgument": 1
          },
          "m_CallState": 2
        }
      ]
    }
  }
}