{
  "m_GameObject": {
    "m_FileID": 0,
    "m_PathID": 40
  },
  "m_Enabled": 1,
  "m_Script": {
    "m_FileID": 1,
    "m_PathID": 25
  },
  "m_Name": "",
  "m_FirstSelected": {
    "m_FileID": 0,
    "m_PathID": 0
  },
  "m_sendNavigationEvents": 1,
  "m_DragThreshold": 10
}