{
  "m_GameObject": {
    "m_FileID": 0,
    "m_PathID": 5250937698193468310
  },
  "m_Enabled": 1,
  "m_Script": {
    "m_FileID": 0,
    "m_PathID": -8003026171790460603
  },
  "m_Name": "",
  "bindKey": "EquipButtonState"
}