{
  "m_GameObject": {
    "m_FileID": 0,
    "m_PathID": -6209301430752367026
  },
  "m_Enabled": 1,
  "m_Script": {
    "m_FileID": 0,
    "m_PathID": 7696911235791636546
  },
  "m_Name": "",
  "bindKey": "BreakupButtonMaterial"
}