{
  "m_GameObject": {
    "m_FileID": 0,
    "m_PathID": 5144879807662465417
  },
  "m_Enabled": 1,
  "m_Script": {
    "m_FileID": 0,
    "m_PathID": -6938409698251234290
  },
  "m_Name": "",
  "m_Material": {
    "m_FileID": 5,
    "m_PathID": 1869315399850166803
  },
  "m_Color": {
    "r": 1.0,
    "g": 1.0,
    "b": 1.0,
    "a": 1.0
  },
  "m_RaycastTarget": 1,
  "m_RaycastPadding": {
    "x": 0.0,
    "y": 0.0,
    "z": 0.0,
    "w": 0.0
  },
  "m_Maskable": 1,
  "m_OnCullStateChanged": {
    "m_PersistentCalls": {
      "m_Calls": []
    }
  },
  "skeletonDataAsset": {
    "m_FileID": 33,
    "m_PathID": -3511852057670460766
  },
  "initialSkinName": "",
  "initialFlipX": 0,
  "initialFlipY": 0,
  "startingAnimation": "idle_front",
  "startingLoop": 1,
  "timeScale": 1.0,
  "freeze": 0,
  "updateWhenInvisible": 3,
  "unscaledTime": 0,
  "allowMultipleCanvasRenderers": 0,
  "canvasRenderers": [],
  "separatorSlotNames": [],
  "enableSeparatorSlots": 0,
  "separatorParts": [],
  "updateSeparatorPartLocation": 1,
  "meshGenerator": {
    "settings": {
      "useClipping": 1,
      "zSpacing": 0.0,
      "pmaVertexColors": 1,
      "tintBlack": 0,
      "canvasGroupTintBlack": 0,
      "calculateTangents": 0,
      "addNormals": 0,
      "immutableTriangles": 0
    }
  }
}