{
  "m_GameObject": {
    "m_FileID": 0,
    "m_PathID": 6634690564952520512
  },
  "m_Enabled": 1,
  "m_Script": {
    "m_FileID": 3,
    "m_PathID": 8806312759750168707
  },
  "m_Name": "",
  "bindKey": "OnClick"
}