{
  "m_GameObject": {
    "m_FileID": 0,
    "m_PathID": -8214565084406396405
  },
  "m_Enabled": 1,
  "m_Script": {
    "m_FileID": 0,
    "m_PathID": -3242970711442325531
  },
  "m_Name": "",
  "bindKey": "item.Stay",
  "isReverse": 0
}