{
  "m_GameObject": {
    "m_FileID": 0,
    "m_PathID": -3031672846913594055
  },
  "m_Enabled": 1,
  "m_Script": {
    "m_FileID": 0,
    "m_PathID": 5713106451965302293
  },
  "m_Name": "",
  "canvasGroup": {
    "m_FileID": 0,
    "m_PathID": -8143049743627911654
  },
  "popupMessage": {
    "m_FileID": 0,
    "m_PathID": -2423167415934254972
  }
}