{
  "m_GameObject": {
    "m_FileID": 0,
    "m_PathID": -1848967151897974947
  },
  "m_Enabled": 1,
  "m_Script": {
    "m_FileID": 3,
    "m_PathID": 1449891033392876518
  },
  "m_Name": "",
  "setNativeSize": 0,
  "syncPivot": 0,
  "m_Key": "DungeonImage"
}