{
  "m_GameObject": {
    "m_FileID": 0,
    "m_PathID": -103307133282955389
  },
  "m_Enabled": 1,
  "m_Script": {
    "m_FileID": 0,
    "m_PathID": 4359743594794679304
  },
  "m_Name": "",
  "ConformX": 0,
  "ConformY": 1,
  "Logging": 0
}