{
  "m_GameObject": {
    "m_FileID": 0,
    "m_PathID": -9074891481242288310
  },
  "m_Enabled": 1,
  "m_Script": {
    "m_FileID": 0,
    "m_PathID": 7837370324791630998
  },
  "m_Name": "",
  "view": {
    "m_FileID": 0,
    "m_PathID": 9019826235753706836
  },
  "timerIndicator": {
    "m_FileID": 0,
    "m_PathID": 7303482472349779375
  },
  "earnSfx": {
    "m_FileID": 6,
    "m_PathID": -2448843806791463484
  }
}