{
  "m_GameObject": {
    "m_FileID": 0,
    "m_PathID": -4908834423421756974
  },
  "m_Enabled": 1,
  "m_Script": {
    "m_FileID": 0,
    "m_PathID": 1117752915966211304
  },
  "m_Name": "",
  "width": 1.67,
  "scaleSyncTarget": {
    "m_FileID": 0,
    "m_PathID": -5816552199991125209
  }
}