{
  "m_GameObject": {
    "m_FileID": 0,
    "m_PathID": -6473432165288894408
  },
  "m_Enabled": 1,
  "m_Script": {
    "m_FileID": 4,
    "m_PathID": 5430390970507557720
  },
  "m_Name": "",
  "onEnable": {
    "m_PersistentCalls": {
      "m_Calls": []
    }
  },
  "onChangedRedDotActive": {
    "m_PersistentCalls": {
      "m_Calls": [
        {
          "m_Target": {
            "m_FileID": 0,
            "m_PathID": 3513035209089525986
          },
          "m_TargetAssemblyTypeName": "LoadComplete.UI.RedDotAnimator, Assembly-CSharp",
          "m_MethodName": "OnChangedEnable",
          "m_Mode": 0,
          "m_Arguments": {
            "m_ObjectArgument": {
              "m_FileID": 0,
              "m_PathID": 0
            },
            "m_ObjectArgumentAssemblyTypeName": "UnityEngine.Object, UnityEngine",
            "m_IntArgument": 0,
            "m_FloatArgument": 0.0,
            "m_StringArgument": "",
            "m_BoolArgument": 0
          },
          "m_CallState": 2
        }
      ]
    }
  },
  "redDotObjects": [
    {
      "m_FileID": 0,
      "m_PathID": 720274590604135425
    }
  ]
}