{
  "m_GameObject": {
    "m_FileID": 0,
    "m_PathID": -2810251100116921919
  },
  "m_Enabled": 1,
  "m_Script": {
    "m_FileID": 0,
    "m_PathID": -8287268331135866272
  },
  "m_Name": "",
  "saleRibbonObj": {
    "m_FileID": 0,
    "m_PathID": 977621085756656734
  },
  "saleRibbonText": {
    "m_FileID": 0,
    "m_PathID": -2564145054184099224
  },
  "purchaseButton": {
    "m_FileID": 0,
    "m_PathID": 1738326032249479130
  },
  "priceText": {
    "m_FileID": 0,
    "m_PathID": -7572360419810464955
  },
  "autoSetTitle": 1,
  "titleText": {
    "m_FileID": 0,
    "m_PathID": -5590939236667523112
  },
  "purchaseCountText": {
    "m_FileID": 0,
    "m_PathID": -2829569429276815790
  },
  "remainTimeObj": {
    "m_FileID": 0,
    "m_PathID": -8150634732477804622
  },
  "remainTimeText": {
    "m_FileID": 0,
    "m_PathID": -537481815154158106
  },
  "rewardSlotArray": [
    {
      "m_FileID": 0,
      "m_PathID": -2669159407267501872
    },
    {
      "m_FileID": 0,
      "m_PathID": -9079465448551511352
    },
    {
      "m_FileID": 0,
      "m_PathID": -8587236677487393781
    },
    {
      "m_FileID": 0,
      "m_PathID": -2069400400767873836
    },
    {
      "m_FileID": 0,
      "m_PathID": 7127581660189540457
    }
  ],
  "rewardValueTextArray": [
    {
      "m_FileID": 0,
      "m_PathID": 3311049521292644984
    },
    {
      "m_FileID": 0,
      "m_PathID": 4699829775305856592
    },
    {
      "m_FileID": 0,
      "m_PathID": -3780310433548047998
    },
    {
      "m_FileID": 0,
      "m_PathID": -6608381272744418999
    },
    {
      "m_FileID": 0,
      "m_PathID": 3738076478084531671
    }
  ]
}