{
  "m_GameObject": {
    "m_FileID": 0,
    "m_PathID": 1913026517451029333
  },
  "m_Enabled": 1,
  "m_Script": {
    "m_FileID": 0,
    "m_PathID": 1117752915966211304
  },
  "m_Name": "",
  "width": 0.97,
  "scaleSyncTarget": {
    "m_FileID": 0,
    "m_PathID": 0
  }
}