{
  "m_GameObject": {
    "m_FileID": 0,
    "m_PathID": -3011594201801756993
  },
  "m_Enabled": 1,
  "m_Script": {
    "m_FileID": 0,
    "m_PathID": -8091456346061954500
  },
  "m_Name": "",
  "m_Padding": {
    "m_Left": 40,
    "m_Right": 40,
    "m_Top": 15,
    "m_Bottom": 15
  },
  "m_ChildAlignment": 4,
  "m_Spacing": 13.1,
  "m_ChildForceExpandWidth": 0,
  "m_ChildForceExpandHeight": 0,
  "m_ChildControlWidth": 1,
  "m_ChildControlHeight": 0,
  "m_ChildScaleWidth": 0,
  "m_ChildScaleHeight": 0,
  "m_ReverseArrangement": 0
}