{
  "m_GameObject": {
    "m_FileID": 0,
    "m_PathID": 1609831967755621808
  },
  "m_Enabled": 1,
  "m_Script": {
    "m_FileID": 1,
    "m_PathID": 8962903080549542158
  },
  "m_Name": "",
  "localizeKey": "",
  "fontMaterial": {
    "m_FileID": 10,
    "m_PathID": -3908306431980676367
  },
  "overrideFonts": []
}