{
  "m_GameObject": {
    "m_FileID": 0,
    "m_PathID": -6845348866029163323
  },
  "m_Enabled": 1,
  "m_Script": {
    "m_FileID": 0,
    "m_PathID": 4985593579610109070
  },
  "m_Name": "",
  "rtBackground": {
    "m_FileID": 0,
    "m_PathID": -6724066961311243812
  },
  "rtDesc": {
    "m_FileID": 0,
    "m_PathID": 4896637405085451608
  },
  "imgMask": {
    "m_FileID": 0,
    "m_PathID": -8587586337419015422
  },
  "txtDesc": {
    "m_FileID": 0,
    "m_PathID": 1032105067196699863
  },
  "csf": {
    "m_FileID": 0,
    "m_PathID": -2895255023497824829
  }
}