{
  "m_GameObject": {
    "m_FileID": 0,
    "m_PathID": 0
  },
  "m_Enabled": 1,
  "m_Script": {
    "m_FileID": 0,
    "m_PathID": -1326188021205359011
  },
  "m_Name": "Animation Track",
  "m_Version": 3,
  "m_AnimClip": {
    "m_FileID": 0,
    "m_PathID": 0
  },
  "m_Locked": 0,
  "m_Muted": 0,
  "m_CustomPlayableFullTypename": "",
  "m_Curves": {
    "m_FileID": 0,
    "m_PathID": 0
  },
  "m_Parent": {
    "m_FileID": 0,
    "m_PathID": -707216678715994006
  },
  "m_Children": [],
  "m_Clips": [],
  "m_Markers": {
    "m_Objects": []
  },
  "m_InfiniteClipPreExtrapolation": 1,
  "m_InfiniteClipPostExtrapolation": 1,
  "m_InfiniteClipOffsetPosition": {
    "x": -0.023999989,
    "y": 1.39502,
    "z": 0.0
  },
  "m_InfiniteClipOffsetEulerAngles": {
    "x": 0.0,
    "y": 0.0,
    "z": 0.0
  },
  "m_InfiniteClipTimeOffset": 0.0,
  "m_InfiniteClipRemoveOffset": 0,
  "m_InfiniteClipApplyFootIK": 1,
  "mInfiniteClipLoop": 0,
  "m_MatchTargetFields": 63,
  "m_Position": {
    "x": 0.0,
    "y": 0.0,
    "z": 0.0
  },
  "m_EulerAngles": {
    "x": 0.0,
    "y": 0.0,
    "z": 0.0
  },
  "m_AvatarMask": {
    "m_FileID": 0,
    "m_PathID": 0
  },
  "m_ApplyAvatarMask": 1,
  "m_TrackOffset": 0,
  "m_InfiniteClip": {
    "m_FileID": 0,
    "m_PathID": -3523798198845142691
  },
  "m_OpenClipOffsetRotation": {
    "x": 0.0,
    "y": 0.0,
    "z": 0.0,
    "w": 1.0
  },
  "m_Rotation": {
    "x": 0.0,
    "y": 0.0,
    "z": 0.0,
    "w": 1.0
  },
  "m_ApplyOffsets": 0
}