{
  "m_GameObject": {
    "m_FileID": 0,
    "m_PathID": 0
  },
  "m_Enabled": 1,
  "m_Script": {
    "m_FileID": 0,
    "m_PathID": 1008803689438726606
  },
  "m_Name": "201_goblin_legion_Atlas",
  "atlasFile": {
    "m_FileID": 0,
    "m_PathID": -751410412828827033
  },
  "materials": [
    {
      "m_FileID": 0,
      "m_PathID": -78858656402627634
    }
  ]
}