{
  "m_GameObject": {
    "m_FileID": 0,
    "m_PathID": 2917071283781210130
  },
  "m_Enabled": 1,
  "m_Script": {
    "m_FileID": 0,
    "m_PathID": -1277927121671302411
  },
  "m_Name": "",
  "root": {
    "m_FileID": 0,
    "m_PathID": -839783542974535631
  },
  "despawnDelay": 0.0,
  "disableObjectsWhenOnHit": [],
  "onFireEvent": {
    "m_PersistentCalls": {
      "m_Calls": []
    }
  },
  "onHitEvent": {
    "m_PersistentCalls": {
      "m_Calls": []
    }
  },
  "trailTransform": {
    "m_FileID": 0,
    "m_PathID": 0
  },
  "overrideJump": 0,
  "overrideJumpValue": 0.0,
  "fireVfxPrefab": {
    "m_FileID": 0,
    "m_PathID": 0
  },
  "explosionVfxPrefab": {
    "m_FileID": 13,
    "m_PathID": -6830171919290742268
  },
  "rotateType": 2,
  "rotateSpeed": 360.0,
  "fireSfx": {
    "clip": {
      "m_FileID": 13,
      "m_PathID": 8340867033459350398
    },
    "volume": 1.0
  },
  "hitSfx": {
    "clip": {
      "m_FileID": 0,
      "m_PathID": 0
    },
    "volume": 1.0
  }
}