{
  "m_GameObject": {
    "m_FileID": 0,
    "m_PathID": -4005633285315894043
  },
  "m_Enabled": 1,
  "m_Script": {
    "m_FileID": 0,
    "m_PathID": 2232859162703197723
  },
  "m_Name": "",
  "delay": 4.0,
  "isGameTime": 0
}