{
  "m_GameObject": {
    "m_FileID": 0,
    "m_PathID": 2777534387238210029
  },
  "m_Enabled": 1,
  "m_Script": {
    "m_FileID": 0,
    "m_PathID": -5270946368720916046
  },
  "m_Name": "",
  "Use": {
    "Filter": 0,
    "IgnoreStartedOverGui": 0,
    "RequiredFingerCount": 0,
    "RequiredMouseButtons": 0,
    "RequiredSelectable": {
      "m_FileID": 0,
      "m_PathID": 6314104758909324690
    }
  },
  "_camera": {
    "m_FileID": 0,
    "m_PathID": 1395509275657316216
  },
  "sensitivity": 1.0,
  "damping": -1.0,
  "inertia": 0.0,
  "dragThreshold": 20.0,
  "onDragStart": {
    "m_PersistentCalls": {
      "m_Calls": [
        {
          "m_Target": {
            "m_FileID": 0,
            "m_PathID": 321605314100514581
          },
          "m_TargetAssemblyTypeName": "LoadComplete.UI.PopupMine, Assembly-CSharp",
          "m_MethodName": "OnDrillDragStart",
          "m_Mode": 0,
          "m_Arguments": {
            "m_ObjectArgument": {
              "m_FileID": 0,
              "m_PathID": 0
            },
            "m_ObjectArgumentAssemblyTypeName": "UnityEngine.Object, UnityEngine",
            "m_IntArgument": 0,
            "m_FloatArgument": 0.0,
            "m_StringArgument": "",
            "m_BoolArgument": 0
          },
          "m_CallState": 2
        }
      ]
    }
  },
  "onDragEnd": {
    "m_PersistentCalls": {
      "m_Calls": []
    }
  },
  "remainingTranslation": {
    "x": 0.0,
    "y": 0.0,
    "z": 0.0
  }
}