{
  "m_GameObject": {
    "m_FileID": 0,
    "m_PathID": 7889646572741473950
  },
  "m_Enabled": 1,
  "m_Script": {
    "m_FileID": 0,
    "m_PathID": -5755350681981302373
  },
  "m_Name": "",
  "m_Material": {
    "m_FileID": 0,
    "m_PathID": 0
  },
  "m_Color": {
    "r": 1.0,
    "g": 1.0,
    "b": 1.0,
    "a": 1.0
  },
  "m_RaycastTarget": 0,
  "m_RaycastPadding": {
    "x": 0.0,
    "y": 0.0,
    "z": 0.0,
    "w": 0.0
  },
  "m_Maskable": 1,
  "m_OnCullStateChanged": {
    "m_PersistentCalls": {
      "m_Calls": []
    }
  },
  "m_text": "x00000",
  "m_isRightToLeft": 0,
  "m_fontAsset": {
    "m_FileID": 2,
    "m_PathID": 9122729429653711774
  },
  "m_sharedMaterial": {
    "m_FileID": 3,
    "m_PathID": 379438189239238212
  },
  "m_fontSharedMaterials": [],
  "m_fontMaterial": {
    "m_FileID": 0,
    "m_PathID": 0
  },
  "m_fontMaterials": [],
  "m_fontColor32": {
    "rgba": 4294967295
  },
  "m_fontColor": {
    "r": 1.0,
    "g": 1.0,
    "b": 1.0,
    "a": 1.0
  },
  "m_enableVertexGradient": 0,
  "m_colorMode": 3,
  "m_fontColorGradient": {
    "topLeft": {
      "r": 1.0,
      "g": 1.0,
      "b": 1.0,
      "a": 1.0
    },
    "topRight": {
      "r": 1.0,
      "g": 1.0,
      "b": 1.0,
      "a": 1.0
    },
    "bottomLeft": {
      "r": 1.0,
      "g": 1.0,
      "b": 1.0,
      "a": 1.0
    },
    "bottomRight": {
      "r": 1.0,
      "g": 1.0,
      "b": 1.0,
      "a": 1.0
    }
  },
  "m_fontColorGradientPreset": {
    "m_FileID": 0,
    "m_PathID": 0
  },
  "m_spriteAsset": {
    "m_FileID": 0,
    "m_PathID": 0
  },
  "m_tintAllSprites": 0,
  "m_StyleSheet": {
    "m_FileID": 0,
    "m_PathID": 0
  },
  "m_TextStyleHashCode": -1183493901,
  "m_overrideHtmlColors": 0,
  "m_faceColor": {
    "rgba": 4294967295
  },
  "m_fontSize": 24.0,
  "m_fontSizeBase": 36.0,
  "m_fontWeight": 400,
  "m_enableAutoSizing": 1,
  "m_fontSizeMin": 0.0,
  "m_fontSizeMax": 24.0,
  "m_fontStyle": 0,
  "m_HorizontalAlignment": 2,
  "m_VerticalAlignment": 4096,
  "m_textAlignment": 65535,
  "m_characterSpacing": 0.0,
  "m_wordSpacing": 0.0,
  "m_lineSpacing": 0.0,
  "m_lineSpacingMax": 0.0,
  "m_paragraphSpacing": 0.0,
  "m_charWidthMaxAdj": 0.0,
  "m_enableWordWrapping": 0,
  "m_wordWrappingRatios": 0.4,
  "m_overflowMode": 0,
  "m_linkedTextComponent": {
    "m_FileID": 0,
    "m_PathID": 0
  },
  "parentLinkedComponent": {
    "m_FileID": 0,
    "m_PathID": 0
  },
  "m_enableKerning": 1,
  "m_enableExtraPadding": 0,
  "checkPaddingRequired": 0,
  "m_isRichText": 1,
  "m_parseCtrlCharacters": 1,
  "m_isOrthographic": 1,
  "m_isCullingEnabled": 0,
  "m_horizontalMapping": 0,
  "m_verticalMapping": 0,
  "m_uvLineOffset": 0.0,
  "m_geometrySortingOrder": 0,
  "m_IsTextObjectScaleStatic": 0,
  "m_VertexBufferAutoSizeReduction": 0,
  "m_useMaxVisibleDescender": 1,
  "m_pageToDisplay": 1,
  "m_margin": {
    "x": 0.0,
    "y": 0.0,
    "z": 0.0,
    "w": 0.0
  },
  "m_isUsingLegacyAnimationComponent": 0,
  "m_isVolumetricText": 0,
  "m_hasFontAssetChanged": 0,
  "m_baseMaterial": {
    "m_FileID": 0,
    "m_PathID": 0
  },
  "m_maskOffset": {
    "x": 0.0,
    "y": 0.0,
    "z": 0.0,
    "w": 0.0
  }
}