{
  "m_GameObject": {
    "m_FileID": 0,
    "m_PathID": -8155779973271036500
  },
  "m_Enabled": 1,
  "m_Script": {
    "m_FileID": 0,
    "m_PathID": -8940529911906571770
  },
  "m_Name": "",
  "ignoreList": [],
  "bindables": [
    {
      "m_FileID": 0,
      "m_PathID": -7529948858148568574
    },
    {
      "m_FileID": 0,
      "m_PathID": 2270160838307922871
    },
    {
      "m_FileID": 0,
      "m_PathID": -4364267602993323922
    },
    {
      "m_FileID": 0,
      "m_PathID": 348497438570903617
    },
    {
      "m_FileID": 0,
      "m_PathID": 8532979240019052389
    },
    {
      "m_FileID": 0,
      "m_PathID": 6310597222272363455
    }
  ]
}