{
  "m_GameObject": {
    "m_FileID": 0,
    "m_PathID": -8271360375390268865
  },
  "m_Enabled": 1,
  "m_Script": {
    "m_FileID": 0,
    "m_PathID": 8962903080549542158
  },
  "m_Name": "",
  "localizeKey": "PROMO_DESC",
  "fontMaterial": {
    "m_FileID": 2,
    "m_PathID": 379438189239238212
  },
  "overrideFonts": []
}