{
  "m_GameObject": {
    "m_FileID": 0,
    "m_PathID": 1500927742562847967
  },
  "m_Enabled": 1,
  "m_Script": {
    "m_FileID": 1,
    "m_PathID": 8962903080549542158
  },
  "m_Name": "",
  "localizeKey": "MASTERY_RESET",
  "fontMaterial": {
    "m_FileID": 22,
    "m_PathID": 1373387614849308315
  },
  "overrideFonts": []
}