{
  "m_GameObject": {
    "m_FileID": 0,
    "m_PathID": -8820984158412445241
  },
  "m_Enabled": 1,
  "m_Script": {
    "m_FileID": 0,
    "m_PathID": -4752136978088684776
  },
  "m_Name": "",
  "fillMask": {
    "m_FileID": 0,
    "m_PathID": -2467640721835125994
  }
}