{
  "m_GameObject": {
    "m_FileID": 0,
    "m_PathID": -2366760702025999376
  },
  "m_Enabled": 1,
  "m_Script": {
    "m_FileID": 0,
    "m_PathID": 1128965972909798161
  },
  "m_Name": "",
  "rtBody": {
    "m_FileID": 0,
    "m_PathID": 3507825906392872450
  },
  "context": {
    "m_FileID": 0,
    "m_PathID": -3374707441301152960
  }
}