{
  "m_GameObject": {
    "m_FileID": 0,
    "m_PathID": 0
  },
  "m_Enabled": 1,
  "m_Script": {
    "m_FileID": 0,
    "m_PathID": -367257248164769705
  },
  "m_Name": "Audio Track",
  "m_Version": 3,
  "m_AnimClip": {
    "m_FileID": 0,
    "m_PathID": 0
  },
  "m_Locked": 0,
  "m_Muted": 0,
  "m_CustomPlayableFullTypename": "",
  "m_Curves": {
    "m_FileID": 0,
    "m_PathID": 0
  },
  "m_Parent": {
    "m_FileID": 0,
    "m_PathID": -4688059702142302833
  },
  "m_Children": [],
  "m_Clips": [
    {
      "m_Version": 1,
      "m_Start": 0.066666666666666666,
      "m_ClipIn": 0.0,
      "m_Asset": {
        "m_FileID": 0,
        "m_PathID": -895158892381183382
      },
      "m_Duration": 0.856625,
      "m_TimeScale": 1.0,
      "m_ParentTrack": {
        "m_FileID": 0,
        "m_PathID": -5065117754319959485
      },
      "m_EaseInDuration": 0.0,
      "m_EaseOutDuration": 0.0,
      "m_BlendInDuration": -1.0,
      "m_BlendOutDuration": -1.0,
      "m_MixInCurve": {
        "m_Curve": [
          {
            "time": 0.0,
            "value": 0.0,
            "inSlope": 0.0,
            "outSlope": 0.0,
            "weightedMode": 0,
            "inWeight": 0.0,
            "outWeight": 0.0
          },
          {
            "time": 1.0,
            "value": 1.0,
            "inSlope": 0.0,
            "outSlope": 0.0,
            "weightedMode": 0,
            "inWeight": 0.0,
            "outWeight": 0.0
          }
        ],
        "m_PreInfinity": 2,
        "m_PostInfinity": 2,
        "m_RotationOrder": 4
      },
      "m_MixOutCurve": {
        "m_Curve": [
          {
            "time": 0.0,
            "value": 1.0,
            "inSlope": 0.0,
            "outSlope": 0.0,
            "weightedMode": 0,
            "inWeight": 0.0,
            "outWeight": 0.0
          },
          {
            "time": 1.0,
            "value": 0.0,
            "inSlope": 0.0,
            "outSlope": 0.0,
            "weightedMode": 0,
            "inWeight": 0.0,
            "outWeight": 0.0
          }
        ],
        "m_PreInfinity": 2,
        "m_PostInfinity": 2,
        "m_RotationOrder": 4
      },
      "m_BlendInCurveMode": 0,
      "m_BlendOutCurveMode": 0,
      "m_ExposedParameterNames": [],
      "m_AnimationCurves": {
        "m_FileID": 0,
        "m_PathID": 0
      },
      "m_Recordable": 0,
      "m_PostExtrapolationMode": 0,
      "m_PreExtrapolationMode": 0,
      "m_PostExtrapolationTime": 0.0,
      "m_PreExtrapolationTime": 0.0,
      "m_DisplayName": "sound_mine_pickaxe"
    }
  ],
  "m_Markers": {
    "m_Objects": []
  },
  "m_TrackProperties": {
    "volume": 1.0,
    "stereoPan": 0.0,
    "spatialBlend": 0.0
  }
}