{
  "m_GameObject": {
    "m_FileID": 0,
    "m_PathID": -266904363314455121
  },
  "m_Enabled": 1,
  "m_Script": {
    "m_FileID": 0,
    "m_PathID": 348253180598357110
  },
  "m_Name": "",
  "m_Padding": {
    "m_Left": 0,
    "m_Right": 0,
    "m_Top": 10,
    "m_Bottom": 10
  },
  "m_ChildAlignment": 4,
  "m_Spacing": 15.0,
  "m_ChildForceExpandWidth": 1,
  "m_ChildForceExpandHeight": 0,
  "m_ChildControlWidth": 1,
  "m_ChildControlHeight": 0,
  "m_ChildScaleWidth": 0,
  "m_ChildScaleHeight": 0,
  "m_ReverseArrangement": 0
}