{
  "m_GameObject": {
    "m_FileID": 0,
    "m_PathID": -3715745624981006169
  },
  "m_Enabled": 1,
  "m_Script": {
    "m_FileID": 0,
    "m_PathID": 4792008904694137870
  },
  "m_Name": "",
  "onClick": {
    "m_PersistentCalls": {
      "m_Calls": [
        {
          "m_Target": {
            "m_FileID": 0,
            "m_PathID": 7303482472349779375
          },
          "m_TargetAssemblyTypeName": "LoadComplete.Explore.TimerIndicator, Assembly-CSharp",
          "m_MethodName": "OnClick",
          "m_Mode": 1,
          "m_Arguments": {
            "m_ObjectArgument": {
              "m_FileID": 0,
              "m_PathID": 0
            },
            "m_ObjectArgumentAssemblyTypeName": "UnityEngine.Object, UnityEngine",
            "m_IntArgument": 0,
            "m_FloatArgument": 0.0,
            "m_StringArgument": "",
            "m_BoolArgument": 0
          },
          "m_CallState": 2
        }
      ]
    }
  },
  "onPointerDown": {
    "m_PersistentCalls": {
      "m_Calls": [
        {
          "m_Target": {
            "m_FileID": 0,
            "m_PathID": 7303482472349779375
          },
          "m_TargetAssemblyTypeName": "LoadComplete.Explore.TimerIndicator, Assembly-CSharp",
          "m_MethodName": "OnPointerDown",
          "m_Mode": 1,
          "m_Arguments": {
            "m_ObjectArgument": {
              "m_FileID": 0,
              "m_PathID": 0
            },
            "m_ObjectArgumentAssemblyTypeName": "UnityEngine.Object, UnityEngine",
            "m_IntArgument": 0,
            "m_FloatArgument": 0.0,
            "m_StringArgument": "",
            "m_BoolArgument": 0
          },
          "m_CallState": 2
        }
      ]
    }
  },
  "onPointerEventEnd": {
    "m_PersistentCalls": {
      "m_Calls": [
        {
          "m_Target": {
            "m_FileID": 0,
            "m_PathID": 7303482472349779375
          },
          "m_TargetAssemblyTypeName": "LoadComplete.Explore.TimerIndicator, Assembly-CSharp",
          "m_MethodName": "OnPointerUp",
          "m_Mode": 1,
          "m_Arguments": {
            "m_ObjectArgument": {
              "m_FileID": 0,
              "m_PathID": 0
            },
            "m_ObjectArgumentAssemblyTypeName": "UnityEngine.Object, UnityEngine",
            "m_IntArgument": 0,
            "m_FloatArgument": 0.0,
            "m_StringArgument": "",
            "m_BoolArgument": 0
          },
          "m_CallState": 2
        }
      ]
    }
  }
}