{
  "m_GameObject": {
    "m_FileID": 0,
    "m_PathID": -4405284113970333281
  },
  "m_Enabled": 1,
  "m_Script": {
    "m_FileID": 0,
    "m_PathID": 4452942400327435936
  },
  "m_Name": "",
  "m_Padding": {
    "x": 0.0,
    "y": 0.0,
    "z": 0.0,
    "w": 0.0
  },
  "m_Softness": {
    "x": 0,
    "y": 0
  }
}