{
  "m_GameObject": {
    "m_FileID": 0,
    "m_PathID": -8756243745012948739
  },
  "m_Enabled": 1,
  "m_Script": {
    "m_FileID": 0,
    "m_PathID": 3242186723620049998
  },
  "m_Name": "",
  "body": {
    "m_FileID": 0,
    "m_PathID": -925994164614025060
  },
  "overrideBottomLayoutHeight": 1,
  "targetHeightRatio": 1.0,
  "isEnableMenuLayout": 0,
  "isEnableSkillUseButtonLayout": 0,
  "isEnableDefaultPanel": 0,
  "isEnablePanelDimmed": 1,
  "isReduceBattleSfx": 1,
  "isFullScreen": 1,
  "mineBehaviourRef": {
    "m_AssetGUID": "aa32e22ecede3df41afe60733619ca7b",
    "m_SubObjectName": "",
    "m_SubObjectType": ""
  },
  "mineViewer": {
    "m_FileID": 0,
    "m_PathID": 4956223708597656850
  },
  "mineViewerRt": {
    "m_FileID": 0,
    "m_PathID": -4934336880169145729
  },
  "rewardAmountViewPool": {
    "m_FileID": 0,
    "m_PathID": 9005086725066585533
  },
  "pickaxeToggle": {
    "m_FileID": 0,
    "m_PathID": 664573334530455332
  },
  "verticalBombToggle": {
    "m_FileID": 0,
    "m_PathID": 2900022782196456716
  },
  "horizontalBombToggle": {
    "m_FileID": 0,
    "m_PathID": 7791364722963174910
  },
  "pickaxeProhibitIcon": {
    "m_FileID": 0,
    "m_PathID": -6043174206134962214
  },
  "verticalBombProhibitIcon": {
    "m_FileID": 0,
    "m_PathID": -3235782244768209903
  },
  "horizontalBombProhibitIcon": {
    "m_FileID": 0,
    "m_PathID": 2764999051061774653
  },
  "pickaxeAmount": {
    "m_FileID": 0,
    "m_PathID": -497508516529382699
  },
  "pickaxeGetRemainTime": {
    "m_FileID": 0,
    "m_PathID": 6366379604746484840
  },
  "pickaxeAdButton": {
    "m_FileID": 0,
    "m_PathID": 4566429761045640398
  },
  "pickaxeAdLockButton": {
    "m_FileID": 0,
    "m_PathID": 4319054120323685193
  },
  "pickaxeAdAmount": [
    {
      "m_FileID": 0,
      "m_PathID": -2439227876876149087
    },
    {
      "m_FileID": 0,
      "m_PathID": -1846602823788602538
    }
  ],
  "pickaxeAdRemainChance": [
    {
      "m_FileID": 0,
      "m_PathID": -4745601483970325944
    },
    {
      "m_FileID": 0,
      "m_PathID": -3581732794456149481
    }
  ],
  "leftDepthGear": {
    "m_FileID": 0,
    "m_PathID": 1046190987579176170
  },
  "rightDepthGear": {
    "m_FileID": 0,
    "m_PathID": 7918088224093421657
  },
  "currentDepth": {
    "m_FileID": 0,
    "m_PathID": 3589491845750412974
  }
}