{
  "m_GameObject": {
    "m_FileID": 0,
    "m_PathID": -1168862365178772783
  },
  "m_Enabled": 1,
  "m_Script": {
    "m_FileID": 0,
    "m_PathID": -8287268331135866272
  },
  "m_Name": "",
  "saleRibbonObj": {
    "m_FileID": 0,
    "m_PathID": 2576244944572629575
  },
  "saleRibbonText": {
    "m_FileID": 0,
    "m_PathID": -3737967583722770745
  },
  "purchaseButton": {
    "m_FileID": 0,
    "m_PathID": 5756385543116746556
  },
  "priceText": {
    "m_FileID": 0,
    "m_PathID": 567317118676927282
  },
  "autoSetTitle": 1,
  "titleText": {
    "m_FileID": 0,
    "m_PathID": -618321429599028151
  },
  "purchaseCountText": {
    "m_FileID": 0,
    "m_PathID": 0
  },
  "remainTimeObj": {
    "m_FileID": 0,
    "m_PathID": 7441081743333357796
  },
  "remainTimeText": {
    "m_FileID": 0,
    "m_PathID": -1446414032429030946
  },
  "rewardSlotArray": [
    {
      "m_FileID": 0,
      "m_PathID": 8882285645745325554
    },
    {
      "m_FileID": 0,
      "m_PathID": 2261834774285959771
    }
  ],
  "rewardValueTextArray": [
    {
      "m_FileID": 0,
      "m_PathID": 4516630976548407795
    },
    {
      "m_FileID": 0,
      "m_PathID": 589653530998020896
    }
  ]
}