{
  "m_GameObject": {
    "m_FileID": 0,
    "m_PathID": -2284641472690204856
  },
  "m_Enabled": 1,
  "m_Script": {
    "m_FileID": 1,
    "m_PathID": -8091456346061954500
  },
  "m_Name": "",
  "m_Padding": {
    "m_Left": 17,
    "m_Right": 17,
    "m_Top": 17,
    "m_Bottom": 0
  },
  "m_ChildAlignment": 2,
  "m_Spacing": -4.7,
  "m_ChildForceExpandWidth": 0,
  "m_ChildForceExpandHeight": 0,
  "m_ChildControlWidth": 1,
  "m_ChildControlHeight": 0,
  "m_ChildScaleWidth": 0,
  "m_ChildScaleHeight": 1,
  "m_ReverseArrangement": 0
}