{
  "m_GameObject": {
    "m_FileID": 0,
    "m_PathID": -507207067022798048
  },
  "m_Enabled": 1,
  "m_Script": {
    "m_FileID": 0,
    "m_PathID": 968796850224110202
  },
  "m_Name": "",
  "currencyType": 18,
  "icon": {
    "m_FileID": 0,
    "m_PathID": 5216002276423267926
  },
  "amountText": {
    "m_FileID": 0,
    "m_PathID": -4554657587665598363
  },
  "bigDoubleFormatToggle": 1,
  "bigDoubleFormatCondition": 9
}