{
  "m_GameObject": {
    "m_FileID": 0,
    "m_PathID": 7711476394941620998
  },
  "m_Enabled": 1,
  "m_Script": {
    "m_FileID": 0,
    "m_PathID": 8962903080549542158
  },
  "m_Name": "",
  "localizeKey": "RELAY_INFO_PAGE1_1",
  "fontMaterial": {
    "m_FileID": 2,
    "m_PathID": 379438189239238212
  },
  "overrideFonts": []
}