{
  "m_GameObject": {
    "m_FileID": 0,
    "m_PathID": 773254916156083173
  },
  "m_Enabled": 1,
  "m_Script": {
    "m_FileID": 0,
    "m_PathID": 8313137859140752739
  },
  "m_Name": "",
  "onEnable": {
    "m_PersistentCalls": {
      "m_Calls": [
        {
          "m_Target": {
            "m_FileID": 0,
            "m_PathID": 2545003129837752601
          },
          "m_TargetAssemblyTypeName": "UnityEngine.GameObject, UnityEngine",
          "m_MethodName": "SetActive",
          "m_Mode": 6,
          "m_Arguments": {
            "m_ObjectArgument": {
              "m_FileID": 0,
              "m_PathID": 0
            },
            "m_ObjectArgumentAssemblyTypeName": "UnityEngine.Object, UnityEngine",
            "m_IntArgument": 0,
            "m_FloatArgument": 0.0,
            "m_StringArgument": "",
            "m_BoolArgument": 1
          },
          "m_CallState": 2
        }
      ]
    }
  },
  "onDisable": {
    "m_PersistentCalls": {
      "m_Calls": [
        {
          "m_Target": {
            "m_FileID": 0,
            "m_PathID": 2545003129837752601
          },
          "m_TargetAssemblyTypeName": "UnityEngine.GameObject, UnityEngine",
          "m_MethodName": "SetActive",
          "m_Mode": 6,
          "m_Arguments": {
            "m_ObjectArgument": {
              "m_FileID": 0,
              "m_PathID": 0
            },
            "m_ObjectArgumentAssemblyTypeName": "UnityEngine.Object, UnityEngine",
            "m_IntArgument": 0,
            "m_FloatArgument": 0.0,
            "m_StringArgument": "",
            "m_BoolArgument": 0
          },
          "m_CallState": 2
        }
      ]
    }
  }
}