{
  "m_GameObject": {
    "m_FileID": 0,
    "m_PathID": 3428212597585558846
  },
  "m_Enabled": 1,
  "m_Script": {
    "m_FileID": 0,
    "m_PathID": -3242970711442325531
  },
  "m_Name": "",
  "bindKey": "IsRewardable",
  "isReverse": 0
}