{
  "m_GameObject": {
    "m_FileID": 0,
    "m_PathID": 3479824658892764825
  },
  "m_Enabled": 1,
  "m_Script": {
    "m_FileID": 0,
    "m_PathID": -1277927121671302411
  },
  "m_Name": "",
  "root": {
    "m_FileID": 0,
    "m_PathID": -2072136419689425247
  },
  "despawnDelay": 0.3,
  "disableObjectsWhenOnHit": [
    {
      "m_FileID": 0,
      "m_PathID": -1637348622770282984
    },
    {
      "m_FileID": 0,
      "m_PathID": 7585719146253179586
    }
  ],
  "onFireEvent": {
    "m_PersistentCalls": {
      "m_Calls": []
    }
  },
  "onHitEvent": {
    "m_PersistentCalls": {
      "m_Calls": []
    }
  },
  "trailTransform": {
    "m_FileID": 0,
    "m_PathID": -1641139724469791620
  },
  "overrideJump": 1,
  "overrideJumpValue": 2.0,
  "fireVfxPrefab": {
    "m_FileID": 0,
    "m_PathID": 0
  },
  "explosionVfxPrefab": {
    "m_FileID": 13,
    "m_PathID": -6830171919290742268
  },
  "rotateType": 2,
  "rotateSpeed": 720.0,
  "fireSfx": {
    "clip": {
      "m_FileID": 13,
      "m_PathID": 8340867033459350398
    },
    "volume": 1.0
  },
  "hitSfx": {
    "clip": {
      "m_FileID": 0,
      "m_PathID": 0
    },
    "volume": 1.0
  }
}