{
  "m_GameObject": {
    "m_FileID": 0,
    "m_PathID": 0
  },
  "m_Enabled": 1,
  "m_Script": {
    "m_FileID": 0,
    "m_PathID": 1008803689438726606
  },
  "m_Name": "201_goblin_legion_Atlas",
  "atlasFile": {
    "m_FileID": 0,
    "m_PathID": -8530976563352242593
  },
  "materials": [
    {
      "m_FileID": 0,
      "m_PathID": 5802625206857227471
    }
  ]
}