{
  "m_GameObject": {
    "m_FileID": 0,
    "m_PathID": 4534601969199509737
  },
  "m_Enabled": 1,
  "m_Script": {
    "m_FileID": 0,
    "m_PathID": -2496028358499895848
  },
  "m_Name": "",
  "flareImage": {
    "m_FileID": 0,
    "m_PathID": 3128848774334675726
  },
  "iconImage": {
    "m_FileID": 0,
    "m_PathID": -3920587750587726453
  },
  "bgImage": {
    "m_FileID": 0,
    "m_PathID": -9118211065568201601
  },
  "typeIconImage": {
    "m_FileID": 0,
    "m_PathID": 4712112187453479878
  }
}