{
  "m_GameObject": {
    "m_FileID": 0,
    "m_PathID": -2953812023191066752
  },
  "m_Enabled": 1,
  "m_Script": {
    "m_FileID": 0,
    "m_PathID": 8962903080549542158
  },
  "m_Name": "",
  "localizeKey": "",
  "fontMaterial": {
    "m_FileID": 0,
    "m_PathID": 0
  },
  "overrideFonts": []
}