{
  "m_GameObject": {
    "m_FileID": 0,
    "m_PathID": -8974369725186375606
  },
  "m_Enabled": 1,
  "m_Script": {
    "m_FileID": 0,
    "m_PathID": 9155301573292911620
  },
  "m_Name": "",
  "scaler": {
    "m_FileID": 0,
    "m_PathID": 6139260598657349279
  },
  "rigidbody": {
    "m_FileID": 0,
    "m_PathID": -9103987928815881080
  },
  "modelDefaultDirection": 0,
  "modelType": 0,
  "skeletonAnimation": {
    "m_FileID": 0,
    "m_PathID": 4523177023336762467
  },
  "animator": {
    "m_FileID": 0,
    "m_PathID": 0
  },
  "height": 0.62,
  "width": 0.88,
  "idleAnim": "idle",
  "moveAnim": "walk",
  "deathAnim": "die_hit",
  "idleUnityAnim": "",
  "moveUnityAnim": "",
  "deathUnityAnim": "",
  "firePosition": {
    "m_FileID": 0,
    "m_PathID": 2897781311724833003
  },
  "projectilePrefab": {
    "m_FileID": 0,
    "m_PathID": -3639845483073465050
  },
  "projectileType": 1,
  "deathEndAnim": "die_end",
  "hitAnim": "hit",
  "deathSfx": {
    "m_FileID": 0,
    "m_PathID": -7987846336070825119
  },
  "hitSfx": {
    "m_FileID": 13,
    "m_PathID": 2250040703668492235
  }
}