{
  "m_GameObject": {
    "m_FileID": 0,
    "m_PathID": -7290818392313966578
  },
  "m_Enabled": 1,
  "m_Script": {
    "m_FileID": 0,
    "m_PathID": -9007549964774977214
  },
  "m_Name": "",
  "rtBody": {
    "m_FileID": 0,
    "m_PathID": 0
  },
  "exploreBehaviourRef": {
    "m_AssetGUID": "c54ea303453053e4eb446c37544652c4",
    "m_SubObjectName": "",
    "m_SubObjectType": ""
  },
  "popupRewardWithExpPrefab": {
    "m_FileID": 0,
    "m_PathID": -6510825733338733613
  },
  "levelIndicator": {
    "m_FileID": 0,
    "m_PathID": -6046822519793312005
  },
  "expFullFillDuration": 0.4,
  "screenViewer": {
    "m_FileID": 0,
    "m_PathID": -809068741250514439
  },
  "viewerRenderScale": 0.7,
  "imgClaimAllButton": {
    "m_FileID": 0,
    "m_PathID": 1015106597441418658
  },
  "goShopButton": {
    "m_FileID": 0,
    "m_PathID": 4026713016648113811
  },
  "tutorialFirstArea": {
    "m_FileID": 0,
    "m_PathID": 5828792077567546144
  },
  "vipDescription": {
    "m_FileID": 0,
    "m_PathID": 6211158997257526711
  },
  "tfCapacityBonus": {
    "m_FileID": 0,
    "m_PathID": -6731931526911005456
  },
  "tfEarnBonus": {
    "m_FileID": 0,
    "m_PathID": -1613741952389443073
  }
}