{
  "m_GameObject": {
    "m_FileID": 0,
    "m_PathID": 1954568186575242765
  },
  "m_Enabled": 1,
  "m_Script": {
    "m_FileID": 0,
    "m_PathID": -8940529911906571770
  },
  "m_Name": "",
  "ignoreList": [],
  "bindables": [
    {
      "m_FileID": 0,
      "m_PathID": -4882845830947206151
    },
    {
      "m_FileID": 0,
      "m_PathID": 2177540980945692827
    },
    {
      "m_FileID": 0,
      "m_PathID": 3498966984696506615
    },
    {
      "m_FileID": 0,
      "m_PathID": 1034255528531860600
    }
  ]
}