{
  "m_GameObject": {
    "m_FileID": 0,
    "m_PathID": 8079902234458226106
  },
  "m_Enabled": 1,
  "m_Script": {
    "m_FileID": 0,
    "m_PathID": 8806312759750168707
  },
  "m_Name": "",
  "bindKey": "item.OnClickAction"
}