{
  "m_GameObject": {
    "m_FileID": 0,
    "m_PathID": 5040752082954388481
  },
  "m_Enabled": 1,
  "m_Script": {
    "m_FileID": 0,
    "m_PathID": -3242970711442325531
  },
  "m_Name": "",
  "bindKey": "UseAdPass",
  "isReverse": 0
}