{
  "m_GameObject": {
    "m_FileID": 0,
    "m_PathID": -3760597678411517818
  },
  "m_Enabled": 1,
  "m_Script": {
    "m_FileID": 0,
    "m_PathID": -7745696993037075445
  },
  "m_Name": "",
  "rtBody": {
    "m_FileID": 0,
    "m_PathID": 0
  },
  "artifactIcon": {
    "m_FileID": 0,
    "m_PathID": -3622234035106937671
  },
  "artifactName": {
    "m_FileID": 0,
    "m_PathID": 8652526231187907588
  },
  "artifactDesc": {
    "m_FileID": 0,
    "m_PathID": -5048277254015136738
  },
  "shakeRoot": {
    "m_FileID": 0,
    "m_PathID": -7505067705288659828
  },
  "shakePower": 30.0
}