{
  "m_GameObject": {
    "m_FileID": 0,
    "m_PathID": -8844342425663373101
  },
  "m_Enabled": 1,
  "m_Script": {
    "m_FileID": 0,
    "m_PathID": 258478329350359321
  },
  "m_Name": "",
  "customToggle": 0,
  "sfxType": 0,
  "customSfx": {
    "m_FileID": 0,
    "m_PathID": 0
  }
}