{
  "m_GameObject": {
    "m_FileID": 0,
    "m_PathID": 46
  },
  "m_Enabled": 1,
  "m_Script": {
    "m_FileID": 1,
    "m_PathID": 32
  },
  "m_Name": "",
  "grayScaleMaterial": {
    "m_FileID": 5,
    "m_PathID": 7613029036954808526
  }
}