{
  "m_GameObject": {
    "m_FileID": 0,
    "m_PathID": -1273283971569812638
  },
  "m_Enabled": 1,
  "m_Script": {
    "m_FileID": 0,
    "m_PathID": -159886853491024718
  },
  "m_Name": "",
  "currencyType": 15
}