{
  "m_GameObject": {
    "m_FileID": 0,
    "m_PathID": 4826587179443123701
  },
  "m_Enabled": 1,
  "m_Script": {
    "m_FileID": 0,
    "m_PathID": -3242970711442325531
  },
  "m_Name": "",
  "bindKey": "IsVictory",
  "isReverse": 1
}