{
  "m_GameObject": {
    "m_FileID": 0,
    "m_PathID": -1529532445458232736
  },
  "m_Enabled": 1,
  "m_Script": {
    "m_FileID": 4,
    "m_PathID": 2793829366360182751
  },
  "m_Name": "",
  "interfaceName": "SkillUseButton_0",
  "lockObjects": [
    {
      "m_FileID": 0,
      "m_PathID": -4436977803579222464
    }
  ],
  "unlockObjects": []
}