{
  "m_GameObject": {
    "m_FileID": 0,
    "m_PathID": -1531907804235086034
  },
  "m_Enabled": 1,
  "m_Script": {
    "m_FileID": 0,
    "m_PathID": 8962903080549542158
  },
  "m_Name": "",
  "localizeKey": "POPUP_GACHA_INFO_DESC",
  "fontMaterial": {
    "m_FileID": 2,
    "m_PathID": 379438189239238212
  },
  "overrideFonts": []
}