
mechaslime.png
size: 1024,256
format: RGBA8888
filter: Linear,Linear
repeat: none
1111
  rotate: true
  xy: 312, 41
  size: 113, 105
  orig: 113, 105
  offset: 0, 0
  index: -1
Body1
  rotate: true
  xy: 767, 66
  size: 88, 67
  orig: 88, 67
  offset: 0, 0
  index: -1
L_acc1
  rotate: false
  xy: 775, 20
  size: 43, 44
  orig: 45, 46
  offset: 1, 1
  index: -1
L_acc2
  rotate: false
  xy: 948, 39
  size: 43, 43
  orig: 45, 45
  offset: 1, 1
  index: -1
L_arm1
  rotate: true
  xy: 419, 29
  size: 125, 88
  orig: 127, 90
  offset: 1, 1
  index: -1
R_arm1
  rotate: true
  xy: 419, 29
  size: 125, 88
  orig: 127, 90
  offset: 1, 1
  index: -1
L_arm2
  rotate: false
  xy: 632, 78
  size: 68, 76
  orig: 70, 78
  offset: 1, 1
  index: -1
R_arm2
  rotate: false
  xy: 632, 78
  size: 68, 76
  orig: 70, 78
  offset: 1, 1
  index: -1
L_arm3
  rotate: true
  xy: 702, 73
  size: 81, 63
  orig: 83, 65
  offset: 1, 1
  index: -1
R_arm3
  rotate: true
  xy: 702, 73
  size: 81, 63
  orig: 83, 65
  offset: 1, 1
  index: -1
L_eye1
  rotate: false
  xy: 320, 6
  size: 15, 33
  orig: 17, 34
  offset: 1, 1
  index: -1
L_eye2
  rotate: false
  xy: 272, 12
  size: 22, 33
  orig: 22, 33
  offset: 0, 0
  index: -1
L_foot1
  rotate: true
  xy: 709, 23
  size: 48, 64
  orig: 50, 66
  offset: 1, 1
  index: -1
R_foot1
  rotate: true
  xy: 709, 23
  size: 48, 64
  orig: 50, 66
  offset: 1, 1
  index: -1
L_foot2
  rotate: true
  xy: 836, 84
  size: 70, 58
  orig: 72, 60
  offset: 1, 1
  index: -1
R_acc1
  rotate: false
  xy: 941, 84
  size: 43, 44
  orig: 45, 46
  offset: 1, 1
  index: -1
R_acc2
  rotate: false
  xy: 174, 2
  size: 43, 43
  orig: 45, 45
  offset: 1, 1
  index: -1
R_eye1
  rotate: false
  xy: 337, 6
  size: 15, 33
  orig: 17, 34
  offset: 1, 1
  index: -1
R_eye2
  rotate: false
  xy: 296, 6
  size: 22, 33
  orig: 22, 33
  offset: 0, 0
  index: -1
R_foot2
  rotate: false
  xy: 835, 24
  size: 70, 58
  orig: 72, 60
  offset: 1, 1
  index: -1
Robo_body
  rotate: false
  xy: 2, 35
  size: 170, 119
  orig: 172, 121
  offset: 1, 1
  index: -1
acc_1
  rotate: true
  xy: 579, 47
  size: 107, 51
  orig: 109, 53
  offset: 1, 1
  index: -1
acc_2
  rotate: false
  xy: 509, 73
  size: 68, 81
  orig: 70, 82
  offset: 1, 1
  index: -1
acc_3
  rotate: true
  xy: 174, 47
  size: 107, 136
  orig: 109, 137
  offset: 1, 1
  index: -1
awdawd
  rotate: false
  xy: 509, 13
  size: 58, 58
  orig: 58, 58
  offset: 0, 0
  index: -1
eye2
  rotate: true
  xy: 907, 12
  size: 70, 39
  orig: 72, 41
  offset: 1, 1
  index: -1
eye2_2
  rotate: true
  xy: 896, 84
  size: 68, 43
  orig: 68, 43
  offset: 0, 0
  index: -1
fire2_1
  rotate: false
  xy: 632, 19
  size: 75, 52
  orig: 77, 54
  offset: 1, 1
  index: -1
fire2_2
  rotate: false
  xy: 2, 7
  size: 34, 26
  orig: 36, 28
  offset: 1, 1
  index: -1
top_acc
  rotate: true
  xy: 219, 12
  size: 33, 51
  orig: 35, 53
  offset: 1, 1
  index: -1
