{
  "m_GameObject": {
    "m_FileID": 0,
    "m_PathID": 8451128866199497057
  },
  "m_Enabled": 1,
  "m_Script": {
    "m_FileID": 0,
    "m_PathID": 2252140159486941644
  },
  "m_Name": "",
  "model": {
    "id": "CloseCompanion",
    "textID": "",
    "transform": {
      "m_FileID": 0,
      "m_PathID": -3100040606088146719
    },
    "worldPosition": {
      "x": 360.0,
      "y": 369.345,
      "z": 0.0
    },
    "rectSize": {
      "x": 102.0,
      "y": 109.0
    },
    "offset": {
      "x": 0.0,
      "y": 0.0
    },
    "cursorAdditionalOffset": {
      "x": 0.0,
      "y": 0.0
    },
    "alignment": 4
  }
}