{
  "m_GameObject": {
    "m_FileID": 0,
    "m_PathID": 0
  },
  "m_Enabled": 1,
  "m_Script": {
    "m_FileID": 0,
    "m_PathID": 1008803689438726606
  },
  "m_Name": "20120_human_Atlas",
  "atlasFile": {
    "m_FileID": 0,
    "m_PathID": -5635600149563072724
  },
  "materials": [
    {
      "m_FileID": 0,
      "m_PathID": 1643228427088832919
    }
  ]
}