{
  "m_GameObject": {
    "m_FileID": 0,
    "m_PathID": 4171022073052922882
  },
  "m_Enabled": 1,
  "m_Script": {
    "m_FileID": 0,
    "m_PathID": -8473075054397180242
  },
  "m_Name": "",
  "amountText": {
    "m_FileID": 0,
    "m_PathID": -6074989081589146235
  },
  "rewardIcon": {
    "m_FileID": 0,
    "m_PathID": 1083058836076132726
  },
  "enabledBgObj": {
    "m_FileID": 0,
    "m_PathID": -2955665871192810615
  }
}