{
  "m_GameObject": {
    "m_FileID": 0,
    "m_PathID": 5369476519800305274
  },
  "m_Enabled": 1,
  "m_Script": {
    "m_FileID": 0,
    "m_PathID": -653943530122352273
  },
  "m_Name": "",
  "_parentBlackboard": {
    "m_FileID": 0,
    "m_PathID": 0
  },
  "_serializedBlackboard": "{\"_variables\":{\"damageMultiply\":{\"_value\":1.0,\"_name\":\"damageMultiply\",\"_id\":\"72a625c6-bf19-4f8e-838c-cfc3a44d15af\",\"$type\":\"NodeCanvas.Framework.Variable`1[[System.Single, mscorlib, Version=4.0.0.0, Culture=neutral, PublicKeyToken=b77a5c561934e089]]\"},\"idleAnimName\":{\"_propertyPath\":\"LoadComplete.Battle.Character.IdleAnim\",\"_name\":\"idleAnimName\",\"_id\":\"8033a698-fe76-40b3-9feb-6e02bf30ba1d\",\"$type\":\"NodeCanvas.Framework.Variable`1[[System.String, mscorlib, Version=4.0.0.0, Culture=neutral, PublicKeyToken=b77a5c561934e089]]\"},\"moveAnimName\":{\"_propertyPath\":\"LoadComplete.Battle.Character.MoveAnim\",\"_name\":\"moveAnimName\",\"_id\":\"c68a54ac-d88b-4302-b180-1bd4109ba232\",\"$type\":\"NodeCanvas.Framework.Variable`1[[System.String, mscorlib, Version=4.0.0.0, Culture=neutral, PublicKeyToken=b77a5c561934e089]]\"},\"attackAnimName\":{\"_propertyPath\":\"LoadComplete.Battle.EnemyCharacter.AttackAnimName\",\"_name\":\"attackAnimName\",\"_id\":\"ddc3cb16-b77a-47f1-a4b4-6d549033fa23\",\"$type\":\"NodeCanvas.Framework.Variable`1[[System.String, mscorlib, Version=4.0.0.0, Culture=neutral, PublicKeyToken=b77a5c561934e089]]\"},\"attackAnimEventName\":{\"_propertyPath\":\"LoadComplete.Battle.EnemyCharacter.AttackAnimEventName\",\"_name\":\"attackAnimEventName\",\"_id\":\"d9583c81-1963-4bf9-a7f3-8a61d2e49680\",\"$type\":\"NodeCanvas.Framework.Variable`1[[System.String, mscorlib, Version=4.0.0.0, Culture=neutral, PublicKeyToken=b77a5c561934e089]]\"},\"panicAnimName\":{\"_propertyPath\":\"LoadComplete.Battle.EnemyCharacter.PanicAnimName\",\"_name\":\"panicAnimName\",\"_id\":\"b2064575-6a5a-422b-af1d-f0dadecbfa74\",\"$type\":\"NodeCanvas.Framework.Variable`1[[System.String, mscorlib, Version=4.0.0.0, Culture=neutral, PublicKeyToken=b77a5c561934e089]]\"},\"attackSubTree\":{\"_propertyPath\":\"LoadComplete.Battle.EnemyCharacter.AttackBT\",\"_name\":\"attackSubTree\",\"_id\":\"fdf36981-6229-41fc-a1a7-c523e2f8b7b4\",\"$type\":\"NodeCanvas.Framework.Variable`1[[NodeCanvas.BehaviourTrees.BehaviourTree, ParadoxNotion, Version=0.0.0.0, Culture=neutral, PublicKeyToken=null]]\"},\"projectilePrefab\":{\"_propertyPath\":\"LoadComplete.Battle.EnemyCharacter.ProjectilePrefab\",\"_name\":\"projectilePrefab\",\"_id\":\"04a209a0-4edd-4606-bb7f-ae370ac10f8c\",\"$type\":\"NodeCanvas.Framework.Variable`1[[LoadComplete.Battle.Projectile, Assembly-CSharp, Version=0.0.0.0, Culture=neutral, PublicKeyToken=null]]\"},\"projectileSpeed\":{\"_propertyPath\":\"LoadComplete.Battle.EnemyCharacter.ProjectileSpeed\",\"_name\":\"projectileSpeed\",\"_id\":\"040890de-2beb-46ad-a4f9-d1e96077f11d\",\"$type\":\"NodeCanvas.Framework.Variable`1[[System.Single, mscorlib, Version=4.0.0.0, Culture=neutral, PublicKeyToken=b77a5c561934e089]]\"},\"projectileType\":{\"_propertyPath\":\"LoadComplete.Battle.EnemyCharacter.ProjectileType\",\"_name\":\"projectileType\",\"_id\":\"92f1dbe3-dfb4-4cae-8fda-3a8abf214efb\",\"$type\":\"NodeCanvas.Framework.Variable`1[[LoadComplete.Battle.Projectile+Type, Assembly-CSharp, Version=0.0.0.0, Culture=neutral, PublicKeyToken=null]]\"},\"projectileSpawnPivotType\":{\"_propertyPath\":\"LoadComplete.Battle.EnemyCharacter.ProjectileSpawnPivotType\",\"_name\":\"projectileSpawnPivotType\",\"_id\":\"e4c20e04-de30-4e23-b762-2cc6bc06fdfa\",\"$type\":\"NodeCanvas.Framework.Variable`1[[LoadComplete.BT.Enemy.FireProjectile+SpawnPivotType, Assembly-CSharp, Version=0.0.0.0, Culture=neutral, PublicKeyToken=null]]\"},\"projectileSpawnOffset\":{\"_propertyPath\":\"LoadComplete.Battle.EnemyCharacter.ProjectileSpawnOffset\",\"_name\":\"projectileSpawnOffset\",\"_id\":\"e8f05426-03f3-434b-8a22-cca581449dc8\",\"$type\":\"NodeCanvas.Framework.Variable`1[[UnityEngine.Vector2, UnityEngine.CoreModule, Version=0.0.0.0, Culture=neutral, PublicKeyToken=null]]\"},\"isInAirborne\":{\"_propertyPath\":\"LoadComplete.Battle.EnemyCharacter.IsInAirborne\",\"_name\":\"isInAirborne\",\"_id\":\"c377830f-e75b-455b-9a11-b73a21575a30\",\"$type\":\"NodeCanvas.Framework.Variable`1[[System.Boolean, mscorlib, Version=4.0.0.0, Culture=neutral, PublicKeyToken=b77a5c561934e089]]\"}}}",
  "_objectReferences": [],
  "_serializedVariables": [
    {
      "_json": "{\"_value\":1.0,\"_name\":\"damageMultiply\",\"_id\":\"72a625c6-bf19-4f8e-838c-cfc3a44d15af\",\"$type\":\"NodeCanvas.Framework.Variable`1[[System.Single, mscorlib, Version=4.0.0.0, Culture=neutral, PublicKeyToken=b77a5c561934e089]]\"}",
      "_references": []
    },
    {
      "_json": "{\"_propertyPath\":\"LoadComplete.Battle.Character.IdleAnim\",\"_name\":\"idleAnimName\",\"_id\":\"8033a698-fe76-40b3-9feb-6e02bf30ba1d\",\"$type\":\"NodeCanvas.Framework.Variable`1[[System.String, mscorlib, Version=4.0.0.0, Culture=neutral, PublicKeyToken=b77a5c561934e089]]\"}",
      "_references": []
    },
    {
      "_json": "{\"_propertyPath\":\"LoadComplete.Battle.Character.MoveAnim\",\"_name\":\"moveAnimName\",\"_id\":\"c68a54ac-d88b-4302-b180-1bd4109ba232\",\"$type\":\"NodeCanvas.Framework.Variable`1[[System.String, mscorlib, Version=4.0.0.0, Culture=neutral, PublicKeyToken=b77a5c561934e089]]\"}",
      "_references": []
    },
    {
      "_json": "{\"_propertyPath\":\"LoadComplete.Battle.EnemyCharacter.AttackAnimName\",\"_name\":\"attackAnimName\",\"_id\":\"ddc3cb16-b77a-47f1-a4b4-6d549033fa23\",\"$type\":\"NodeCanvas.Framework.Variable`1[[System.String, mscorlib, Version=4.0.0.0, Culture=neutral, PublicKeyToken=b77a5c561934e089]]\"}",
      "_references": []
    },
    {
      "_json": "{\"_propertyPath\":\"LoadComplete.Battle.EnemyCharacter.AttackAnimEventName\",\"_name\":\"attackAnimEventName\",\"_id\":\"d9583c81-1963-4bf9-a7f3-8a61d2e49680\",\"$type\":\"NodeCanvas.Framework.Variable`1[[System.String, mscorlib, Version=4.0.0.0, Culture=neutral, PublicKeyToken=b77a5c561934e089]]\"}",
      "_references": []
    },
    {
      "_json": "{\"_propertyPath\":\"LoadComplete.Battle.EnemyCharacter.PanicAnimName\",\"_name\":\"panicAnimName\",\"_id\":\"b2064575-6a5a-422b-af1d-f0dadecbfa74\",\"$type\":\"NodeCanvas.Framework.Variable`1[[System.String, mscorlib, Version=4.0.0.0, Culture=neutral, PublicKeyToken=b77a5c561934e089]]\"}",
      "_references": []
    },
    {
      "_json": "{\"_propertyPath\":\"LoadComplete.Battle.EnemyCharacter.AttackBT\",\"_name\":\"attackSubTree\",\"_id\":\"fdf36981-6229-41fc-a1a7-c523e2f8b7b4\",\"$type\":\"NodeCanvas.Framework.Variable`1[[NodeCanvas.BehaviourTrees.BehaviourTree, ParadoxNotion, Version=0.0.0.0, Culture=neutral, PublicKeyToken=null]]\"}",
      "_references": []
    },
    {
      "_json": "{\"_propertyPath\":\"LoadComplete.Battle.EnemyCharacter.ProjectilePrefab\",\"_name\":\"projectilePrefab\",\"_id\":\"04a209a0-4edd-4606-bb7f-ae370ac10f8c\",\"$type\":\"NodeCanvas.Framework.Variable`1[[LoadComplete.Battle.Projectile, Assembly-CSharp, Version=0.0.0.0, Culture=neutral, PublicKeyToken=null]]\"}",
      "_references": []
    },
    {
      "_json": "{\"_propertyPath\":\"LoadComplete.Battle.EnemyCharacter.ProjectileSpeed\",\"_name\":\"projectileSpeed\",\"_id\":\"040890de-2beb-46ad-a4f9-d1e96077f11d\",\"$type\":\"NodeCanvas.Framework.Variable`1[[System.Single, mscorlib, Version=4.0.0.0, Culture=neutral, PublicKeyToken=b77a5c561934e089]]\"}",
      "_references": []
    },
    {
      "_json": "{\"_propertyPath\":\"LoadComplete.Battle.EnemyCharacter.ProjectileType\",\"_name\":\"projectileType\",\"_id\":\"92f1dbe3-dfb4-4cae-8fda-3a8abf214efb\",\"$type\":\"NodeCanvas.Framework.Variable`1[[LoadComplete.Battle.Projectile+Type, Assembly-CSharp, Version=0.0.0.0, Culture=neutral, PublicKeyToken=null]]\"}",
      "_references": []
    },
    {
      "_json": "{\"_propertyPath\":\"LoadComplete.Battle.EnemyCharacter.ProjectileSpawnPivotType\",\"_name\":\"projectileSpawnPivotType\",\"_id\":\"e4c20e04-de30-4e23-b762-2cc6bc06fdfa\",\"$type\":\"NodeCanvas.Framework.Variable`1[[LoadComplete.BT.Enemy.FireProjectile+SpawnPivotType, Assembly-CSharp, Version=0.0.0.0, Culture=neutral, PublicKeyToken=null]]\"}",
      "_references": []
    },
    {
      "_json": "{\"_propertyPath\":\"LoadComplete.Battle.EnemyCharacter.ProjectileSpawnOffset\",\"_name\":\"projectileSpawnOffset\",\"_id\":\"e8f05426-03f3-434b-8a22-cca581449dc8\",\"$type\":\"NodeCanvas.Framework.Variable`1[[UnityEngine.Vector2, UnityEngine.CoreModule, Version=0.0.0.0, Culture=neutral, PublicKeyToken=null]]\"}",
      "_references": []
    },
    {
      "_json": "{\"_propertyPath\":\"LoadComplete.Battle.EnemyCharacter.IsInAirborne\",\"_name\":\"isInAirborne\",\"_id\":\"c377830f-e75b-455b-9a11-b73a21575a30\",\"$type\":\"NodeCanvas.Framework.Variable`1[[System.Boolean, mscorlib, Version=4.0.0.0, Culture=neutral, PublicKeyToken=b77a5c561934e089]]\"}",
      "_references": []
    }
  ]
}