{
  "m_GameObject": {
    "m_FileID": 0,
    "m_PathID": -488827194831388018
  },
  "m_Enabled": 1,
  "m_Script": {
    "m_FileID": 0,
    "m_PathID": 1449891033392876518
  },
  "m_Name": "",
  "setNativeSize": 1,
  "syncPivot": 1,
  "m_Key": "item.SlimeIcon"
}