{
  "m_GameObject": {
    "m_FileID": 0,
    "m_PathID": -3177587804601581857
  },
  "m_Enabled": 1,
  "m_Script": {
    "m_FileID": 0,
    "m_PathID": -1251046320703215198
  },
  "m_Name": "",
  "m_Key": "LevelBonusColor"
}