{
  "m_GameObject": {
    "m_FileID": 0,
    "m_PathID": 5662816499465627777
  },
  "m_Enabled": 1,
  "m_Script": {
    "m_FileID": 1,
    "m_PathID": -7030229213176759517
  },
  "m_Name": "",
  "m_Material": {
    "m_FileID": 0,
    "m_PathID": 0
  },
  "m_Color": {
    "r": 1.0,
    "g": 0.972549,
    "b": 0.384313732,
    "a": 0.8
  },
  "m_RaycastTarget": 0,
  "m_RaycastPadding": {
    "x": 0.0,
    "y": 0.0,
    "z": 0.0,
    "w": 0.0
  },
  "m_Maskable": 1,
  "m_OnCullStateChanged": {
    "m_PersistentCalls": {
      "m_Calls": []
    }
  },
  "m_Sprite": {
    "m_FileID": 19,
    "m_PathID": -7785445631120652827
  },
  "m_Type": 3,
  "m_PreserveAspect": 0,
  "m_FillCenter": 1,
  "m_FillMethod": 1,
  "m_FillAmount": 0.0,
  "m_FillClockwise": 0,
  "m_FillOrigin": 0,
  "m_UseSpriteMesh": 0,
  "m_PixelsPerUnitMultiplier": 1.0
}