{
  "m_GameObject": {
    "m_FileID": 0,
    "m_PathID": 6786355254720174151
  },
  "m_Enabled": 1,
  "m_Script": {
    "m_FileID": 0,
    "m_PathID": -3242970711442325531
  },
  "m_Name": "",
  "bindKey": "item.ShowRankText",
  "isReverse": 0
}