{
  "m_GameObject": {
    "m_FileID": 0,
    "m_PathID": -1967291318017900058
  },
  "m_Enabled": 1,
  "m_Script": {
    "m_FileID": 0,
    "m_PathID": 8806312759750168707
  },
  "m_Name": "",
  "bindKey": "item.OnClickPurchaseAction"
}