{
  "m_GameObject": {
    "m_FileID": 0,
    "m_PathID": 2325528002714235224
  },
  "m_Enabled": 1,
  "m_Script": {
    "m_FileID": 2,
    "m_PathID": 8390977652835490180
  },
  "m_Name": "",
  "m_IgnoreReversedGraphics": 1,
  "m_BlockingObjects": 0,
  "m_BlockingMask": {
    "m_Bits": 1023
  }
}