{
  "m_GameObject": {
    "m_FileID": 0,
    "m_PathID": 4683323837261334654
  },
  "m_Enabled": 1,
  "m_Script": {
    "m_FileID": 0,
    "m_PathID": 5611602303662826346
  },
  "m_Name": "",
  "rtBody": {
    "m_FileID": 0,
    "m_PathID": 1489495928007619640
  },
  "txtUserId": {
    "m_FileID": 0,
    "m_PathID": 3041261731887165526
  },
  "txtGoogle": {
    "m_FileID": 0,
    "m_PathID": 9097413072944850513
  },
  "txtAppleId": {
    "m_FileID": 0,
    "m_PathID": -8638393358022188943
  },
  "goGuest": {
    "m_FileID": 0,
    "m_PathID": 1705468155498457952
  },
  "goDelete": {
    "m_FileID": 0,
    "m_PathID": 4153944615348556926
  },
  "goCloseButton": {
    "m_FileID": 0,
    "m_PathID": 2990794945358960923
  }
}