{
  "m_GameObject": {
    "m_FileID": 0,
    "m_PathID": -7919320254605507335
  },
  "m_Enabled": 1,
  "m_Script": {
    "m_FileID": 0,
    "m_PathID": 2394203861304995953
  },
  "m_Name": "",
  "scaler": {
    "m_FileID": 0,
    "m_PathID": -3837461879533413826
  },
  "rigidbody": {
    "m_FileID": 0,
    "m_PathID": 9104464362668613969
  },
  "modelDefaultDirection": 0,
  "modelType": 0,
  "skeletonAnimation": {
    "m_FileID": 0,
    "m_PathID": -7381979671579388523
  },
  "animator": {
    "m_FileID": 0,
    "m_PathID": 0
  },
  "height": 1.61,
  "width": 0.99,
  "idleAnim": "idle",
  "moveAnim": "walk",
  "deathAnim": "",
  "idleUnityAnim": "",
  "moveUnityAnim": "",
  "deathUnityAnim": "",
  "btOwner": {
    "m_FileID": 0,
    "m_PathID": -4924602173201530963
  },
  "bodyCollider": {
    "m_FileID": 0,
    "m_PathID": -5992519300869267732
  },
  "deathSfx": {
    "clip": {
      "m_FileID": 0,
      "m_PathID": -6723630911111122065
    },
    "volume": 0.4
  },
  "deathVfxPrefabList": [
    {
      "m_FileID": 0,
      "m_PathID": -976922403434648071
    },
    {
      "m_FileID": 0,
      "m_PathID": -7033381468259161423
    },
    {
      "m_FileID": 0,
      "m_PathID": 4355621886683685810
    }
  ],
  "spawnAnim": "",
  "hitAnim": "hit",
  "hitUnityAnim": "hit",
  "attackAnim": "shot",
  "attackAnimEventName": "shot",
  "panicAnim": "scare_panic",
  "attackBT": {
    "m_FileID": 0,
    "m_PathID": -6969879946276865132
  },
  "projectilePrefab": {
    "m_FileID": 0,
    "m_PathID": 2965396989171029638
  },
  "projectileSpeed": 7.0,
  "projectileType": 0,
  "projectileSpawnPivotType": 0,
  "projectileSpawnOffset": {
    "x": -0.85,
    "y": 0.55
  }
}