{
  "m_GameObject": {
    "m_FileID": 0,
    "m_PathID": 0
  },
  "m_Enabled": 1,
  "m_Script": {
    "m_FileID": 0,
    "m_PathID": -6617529616628678929
  },
  "m_Name": "SpineAnimationStateClip",
  "template": {
    "animationReference": {
      "m_FileID": 0,
      "m_PathID": 1724411174195582346
    },
    "loop": 0,
    "customDuration": 0,
    "useBlendDuration": 1,
    "isInitialized": 1,
    "mixDuration": 0.1,
    "holdPrevious": 0,
    "attachmentThreshold": 0.5,
    "eventThreshold": 0.5,
    "drawOrderThreshold": 0.5
  }
}