{
  "m_GameObject": {
    "m_FileID": 0,
    "m_PathID": 8463877665867111089
  },
  "m_Enabled": 1,
  "m_Script": {
    "m_FileID": 0,
    "m_PathID": 8736026460523504383
  },
  "m_Name": "",
  "cloudPrefab": {
    "m_FileID": 0,
    "m_PathID": 3913187281079099858
  }
}