{
  "m_GameObject": {
    "m_FileID": 0,
    "m_PathID": -8302300094458485973
  },
  "m_Enabled": 1,
  "m_Script": {
    "m_FileID": 0,
    "m_PathID": -8471220842657547617
  },
  "m_Name": "",
  "m_Material": {
    "m_FileID": 0,
    "m_PathID": 0
  },
  "m_Color": {
    "r": 1.0,
    "g": 1.0,
    "b": 1.0,
    "a": 1.0
  },
  "m_RaycastTarget": 0,
  "m_RaycastPadding": {
    "x": 0.0,
    "y": 0.0,
    "z": 0.0,
    "w": 0.0
  },
  "m_Maskable": 0,
  "m_OnCullStateChanged": {
    "m_PersistentCalls": {
      "m_Calls": []
    }
  },
  "m_Texture": {
    "m_FileID": 0,
    "m_PathID": 0
  },
  "m_UVRect": {
    "x": 0.0,
    "y": 0.0,
    "width": 1.0,
    "height": 1.0
  }
}