{
  "m_GameObject": {
    "m_FileID": 0,
    "m_PathID": 0
  },
  "m_Enabled": 1,
  "m_Script": {
    "m_FileID": 0,
    "m_PathID": 1008803689438726606
  },
  "m_Name": "29200_badbird_Atlas",
  "atlasFile": {
    "m_FileID": 0,
    "m_PathID": -3396862696342052921
  },
  "materials": [
    {
      "m_FileID": 0,
      "m_PathID": 7202712566388569246
    }
  ]
}