{
  "m_GameObject": {
    "m_FileID": 0,
    "m_PathID": -1889902890881087804
  },
  "m_Enabled": 1,
  "m_Script": {
    "m_FileID": 0,
    "m_PathID": -7138704987837968499
  },
  "m_Name": "",
  "selfSelected": 0,
  "onSelected": {
    "m_PersistentCalls": {
      "m_Calls": []
    }
  },
  "onDeselected": {
    "m_PersistentCalls": {
      "m_Calls": []
    }
  },
  "use": 0,
  "onSelectedFinger": {
    "m_PersistentCalls": {
      "m_Calls": []
    }
  },
  "onSelectedFingerUp": {
    "m_PersistentCalls": {
      "m_Calls": [
        {
          "m_Target": {
            "m_FileID": 0,
            "m_PathID": 321605314100514581
          },
          "m_TargetAssemblyTypeName": "LoadComplete.UI.PopupMine, Assembly-CSharp",
          "m_MethodName": "OnUseItemDragEnd",
          "m_Mode": 0,
          "m_Arguments": {
            "m_ObjectArgument": {
              "m_FileID": 0,
              "m_PathID": 0
            },
            "m_ObjectArgumentAssemblyTypeName": "UnityEngine.Object, UnityEngine",
            "m_IntArgument": 0,
            "m_FloatArgument": 0.0,
            "m_StringArgument": "",
            "m_BoolArgument": 0
          },
          "m_CallState": 2
        }
      ]
    }
  },
  "onSelectedSelectFinger": {
    "m_PersistentCalls": {
      "m_Calls": []
    }
  },
  "onSelectedSelectFingerUp": {
    "m_PersistentCalls": {
      "m_Calls": []
    }
  }
}