{
  "m_GameObject": {
    "m_FileID": 0,
    "m_PathID": 6128538947166373747
  },
  "m_Enabled": 1,
  "m_Script": {
    "m_FileID": 0,
    "m_PathID": -8940529911906571770
  },
  "m_Name": "",
  "ignoreList": [],
  "bindables": []
}