{
  "m_GameObject": {
    "m_FileID": 0,
    "m_PathID": 4196809075449763380
  },
  "m_Enabled": 1,
  "m_Script": {
    "m_FileID": 4,
    "m_PathID": 2793829366360182751
  },
  "m_Name": "",
  "interfaceName": "AdsBuff",
  "lockObjects": [],
  "unlockObjects": [
    {
      "m_FileID": 0,
      "m_PathID": -8713580020638217404
    }
  ]
}