{
  "m_GameObject": {
    "m_FileID": 0,
    "m_PathID": -4175798418137616922
  },
  "m_Enabled": 1,
  "m_Script": {
    "m_FileID": 0,
    "m_PathID": 5430390970507557720
  },
  "m_Name": "",
  "onEnable": {
    "m_PersistentCalls": {
      "m_Calls": []
    }
  },
  "onChangedRedDotActive": {
    "m_PersistentCalls": {
      "m_Calls": [
        {
          "m_Target": {
            "m_FileID": 0,
            "m_PathID": -6611800030784106281
          },
          "m_TargetAssemblyTypeName": "LoadComplete.UI.RedDotAnimator, Assembly-CSharp",
          "m_MethodName": "OnChangedEnable",
          "m_Mode": 0,
          "m_Arguments": {
            "m_ObjectArgument": {
              "m_FileID": 0,
              "m_PathID": 0
            },
            "m_ObjectArgumentAssemblyTypeName": "UnityEngine.Object, UnityEngine",
            "m_IntArgument": 0,
            "m_FloatArgument": 0.0,
            "m_StringArgument": "",
            "m_BoolArgument": 0
          },
          "m_CallState": 2
        }
      ]
    }
  },
  "redDotObjects": [
    {
      "m_FileID": 3,
      "m_PathID": 2478780622967761480
    },
    {
      "m_FileID": 3,
      "m_PathID": -2677206488130481616
    },
    {
      "m_FileID": 3,
      "m_PathID": -821661654811906628
    }
  ]
}