{
  "m_GameObject": {
    "m_FileID": 0,
    "m_PathID": 0
  },
  "m_Enabled": 1,
  "m_Script": {
    "m_FileID": 0,
    "m_PathID": 1008803689438726606
  },
  "m_Name": "20000_chicken_Atlas",
  "atlasFile": {
    "m_FileID": 0,
    "m_PathID": 7787373624129437295
  },
  "materials": [
    {
      "m_FileID": 0,
      "m_PathID": -9008628083661661028
    }
  ]
}