{
  "m_GameObject": {
    "m_FileID": 0,
    "m_PathID": 24
  },
  "m_Enabled": 1,
  "m_Script": {
    "m_FileID": 1,
    "m_PathID": 26
  },
  "m_Name": "",
  "localizeKey": "",
  "fontMaterial": {
    "m_FileID": 4,
    "m_PathID": 379438189239238212
  },
  "overrideFonts": []
}