{
  "m_GameObject": {
    "m_FileID": 0,
    "m_PathID": 4189477317710863377
  },
  "m_Enabled": 1,
  "m_Script": {
    "m_FileID": 0,
    "m_PathID": 9155301573292911620
  },
  "m_Name": "",
  "scaler": {
    "m_FileID": 0,
    "m_PathID": -2060324816426798000
  },
  "rigidbody": {
    "m_FileID": 0,
    "m_PathID": 3790706075810219776
  },
  "modelDefaultDirection": 0,
  "modelType": 0,
  "skeletonAnimation": {
    "m_FileID": 0,
    "m_PathID": -7246135766167292218
  },
  "animator": {
    "m_FileID": 0,
    "m_PathID": 0
  },
  "height": 0.62,
  "width": 0.88,
  "idleAnim": "idle",
  "moveAnim": "walk",
  "deathAnim": "die_hit",
  "idleUnityAnim": "",
  "moveUnityAnim": "",
  "deathUnityAnim": "",
  "firePosition": {
    "m_FileID": 0,
    "m_PathID": -8627435309228201942
  },
  "projectilePrefab": {
    "m_FileID": 0,
    "m_PathID": -3061042524374607621
  },
  "projectileType": 1,
  "deathEndAnim": "die_end",
  "hitAnim": "hit",
  "deathSfx": {
    "m_FileID": 0,
    "m_PathID": -7987846336070825119
  },
  "hitSfx": {
    "m_FileID": 13,
    "m_PathID": 2250040703668492235
  }
}