{
  "m_GameObject": {
    "m_FileID": 0,
    "m_PathID": 7248066973524795571
  },
  "m_Enabled": 1,
  "m_Script": {
    "m_FileID": 0,
    "m_PathID": -8940529911906571770
  },
  "m_Name": "",
  "ignoreList": [],
  "bindables": [
    {
      "m_FileID": 0,
      "m_PathID": -1441333596438542318
    },
    {
      "m_FileID": 0,
      "m_PathID": -2848046626866889302
    },
    {
      "m_FileID": 0,
      "m_PathID": -4497589185334595951
    },
    {
      "m_FileID": 0,
      "m_PathID": -8681811167256454560
    },
    {
      "m_FileID": 0,
      "m_PathID": 6825645949886343964
    },
    {
      "m_FileID": 0,
      "m_PathID": 8683268094236662996
    }
  ]
}