{
  "m_GameObject": {
    "m_FileID": 0,
    "m_PathID": 4036213959836963433
  },
  "m_Enabled": 1,
  "m_Script": {
    "m_FileID": 0,
    "m_PathID": -3242970711442325531
  },
  "m_Name": "",
  "bindKey": "item.IsMySelf",
  "isReverse": 1
}