{
  "m_GameObject": {
    "m_FileID": 0,
    "m_PathID": -8928174246152292523
  },
  "m_Enabled": 1,
  "m_Script": {
    "m_FileID": 0,
    "m_PathID": 4792008904694137870
  },
  "m_Name": "",
  "onClick": {
    "m_PersistentCalls": {
      "m_Calls": []
    }
  },
  "onPointerDown": {
    "m_PersistentCalls": {
      "m_Calls": []
    }
  },
  "onPointerEventEnd": {
    "m_PersistentCalls": {
      "m_Calls": []
    }
  }
}