{
  "m_GameObject": {
    "m_FileID": 0,
    "m_PathID": 835868573525604779
  },
  "m_Enabled": 1,
  "m_Script": {
    "m_FileID": 0,
    "m_PathID": -8091456346061954500
  },
  "m_Name": "",
  "m_Padding": {
    "m_Left": 0,
    "m_Right": 0,
    "m_Top": 0,
    "m_Bottom": 0
  },
  "m_ChildAlignment": 4,
  "m_Spacing": 11.58,
  "m_ChildForceExpandWidth": 0,
  "m_ChildForceExpandHeight": 0,
  "m_ChildControlWidth": 0,
  "m_ChildControlHeight": 0,
  "m_ChildScaleWidth": 0,
  "m_ChildScaleHeight": 0,
  "m_ReverseArrangement": 0
}