{
  "m_GameObject": {
    "m_FileID": 0,
    "m_PathID": 5912947685965398238
  },
  "m_Enabled": 1,
  "m_Script": {
    "m_FileID": 1,
    "m_PathID": 425168875757824589
  },
  "m_Name": "",
  "m_IgnoreLayout": 0,
  "m_MinWidth": -1.0,
  "m_MinHeight": -1.0,
  "m_PreferredWidth": 96.7623,
  "m_PreferredHeight": 106.6707,
  "m_FlexibleWidth": -1.0,
  "m_FlexibleHeight": -1.0,
  "m_LayoutPriority": 1
}