{
  "m_GameObject": {
    "m_FileID": 0,
    "m_PathID": -2865052111019888432
  },
  "m_Enabled": 1,
  "m_Script": {
    "m_FileID": 0,
    "m_PathID": -5151405681989399186
  },
  "m_Name": "",
  "rtBody": {
    "m_FileID": 0,
    "m_PathID": 1227731997706596057
  },
  "descText": {
    "m_FileID": 0,
    "m_PathID": 1573368613543866889
  }
}