{
  "m_GameObject": {
    "m_FileID": 0,
    "m_PathID": -3826214878406347287
  },
  "m_Enabled": 1,
  "m_Script": {
    "m_FileID": 0,
    "m_PathID": -9198578114496595793
  },
  "m_Name": "",
  "icon": {
    "m_FileID": 0,
    "m_PathID": -5413660534317316140
  }
}