{
  "m_GameObject": {
    "m_FileID": 0,
    "m_PathID": 0
  },
  "m_Enabled": 1,
  "m_Script": {
    "m_FileID": 0,
    "m_PathID": 1008803689438726606
  },
  "m_Name": "rock_Atlas",
  "atlasFile": {
    "m_FileID": 0,
    "m_PathID": -956478999705780618
  },
  "materials": [
    {
      "m_FileID": 0,
      "m_PathID": -4489636185525849367
    }
  ]
}