{
  "m_GameObject": {
    "m_FileID": 0,
    "m_PathID": -2971752885032280292
  },
  "m_Enabled": 1,
  "m_Script": {
    "m_FileID": 0,
    "m_PathID": -8473075054397180242
  },
  "m_Name": "",
  "amountText": {
    "m_FileID": 0,
    "m_PathID": -7152444580832473421
  },
  "rewardIcon": {
    "m_FileID": 0,
    "m_PathID": 7545336181896477098
  },
  "enabledBgObj": {
    "m_FileID": 0,
    "m_PathID": -3843480861932259131
  }
}