{
  "m_GameObject": {
    "m_FileID": 0,
    "m_PathID": -8377495890754280593
  },
  "m_Enabled": 1,
  "m_Script": {
    "m_FileID": 0,
    "m_PathID": 9202454401006530641
  },
  "m_Name": "",
  "skeletonDataAsset": {
    "m_FileID": 0,
    "m_PathID": -7932303194703786624
  },
  "initialSkinName": "",
  "initialFlipX": 0,
  "initialFlipY": 0,
  "updateWhenInvisible": 3,
  "separatorSlotNames": [],
  "zSpacing": 0.0,
  "useClipping": 1,
  "immutableTriangles": 0,
  "pmaVertexColors": 1,
  "clearStateOnDisable": 0,
  "tintBlack": 1,
  "singleSubmesh": 0,
  "fixDrawOrder": 0,
  "addNormals": 0,
  "calculateTangents": 0,
  "maskInteraction": 0,
  "maskMaterials": {
    "materialsMaskDisabled": [],
    "materialsInsideMask": [],
    "materialsOutsideMask": []
  },
  "disableRenderingOnOverride": 1,
  "_animationName": "idle",
  "loop": 1,
  "timeScale": 1.0
}