{
  "m_GameObject": {
    "m_FileID": 0,
    "m_PathID": 0
  },
  "m_Enabled": 1,
  "m_Script": {
    "m_FileID": 0,
    "m_PathID": -101615303468605065
  },
  "m_Name": "TreasureRedDot",
  "iconType": 0,
  "sortOrder": 0
}