{
  "m_GameObject": {
    "m_FileID": 0,
    "m_PathID": -1868756450892517481
  },
  "m_Enabled": 1,
  "m_Script": {
    "m_FileID": 0,
    "m_PathID": -3242970711442325531
  },
  "m_Name": "",
  "bindKey": "EquippedBonusDeltaActive",
  "isReverse": 0
}