{
  "m_GameObject": {
    "m_FileID": 0,
    "m_PathID": 0
  },
  "m_Enabled": 1,
  "m_Script": {
    "m_FileID": 0,
    "m_PathID": -6032521262642914329
  },
  "m_Name": "ArmorUpgradeRedDot",
  "iconType": 0,
  "sortOrder": 0,
  "equipmentType": 1
}