{
  "m_GameObject": {
    "m_FileID": 0,
    "m_PathID": 8866491808468142116
  },
  "m_Enabled": 1,
  "m_Script": {
    "m_FileID": 0,
    "m_PathID": 7126201101303480357
  },
  "m_Name": "",
  "_renderer": {
    "m_FileID": 0,
    "m_PathID": -2461585511258189320
  },
  "_animator": {
    "m_FileID": 0,
    "m_PathID": -7083039318663689723
  },
  "scaler": {
    "m_FileID": 0,
    "m_PathID": -3798702381981072010
  },
  "_playbackSpeed": 0.4,
  "_faceCurve01": {
    "m_Curve": [
      {
        "time": 0.0,
        "value": 1.0,
        "inSlope": 0.0,
        "outSlope": 0.0,
        "weightedMode": 0,
        "inWeight": 0.0,
        "outWeight": 0.333333343
      },
      {
        "time": 0.2751681,
        "value": 1.0,
        "inSlope": "Infinity",
        "outSlope": -0.9014598,
        "weightedMode": 0,
        "inWeight": 0.333333343,
        "outWeight": 0.333333343
      },
      {
        "time": 1.0,
        "value": 0.0,
        "inSlope": -0.429187536,
        "outSlope": -0.429187536,
        "weightedMode": 0,
        "inWeight": 0.184730768,
        "outWeight": 0.0
      }
    ],
    "m_PreInfinity": 2,
    "m_PostInfinity": 2,
    "m_RotationOrder": 4
  },
  "_scaleCurve01": {
    "m_Curve": [
      {
        "time": 0.0,
        "value": 3.0,
        "inSlope": -14.0916929,
        "outSlope": -14.0916929,
        "weightedMode": 0,
        "inWeight": 0.0,
        "outWeight": 0.111861035
      },
      {
        "time": 0.198365316,
        "value": 1.0,
        "inSlope": -1.49750161,
        "outSlope": "Infinity",
        "weightedMode": 0,
        "inWeight": 0.5078114,
        "outWeight": 0.333333343
      },
      {
        "time": 1.0,
        "value": 1.0,
        "inSlope": 0.0,
        "outSlope": 0.0,
        "weightedMode": 0,
        "inWeight": 0.333333343,
        "outWeight": 0.0
      }
    ],
    "m_PreInfinity": 2,
    "m_PostInfinity": 2,
    "m_RotationOrder": 4
  }
}