{
  "m_GameObject": {
    "m_FileID": 0,
    "m_PathID": -2626920073285850866
  },
  "m_Enabled": 1,
  "m_Script": {
    "m_FileID": 0,
    "m_PathID": 5497312474197459448
  },
  "m_Name": "",
  "imgIcon": {
    "m_FileID": 0,
    "m_PathID": 7759912773534146914
  },
  "txtName": {
    "m_FileID": 0,
    "m_PathID": 8541381855157424104
  },
  "txtRate": {
    "m_FileID": 0,
    "m_PathID": 794086977956204898
  }
}