{
  "m_GameObject": {
    "m_FileID": 0,
    "m_PathID": -6079295411028704551
  },
  "m_Enabled": 1,
  "m_Script": {
    "m_FileID": 0,
    "m_PathID": -5392852106782294089
  },
  "m_Name": "",
  "m_HorizontalFit": 2,
  "m_VerticalFit": 0
}