{
  "m_GameObject": {
    "m_FileID": 0,
    "m_PathID": -918158448836942923
  },
  "m_Enabled": 1,
  "m_Script": {
    "m_FileID": 0,
    "m_PathID": 4776882142093204921
  },
  "m_Name": "",
  "m_Delegates": [
    {
      "eventID": 4,
      "callback": {
        "m_PersistentCalls": {
          "m_Calls": [
            {
              "m_Target": {
                "m_FileID": 0,
                "m_PathID": 3339473273700344423
              },
              "m_TargetAssemblyTypeName": "PopupBase, Slime.Core",
              "m_MethodName": "Hide",
              "m_Mode": 1,
              "m_Arguments": {
                "m_ObjectArgument": {
                  "m_FileID": 0,
                  "m_PathID": 0
                },
                "m_ObjectArgumentAssemblyTypeName": "UnityEngine.Object, UnityEngine",
                "m_IntArgument": 0,
                "m_FloatArgument": 0.0,
                "m_StringArgument": "",
                "m_BoolArgument": 0
              },
              "m_CallState": 2
            }
          ]
        }
      }
    }
  ]
}