{
  "m_GameObject": {
    "m_FileID": 0,
    "m_PathID": 5513952053490429806
  },
  "m_Enabled": 1,
  "m_Script": {
    "m_FileID": 4,
    "m_PathID": 2793829366360182751
  },
  "m_Name": "",
  "interfaceName": "EquipmentButton",
  "lockObjects": [
    {
      "m_FileID": 0,
      "m_PathID": 8957033792338505188
    },
    {
      "m_FileID": 0,
      "m_PathID": -1551232105370468892
    }
  ],
  "unlockObjects": []
}