{
  "m_GameObject": {
    "m_FileID": 0,
    "m_PathID": 7171652083350648475
  },
  "m_Enabled": 1,
  "m_Script": {
    "m_FileID": 0,
    "m_PathID": 5430390970507557720
  },
  "m_Name": "",
  "onEnable": {
    "m_PersistentCalls": {
      "m_Calls": [
        {
          "m_Target": {
            "m_FileID": 0,
            "m_PathID": -40955860960189099
          },
          "m_TargetAssemblyTypeName": "LoadComplete.UI.RedDotChecker, Assembly-CSharp",
          "m_MethodName": "",
          "m_Mode": 1,
          "m_Arguments": {
            "m_ObjectArgument": {
              "m_FileID": 0,
              "m_PathID": 0
            },
            "m_ObjectArgumentAssemblyTypeName": "UnityEngine.Object, UnityEngine",
            "m_IntArgument": 0,
            "m_FloatArgument": 0.0,
            "m_StringArgument": "",
            "m_BoolArgument": 0
          },
          "m_CallState": 2
        }
      ]
    }
  },
  "onChangedRedDotActive": {
    "m_PersistentCalls": {
      "m_Calls": [
        {
          "m_Target": {
            "m_FileID": 0,
            "m_PathID": -3106044345945069581
          },
          "m_TargetAssemblyTypeName": "LoadComplete.UI.RedDotAnimator, Assembly-CSharp",
          "m_MethodName": "OnChangedEnable",
          "m_Mode": 0,
          "m_Arguments": {
            "m_ObjectArgument": {
              "m_FileID": 0,
              "m_PathID": 0
            },
            "m_ObjectArgumentAssemblyTypeName": "UnityEngine.Object, UnityEngine",
            "m_IntArgument": 0,
            "m_FloatArgument": 0.0,
            "m_StringArgument": "",
            "m_BoolArgument": 0
          },
          "m_CallState": 2
        }
      ]
    }
  },
  "redDotObjects": [
    {
      "m_FileID": 6,
      "m_PathID": -889875447201312633
    }
  ]
}