{
  "m_GameObject": {
    "m_FileID": 0,
    "m_PathID": -6776007218328809758
  },
  "m_Enabled": 1,
  "m_Script": {
    "m_FileID": 0,
    "m_PathID": 2583973574143635226
  },
  "m_Name": "",
  "prefab": {
    "m_FileID": 0,
    "m_PathID": -3826214878406347287
  },
  "notification": 0,
  "strategy": 0,
  "preload": 50,
  "capacity": 0,
  "recycle": 0,
  "persist": 0,
  "stamp": 0,
  "warnings": 0,
  "spawnedClonesList": [],
  "despawnedClones": [],
  "delays": [],
  "deactivatedChild": {
    "m_FileID": 0,
    "m_PathID": 0
  }
}