{
  "m_GameObject": {
    "m_FileID": 0,
    "m_PathID": -8176613010811404247
  },
  "m_Enabled": 1,
  "m_Script": {
    "m_FileID": 0,
    "m_PathID": -3145637842078782806
  },
  "m_Name": "",
  "target": {
    "m_FileID": 0,
    "m_PathID": 6938060693926282902
  }
}