{
  "m_GameObject": {
    "m_FileID": 0,
    "m_PathID": 0
  },
  "m_Enabled": 1,
  "m_Script": {
    "m_FileID": 0,
    "m_PathID": -2033692801501575607
  },
  "m_Name": "Texture[box_def1_line_r25]",
  "address": "Texture[box_def1_line_r25]"
}