{
  "m_GameObject": {
    "m_FileID": 0,
    "m_PathID": -571672067146082380
  },
  "m_Enabled": 1,
  "m_Script": {
    "m_FileID": 0,
    "m_PathID": 2765568706372599266
  },
  "m_Name": "",
  "m_ItemKey": "item",
  "m_ItemPrefab": {
    "m_FileID": 6,
    "m_PathID": 3060964609892225496
  },
  "useLeanPool": 0,
  "useLeanGameObjectPool": 0,
  "gameObjectPool": {
    "m_FileID": 0,
    "m_PathID": 0
  },
  "m_Key": "OptionItems"
}