{
  "m_GameObject": {
    "m_FileID": 0,
    "m_PathID": 6709756065198345811
  },
  "m_Enabled": 1,
  "m_Script": {
    "m_FileID": 0,
    "m_PathID": 8962903080549542158
  },
  "m_Name": "",
  "localizeKey": "SHOP_PURCHASE_COMPLETE",
  "fontMaterial": {
    "m_FileID": 1,
    "m_PathID": 379438189239238212
  },
  "overrideFonts": []
}