{
  "m_GameObject": {
    "m_FileID": 0,
    "m_PathID": 8801386723620415913
  },
  "m_Enabled": 1,
  "m_Script": {
    "m_FileID": 0,
    "m_PathID": 1117752915966211304
  },
  "m_Name": "",
  "width": 1.02,
  "scaleSyncTarget": {
    "m_FileID": 0,
    "m_PathID": -9075007878609809909
  }
}