{
  "m_GameObject": {
    "m_FileID": 0,
    "m_PathID": -898249019019314639
  },
  "m_Enabled": 1,
  "m_Script": {
    "m_FileID": 0,
    "m_PathID": -7030229213176759517
  },
  "m_Name": "",
  "m_Material": {
    "m_FileID": 0,
    "m_PathID": 0
  },
  "m_Color": {
    "r": 0.149019614,
    "g": 0.172549024,
    "b": 0.203921571,
    "a": 0.6
  },
  "m_RaycastTarget": 1,
  "m_RaycastPadding": {
    "x": 0.0,
    "y": 0.0,
    "z": 0.0,
    "w": 0.0
  },
  "m_Maskable": 1,
  "m_OnCullStateChanged": {
    "m_PersistentCalls": {
      "m_Calls": []
    }
  },
  "m_Sprite": {
    "m_FileID": 2,
    "m_PathID": 835558773749078061
  },
  "m_Type": 1,
  "m_PreserveAspect": 0,
  "m_FillCenter": 1,
  "m_FillMethod": 4,
  "m_FillAmount": 1.0,
  "m_FillClockwise": 1,
  "m_FillOrigin": 0,
  "m_UseSpriteMesh": 0,
  "m_PixelsPerUnitMultiplier": 1.0
}