{
  "m_GameObject": {
    "m_FileID": 0,
    "m_PathID": 0
  },
  "m_Enabled": 1,
  "m_Script": {
    "m_FileID": 0,
    "m_PathID": 8320850124548970631
  },
  "m_Name": "Spine Animation State Track",
  "m_Version": 3,
  "m_AnimClip": {
    "m_FileID": 0,
    "m_PathID": 0
  },
  "m_Locked": 0,
  "m_Muted": 0,
  "m_CustomPlayableFullTypename": "",
  "m_Curves": {
    "m_FileID": 0,
    "m_PathID": 0
  },
  "m_Parent": {
    "m_FileID": 0,
    "m_PathID": -4688059702142302833
  },
  "m_Children": [],
  "m_Clips": [
    {
      "m_Version": 1,
      "m_Start": 0.0,
      "m_ClipIn": 0.0,
      "m_Asset": {
        "m_FileID": 0,
        "m_PathID": -2093288611708990624
      },
      "m_Duration": 0.13333333333333333,
      "m_TimeScale": 1.0,
      "m_ParentTrack": {
        "m_FileID": 0,
        "m_PathID": 7236409187184674947
      },
      "m_EaseInDuration": 0.0,
      "m_EaseOutDuration": 0.0,
      "m_BlendInDuration": -1.0,
      "m_BlendOutDuration": 0.016666666666666663,
      "m_MixInCurve": {
        "m_Curve": [
          {
            "time": 0.0,
            "value": 0.0,
            "inSlope": 0.0,
            "outSlope": 0.0,
            "weightedMode": 0,
            "inWeight": 0.0,
            "outWeight": 0.0
          },
          {
            "time": 1.0,
            "value": 1.0,
            "inSlope": 0.0,
            "outSlope": 0.0,
            "weightedMode": 0,
            "inWeight": 0.0,
            "outWeight": 0.0
          }
        ],
        "m_PreInfinity": 2,
        "m_PostInfinity": 2,
        "m_RotationOrder": 4
      },
      "m_MixOutCurve": {
        "m_Curve": [
          {
            "time": 0.0,
            "value": 1.0,
            "inSlope": 0.0,
            "outSlope": 0.0,
            "weightedMode": 0,
            "inWeight": 0.0,
            "outWeight": 0.0
          },
          {
            "time": 1.0,
            "value": 0.0,
            "inSlope": 0.0,
            "outSlope": 0.0,
            "weightedMode": 0,
            "inWeight": 0.0,
            "outWeight": 0.0
          }
        ],
        "m_PreInfinity": 2,
        "m_PostInfinity": 2,
        "m_RotationOrder": 4
      },
      "m_BlendInCurveMode": 0,
      "m_BlendOutCurveMode": 0,
      "m_ExposedParameterNames": [],
      "m_AnimationCurves": {
        "m_FileID": 0,
        "m_PathID": 0
      },
      "m_Recordable": 0,
      "m_PostExtrapolationMode": 0,
      "m_PreExtrapolationMode": 0,
      "m_PostExtrapolationTime": 0.0,
      "m_PreExtrapolationTime": 0.0,
      "m_DisplayName": "idle"
    },
    {
      "m_Version": 1,
      "m_Start": 0.11666666666666667,
      "m_ClipIn": 0.0,
      "m_Asset": {
        "m_FileID": 0,
        "m_PathID": -4845876650761933585
      },
      "m_Duration": 0.33329999446868896,
      "m_TimeScale": 1.0,
      "m_ParentTrack": {
        "m_FileID": 0,
        "m_PathID": 7236409187184674947
      },
      "m_EaseInDuration": 0.0,
      "m_EaseOutDuration": 0.0,
      "m_BlendInDuration": 0.016666666666666663,
      "m_BlendOutDuration": -1.0,
      "m_MixInCurve": {
        "m_Curve": [
          {
            "time": 0.0,
            "value": 0.0,
            "inSlope": 0.0,
            "outSlope": 0.0,
            "weightedMode": 0,
            "inWeight": 0.0,
            "outWeight": 0.0
          },
          {
            "time": 1.0,
            "value": 1.0,
            "inSlope": 0.0,
            "outSlope": 0.0,
            "weightedMode": 0,
            "inWeight": 0.0,
            "outWeight": 0.0
          }
        ],
        "m_PreInfinity": 2,
        "m_PostInfinity": 2,
        "m_RotationOrder": 4
      },
      "m_MixOutCurve": {
        "m_Curve": [
          {
            "time": 0.0,
            "value": 1.0,
            "inSlope": 0.0,
            "outSlope": 0.0,
            "weightedMode": 0,
            "inWeight": 0.0,
            "outWeight": 0.0
          },
          {
            "time": 1.0,
            "value": 0.0,
            "inSlope": 0.0,
            "outSlope": 0.0,
            "weightedMode": 0,
            "inWeight": 0.0,
            "outWeight": 0.0
          }
        ],
        "m_PreInfinity": 2,
        "m_PostInfinity": 2,
        "m_RotationOrder": 4
      },
      "m_BlendInCurveMode": 0,
      "m_BlendOutCurveMode": 0,
      "m_ExposedParameterNames": [],
      "m_AnimationCurves": {
        "m_FileID": 0,
        "m_PathID": 0
      },
      "m_Recordable": 0,
      "m_PostExtrapolationMode": 0,
      "m_PreExtrapolationMode": 0,
      "m_PostExtrapolationTime": 0.0,
      "m_PreExtrapolationTime": 0.0,
      "m_DisplayName": "attack"
    }
  ],
  "m_Markers": {
    "m_Objects": []
  },
  "trackIndex": 0
}