{
  "m_GameObject": {
    "m_FileID": 0,
    "m_PathID": -3672903970991847043
  },
  "m_Enabled": 1,
  "m_Script": {
    "m_FileID": 0,
    "m_PathID": 425168875757824589
  },
  "m_Name": "",
  "m_IgnoreLayout": 0,
  "m_MinWidth": 35.0,
  "m_MinHeight": 26.5,
  "m_PreferredWidth": 35.0,
  "m_PreferredHeight": 26.5,
  "m_FlexibleWidth": -1.0,
  "m_FlexibleHeight": -1.0,
  "m_LayoutPriority": 1
}