{
  "m_GameObject": {
    "m_FileID": 0,
    "m_PathID": 72361164439896832
  },
  "m_Enabled": 1,
  "m_Script": {
    "m_FileID": 0,
    "m_PathID": 8962903080549542158
  },
  "m_Name": "",
  "localizeKey": "DAILY_GEM_RICH_SPEECH4",
  "fontMaterial": {
    "m_FileID": 0,
    "m_PathID": 0
  },
  "overrideFonts": []
}