{
  "m_GameObject": {
    "m_FileID": 0,
    "m_PathID": -6535310471335016779
  },
  "m_Enabled": 1,
  "m_Script": {
    "m_FileID": 3,
    "m_PathID": -7784299604066853536
  },
  "m_Name": "",
  "m_ShowMaskGraphic": 1
}