{
  "m_GameObject": {
    "m_FileID": 0,
    "m_PathID": 1502665240301748918
  },
  "m_Enabled": 1,
  "m_Script": {
    "m_FileID": 0,
    "m_PathID": -3791268300992824667
  },
  "m_Name": "",
  "tmpText": {
    "m_FileID": 0,
    "m_PathID": 4349296173800256118
  }
}