{
  "m_GameObject": {
    "m_FileID": 0,
    "m_PathID": -3178600332268973264
  },
  "m_Enabled": 1,
  "m_Script": {
    "m_FileID": 0,
    "m_PathID": 968796850224110202
  },
  "m_Name": "",
  "currencyType": 17,
  "icon": {
    "m_FileID": 0,
    "m_PathID": 3857197880787037062
  },
  "amountText": {
    "m_FileID": 0,
    "m_PathID": -5110105351364724928
  },
  "bigDoubleFormatToggle": 1,
  "bigDoubleFormatCondition": 4
}