{
  "m_GameObject": {
    "m_FileID": 0,
    "m_PathID": 2460393889951656716
  },
  "m_Enabled": 1,
  "m_Script": {
    "m_FileID": 0,
    "m_PathID": 968796850224110202
  },
  "m_Name": "",
  "currencyType": 1,
  "icon": {
    "m_FileID": 0,
    "m_PathID": 5532382486516037633
  },
  "amountText": {
    "m_FileID": 0,
    "m_PathID": 2288252642524832125
  },
  "bigDoubleFormatToggle": 0,
  "bigDoubleFormatCondition": 0
}