{
  "m_GameObject": {
    "m_FileID": 0,
    "m_PathID": 2629553041139973644
  },
  "m_Enabled": 1,
  "m_Script": {
    "m_FileID": 0,
    "m_PathID": -3867284280405644753
  },
  "m_Name": "",
  "refreshInterval": 1.0,
  "dataBindContext": {
    "m_FileID": 0,
    "m_PathID": -4005121967025709870
  },
  "batteryChargingColor": {
    "r": 0.2688679,
    "g": 1.0,
    "b": 0.433752924,
    "a": 1.0
  },
  "maskRt": {
    "m_FileID": 0,
    "m_PathID": -6077104498144030745
  },
  "slider": {
    "m_FileID": 0,
    "m_PathID": -8287552512339518459
  },
  "maskMaxWidth": 0.82,
  "slimeAnimator": {
    "m_FileID": 0,
    "m_PathID": 1911027443878267380
  },
  "slimeDecoTransform": {
    "m_FileID": 0,
    "m_PathID": 1137642779162577054
  }
}