{
  "m_GameObject": {
    "m_FileID": 0,
    "m_PathID": 85639047973014639
  },
  "m_Enabled": 1,
  "m_Script": {
    "m_FileID": 0,
    "m_PathID": 2318624509326617490
  },
  "m_Name": "",
  "imgBg": {
    "m_FileID": 0,
    "m_PathID": -1126621568881007628
  },
  "imgIcon": {
    "m_FileID": 0,
    "m_PathID": -5348193417781107824
  },
  "txtPrevLevel": {
    "m_FileID": 0,
    "m_PathID": -1325359697458417447
  },
  "txtNextLevel": {
    "m_FileID": 0,
    "m_PathID": 8477032309615377563
  },
  "myAnimator": {
    "m_FileID": 0,
    "m_PathID": -3751244560870247786
  },
  "playSfx": {
    "clip": {
      "m_FileID": 42,
      "m_PathID": 5453275206230765324
    },
    "volume": 0.9
  }
}