{
  "m_GameObject": {
    "m_FileID": 0,
    "m_PathID": 2168399487849765601
  },
  "m_Enabled": 1,
  "m_Script": {
    "m_FileID": 0,
    "m_PathID": -2188772657932503197
  },
  "m_Name": "",
  "vfxPrefab": {
    "m_FileID": 0,
    "m_PathID": -9066494987720749227
  },
  "sfx": {
    "m_FileID": 0,
    "m_PathID": 1457332331822453953
  },
  "hitCount": 8,
  "vfxLength": 2.4
}