{
  "m_GameObject": {
    "m_FileID": 0,
    "m_PathID": 3054347565250980344
  },
  "m_Enabled": 1,
  "m_Script": {
    "m_FileID": 4,
    "m_PathID": 2252140159486941644
  },
  "m_Name": "",
  "model": {
    "id": "SlimeInfo.ChangeButton",
    "textID": "",
    "transform": {
      "m_FileID": 0,
      "m_PathID": 0
    },
    "worldPosition": {
      "x": 0.0,
      "y": 0.0,
      "z": 0.0
    },
    "rectSize": {
      "x": 100.0,
      "y": 100.0
    },
    "offset": {
      "x": 0.0,
      "y": 0.0
    },
    "cursorAdditionalOffset": {
      "x": 0.0,
      "y": 0.0
    },
    "alignment": 4
  }
}