{
  "m_GameObject": {
    "m_FileID": 0,
    "m_PathID": 3972326979634307192
  },
  "m_Enabled": 1,
  "m_Script": {
    "m_FileID": 0,
    "m_PathID": -2496028358499895848
  },
  "m_Name": "",
  "flareImage": {
    "m_FileID": 0,
    "m_PathID": 4457885333716447561
  },
  "iconImage": {
    "m_FileID": 0,
    "m_PathID": -6106435330735198268
  },
  "bgImage": {
    "m_FileID": 0,
    "m_PathID": 6829919318365716514
  },
  "typeIconImage": {
    "m_FileID": 0,
    "m_PathID": -7123774309763710575
  }
}