{
  "m_GameObject": {
    "m_FileID": 0,
    "m_PathID": 5392048678887100687
  },
  "m_Enabled": 1,
  "m_Script": {
    "m_FileID": 0,
    "m_PathID": -7030229213176759517
  },
  "m_Name": "",
  "m_Material": {
    "m_FileID": 0,
    "m_PathID": 0
  },
  "m_Color": {
    "r": 0.152941182,
    "g": 0.1254902,
    "b": 0.121568628,
    "a": 0.2
  },
  "m_RaycastTarget": 1,
  "m_RaycastPadding": {
    "x": 0.0,
    "y": 0.0,
    "z": 0.0,
    "w": 0.0
  },
  "m_Maskable": 1,
  "m_OnCullStateChanged": {
    "m_PersistentCalls": {
      "m_Calls": []
    }
  },
  "m_Sprite": {
    "m_FileID": 1,
    "m_PathID": 7897458645741546577
  },
  "m_Type": 1,
  "m_PreserveAspect": 0,
  "m_FillCenter": 1,
  "m_FillMethod": 4,
  "m_FillAmount": 1.0,
  "m_FillClockwise": 1,
  "m_FillOrigin": 0,
  "m_UseSpriteMesh": 0,
  "m_PixelsPerUnitMultiplier": 1.0
}