{
  "m_GameObject": {
    "m_FileID": 0,
    "m_PathID": -6117506230365944743
  },
  "m_Enabled": 1,
  "m_Script": {
    "m_FileID": 0,
    "m_PathID": -1277695673213900359
  },
  "m_Name": "",
  "worldCam": {
    "m_FileID": 0,
    "m_PathID": -3240660571751344490
  },
  "focusController": {
    "m_FileID": 0,
    "m_PathID": 1969166212120399653
  },
  "areaPlaces": [
    {
      "m_FileID": 0,
      "m_PathID": -8230971774752819558
    },
    {
      "m_FileID": 0,
      "m_PathID": -923779027759947984
    },
    {
      "m_FileID": 0,
      "m_PathID": 6820122701928343399
    },
    {
      "m_FileID": 0,
      "m_PathID": 587346799890123262
    },
    {
      "m_FileID": 0,
      "m_PathID": -6203903630176293676
    },
    {
      "m_FileID": 0,
      "m_PathID": -35927977029162179
    },
    {
      "m_FileID": 0,
      "m_PathID": -2791076467133156859
    },
    {
      "m_FileID": 0,
      "m_PathID": 4041889106643502808
    }
  ],
  "villageControllerPrefab": {
    "m_FileID": 0,
    "m_PathID": 8328109524057982257
  },
  "areaSelectSfx": {
    "m_FileID": 26,
    "m_PathID": -7561118523791714714
  },
  "hideSfx": {
    "m_FileID": 25,
    "m_PathID": 8545860049683309874
  }
}