{
  "m_GameObject": {
    "m_FileID": 0,
    "m_PathID": 0
  },
  "m_Enabled": 1,
  "m_Script": {
    "m_FileID": 0,
    "m_PathID": 1008803689438726606
  },
  "m_Name": "20501_undead_Atlas",
  "atlasFile": {
    "m_FileID": 0,
    "m_PathID": 4117446861140668683
  },
  "materials": [
    {
      "m_FileID": 0,
      "m_PathID": -1912239616563762329
    }
  ]
}