{
  "m_GameObject": {
    "m_FileID": 0,
    "m_PathID": 6610317993248615815
  },
  "m_Enabled": 1,
  "m_Script": {
    "m_FileID": 0,
    "m_PathID": 1117752915966211304
  },
  "m_Name": "",
  "width": 0.75,
  "scaleSyncTarget": {
    "m_FileID": 0,
    "m_PathID": -4448748864016981081
  }
}