{
  "m_GameObject": {
    "m_FileID": 0,
    "m_PathID": 6052498699467366545
  },
  "m_Enabled": 1,
  "m_Script": {
    "m_FileID": 0,
    "m_PathID": -8091456346061954500
  },
  "m_Name": "",
  "m_Padding": {
    "m_Left": 14,
    "m_Right": 14,
    "m_Top": 8,
    "m_Bottom": 8
  },
  "m_ChildAlignment": 4,
  "m_Spacing": 0.0,
  "m_ChildForceExpandWidth": 0,
  "m_ChildForceExpandHeight": 0,
  "m_ChildControlWidth": 1,
  "m_ChildControlHeight": 1,
  "m_ChildScaleWidth": 0,
  "m_ChildScaleHeight": 0,
  "m_ReverseArrangement": 0
}