{
  "m_GameObject": {
    "m_FileID": 0,
    "m_PathID": -3191855528713407167
  },
  "m_Enabled": 1,
  "m_Script": {
    "m_FileID": 0,
    "m_PathID": 9155301573292911620
  },
  "m_Name": "",
  "scaler": {
    "m_FileID": 0,
    "m_PathID": -113047950783201394
  },
  "rigidbody": {
    "m_FileID": 0,
    "m_PathID": -63660599972448563
  },
  "modelDefaultDirection": 0,
  "modelType": 0,
  "skeletonAnimation": {
    "m_FileID": 0,
    "m_PathID": -1257886028759644374
  },
  "animator": {
    "m_FileID": 0,
    "m_PathID": 0
  },
  "height": 0.62,
  "width": 0.88,
  "idleAnim": "idle",
  "moveAnim": "walk",
  "deathAnim": "die_hit",
  "idleUnityAnim": "",
  "moveUnityAnim": "",
  "deathUnityAnim": "",
  "firePosition": {
    "m_FileID": 0,
    "m_PathID": 4902315126622590163
  },
  "projectilePrefab": {
    "m_FileID": 0,
    "m_PathID": -4526150789883170218
  },
  "projectileType": 1,
  "deathEndAnim": "die_end",
  "hitAnim": "hit",
  "deathSfx": {
    "m_FileID": 0,
    "m_PathID": -7987846336070825119
  },
  "hitSfx": {
    "m_FileID": 13,
    "m_PathID": 2250040703668492235
  }
}