{
  "m_GameObject": {
    "m_FileID": 0,
    "m_PathID": -7644684288918492349
  },
  "m_Enabled": 1,
  "m_Script": {
    "m_FileID": 0,
    "m_PathID": 4776882142093204921
  },
  "m_Name": "",
  "m_Delegates": [
    {
      "eventID": 1,
      "callback": {
        "m_PersistentCalls": {
          "m_Calls": [
            {
              "m_Target": {
                "m_FileID": 0,
                "m_PathID": 7879539960678316907
              },
              "m_TargetAssemblyTypeName": "LoadComplete.UI.SleepModeUI, Assembly-CSharp",
              "m_MethodName": "OnPointerExitSlider",
              "m_Mode": 0,
              "m_Arguments": {
                "m_ObjectArgument": {
                  "m_FileID": 0,
                  "m_PathID": 0
                },
                "m_ObjectArgumentAssemblyTypeName": "UnityEngine.Object, UnityEngine",
                "m_IntArgument": 0,
                "m_FloatArgument": 0.0,
                "m_StringArgument": "",
                "m_BoolArgument": 0
              },
              "m_CallState": 2
            }
          ]
        }
      }
    },
    {
      "eventID": 3,
      "callback": {
        "m_PersistentCalls": {
          "m_Calls": [
            {
              "m_Target": {
                "m_FileID": 0,
                "m_PathID": 7879539960678316907
              },
              "m_TargetAssemblyTypeName": "LoadComplete.UI.SleepModeUI, Assembly-CSharp",
              "m_MethodName": "OnPointerUpSlider",
              "m_Mode": 0,
              "m_Arguments": {
                "m_ObjectArgument": {
                  "m_FileID": 0,
                  "m_PathID": 0
                },
                "m_ObjectArgumentAssemblyTypeName": "UnityEngine.Object, UnityEngine",
                "m_IntArgument": 0,
                "m_FloatArgument": 0.0,
                "m_StringArgument": "",
                "m_BoolArgument": 0
              },
              "m_CallState": 2
            }
          ]
        }
      }
    }
  ]
}