{
  "m_GameObject": {
    "m_FileID": 0,
    "m_PathID": 1404423120324087183
  },
  "m_Enabled": 1,
  "m_Script": {
    "m_FileID": 0,
    "m_PathID": 2394203861304995953
  },
  "m_Name": "",
  "scaler": {
    "m_FileID": 0,
    "m_PathID": 5403944679081990506
  },
  "rigidbody": {
    "m_FileID": 0,
    "m_PathID": 5213279144543335129
  },
  "modelDefaultDirection": 0,
  "modelType": 0,
  "skeletonAnimation": {
    "m_FileID": 0,
    "m_PathID": -3955054333367182345
  },
  "animator": {
    "m_FileID": 0,
    "m_PathID": 0
  },
  "height": 2.57,
  "width": 1.91,
  "idleAnim": "idle",
  "moveAnim": "walk",
  "deathAnim": "die",
  "idleUnityAnim": "",
  "moveUnityAnim": "",
  "deathUnityAnim": "",
  "btOwner": {
    "m_FileID": 0,
    "m_PathID": -3835273048550573671
  },
  "bodyCollider": {
    "m_FileID": 0,
    "m_PathID": -4263944694372378541
  },
  "deathSfx": {
    "clip": {
      "m_FileID": 0,
      "m_PathID": -6723630911111122065
    },
    "volume": 0.4
  },
  "deathVfxPrefabList": [
    {
      "m_FileID": 0,
      "m_PathID": -976922403434648071
    },
    {
      "m_FileID": 0,
      "m_PathID": -7033381468259161423
    },
    {
      "m_FileID": 0,
      "m_PathID": 4355621886683685810
    }
  ],
  "spawnAnim": "",
  "hitAnim": "hit",
  "hitUnityAnim": "hit",
  "attackAnim": "skill_rock_drop",
  "attackAnimEventName": "drop",
  "panicAnim": "scare_panic",
  "attackBT": {
    "m_FileID": 0,
    "m_PathID": -6969879946276865132
  },
  "projectilePrefab": {
    "m_FileID": 0,
    "m_PathID": 8298196237047939278
  },
  "projectileSpeed": 7.0,
  "projectileType": 0,
  "projectileSpawnPivotType": 1,
  "projectileSpawnOffset": {
    "x": 0.0,
    "y": 5.0
  }
}