{
  "m_GameObject": {
    "m_FileID": 0,
    "m_PathID": -5315651198875075087
  },
  "m_Enabled": 1,
  "m_Script": {
    "m_FileID": 0,
    "m_PathID": 9016219054654006960
  },
  "m_Name": "",
  "body": {
    "m_FileID": 0,
    "m_PathID": 3147532420920557983
  },
  "fillImage": {
    "m_FileID": 0,
    "m_PathID": 1355901922464814396
  },
  "middleAmount": 0.496,
  "fullAmount": 0.624,
  "floorText": {
    "m_FileID": 0,
    "m_PathID": 8786813491534543038
  },
  "currentObject": {
    "m_FileID": 0,
    "m_PathID": -4706227436989098299
  }
}