{
  "m_GameObject": {
    "m_FileID": 0,
    "m_PathID": -1848967151897974947
  },
  "m_Enabled": 1,
  "m_Script": {
    "m_FileID": 3,
    "m_PathID": -3163900533542072449
  },
  "m_Name": "",
  "spriteRenderer": {
    "m_FileID": 0,
    "m_PathID": 0
  },
  "image": {
    "m_FileID": 0,
    "m_PathID": -3784877502693651492
  }
}