{
  "m_GameObject": {
    "m_FileID": 0,
    "m_PathID": 6631078400907368429
  },
  "m_Enabled": 1,
  "m_Script": {
    "m_FileID": 0,
    "m_PathID": 2366043669590847779
  },
  "m_Name": "",
  "m_Navigation": {
    "m_Mode": 0,
    "m_WrapAround": 0,
    "m_SelectOnUp": {
      "m_FileID": 0,
      "m_PathID": 0
    },
    "m_SelectOnDown": {
      "m_FileID": 0,
      "m_PathID": 0
    },
    "m_SelectOnLeft": {
      "m_FileID": 0,
      "m_PathID": 0
    },
    "m_SelectOnRight": {
      "m_FileID": 0,
      "m_PathID": 0
    }
  },
  "m_Transition": 0,
  "m_Colors": {
    "m_NormalColor": {
      "r": 1.0,
      "g": 1.0,
      "b": 1.0,
      "a": 1.0
    },
    "m_HighlightedColor": {
      "r": 0.9607843,
      "g": 0.9607843,
      "b": 0.9607843,
      "a": 1.0
    },
    "m_PressedColor": {
      "r": 0.784313738,
      "g": 0.784313738,
      "b": 0.784313738,
      "a": 1.0
    },
    "m_SelectedColor": {
      "r": 0.9607843,
      "g": 0.9607843,
      "b": 0.9607843,
      "a": 1.0
    },
    "m_DisabledColor": {
      "r": 0.784313738,
      "g": 0.784313738,
      "b": 0.784313738,
      "a": 0.5019608
    },
    "m_ColorMultiplier": 1.0,
    "m_FadeDuration": 0.1
  },
  "m_SpriteState": {
    "m_HighlightedSprite": {
      "m_FileID": 0,
      "m_PathID": 0
    },
    "m_PressedSprite": {
      "m_FileID": 0,
      "m_PathID": 0
    },
    "m_SelectedSprite": {
      "m_FileID": 0,
      "m_PathID": 0
    },
    "m_DisabledSprite": {
      "m_FileID": 0,
      "m_PathID": 0
    }
  },
  "m_AnimationTriggers": {
    "m_NormalTrigger": "Normal",
    "m_HighlightedTrigger": "Highlighted",
    "m_PressedTrigger": "Pressed",
    "m_SelectedTrigger": "Selected",
    "m_DisabledTrigger": "Disabled"
  },
  "m_Interactable": 1,
  "m_TargetGraphic": {
    "m_FileID": 0,
    "m_PathID": 0
  },
  "m_FillRect": {
    "m_FileID": 0,
    "m_PathID": -8087375630823075192
  },
  "m_HandleRect": {
    "m_FileID": 0,
    "m_PathID": 0
  },
  "m_Direction": 0,
  "m_MinValue": 0.0,
  "m_MaxValue": 1.0,
  "m_WholeNumbers": 0,
  "m_Value": 0.146,
  "m_OnValueChanged": {
    "m_PersistentCalls": {
      "m_Calls": []
    }
  }
}