{
  "m_GameObject": {
    "m_FileID": 0,
    "m_PathID": -2828530965620448476
  },
  "m_Enabled": 1,
  "m_Script": {
    "m_FileID": 0,
    "m_PathID": 8962903080549542158
  },
  "m_Name": "",
  "localizeKey": "BATTLEPASS_PASS_PREMIUM",
  "fontMaterial": {
    "m_FileID": 0,
    "m_PathID": 5553381187085637640
  },
  "overrideFonts": []
}