{
  "m_GameObject": {
    "m_FileID": 0,
    "m_PathID": -4162700698368327346
  },
  "m_Enabled": 1,
  "m_Script": {
    "m_FileID": 0,
    "m_PathID": 6582133500887627985
  },
  "m_Name": "",
  "animator": {
    "m_FileID": 0,
    "m_PathID": 2201282042373364328
  },
  "goEquipLight": {
    "m_FileID": 0,
    "m_PathID": -3695189196864693101
  },
  "goEmptyIcon": {
    "m_FileID": 0,
    "m_PathID": 0
  },
  "goTreasureIcon": {
    "m_FileID": 0,
    "m_PathID": 4256656263944067528
  },
  "goRedDot": {
    "m_FileID": 0,
    "m_PathID": 0
  },
  "imgTreasureIcon": {
    "m_FileID": 0,
    "m_PathID": 5052702036381170401
  }
}