{
  "m_GameObject": {
    "m_FileID": 0,
    "m_PathID": -3566222154975018045
  },
  "m_Enabled": 1,
  "m_Script": {
    "m_FileID": 0,
    "m_PathID": 8962903080549542158
  },
  "m_Name": "",
  "localizeKey": "FREE",
  "fontMaterial": {
    "m_FileID": 1,
    "m_PathID": 379438189239238212
  },
  "overrideFonts": []
}