{
  "m_GameObject": {
    "m_FileID": 0,
    "m_PathID": 4618660904474430112
  },
  "m_Enabled": 1,
  "m_Script": {
    "m_FileID": 0,
    "m_PathID": 8962903080549542158
  },
  "m_Name": "",
  "localizeKey": "",
  "fontMaterial": {
    "m_FileID": 43,
    "m_PathID": -3908306431980676367
  },
  "overrideFonts": []
}