{
  "m_GameObject": {
    "m_FileID": 0,
    "m_PathID": 0
  },
  "m_Enabled": 1,
  "m_Script": {
    "m_FileID": 0,
    "m_PathID": 1008803689438726606
  },
  "m_Name": "20404_lycan_Atlas",
  "atlasFile": {
    "m_FileID": 0,
    "m_PathID": 5187633088145644545
  },
  "materials": [
    {
      "m_FileID": 0,
      "m_PathID": -3385908674814337577
    }
  ]
}