{
  "m_GameObject": {
    "m_FileID": 0,
    "m_PathID": 2625473530847804653
  },
  "m_Enabled": 1,
  "m_Script": {
    "m_FileID": 0,
    "m_PathID": -7030229213176759517
  },
  "m_Name": "",
  "m_Material": {
    "m_FileID": 0,
    "m_PathID": 0
  },
  "m_Color": {
    "r": 0.8396226,
    "g": 0.217826635,
    "b": 0.217826635,
    "a": 1.0
  },
  "m_RaycastTarget": 1,
  "m_RaycastPadding": {
    "x": 0.0,
    "y": 0.0,
    "z": 0.0,
    "w": 0.0
  },
  "m_Maskable": 1,
  "m_OnCullStateChanged": {
    "m_PersistentCalls": {
      "m_Calls": []
    }
  },
  "m_Sprite": {
    "m_FileID": 4,
    "m_PathID": -7550066331588343371
  },
  "m_Type": 3,
  "m_PreserveAspect": 0,
  "m_FillCenter": 1,
  "m_FillMethod": 0,
  "m_FillAmount": 0.891,
  "m_FillClockwise": 1,
  "m_FillOrigin": 0,
  "m_UseSpriteMesh": 0,
  "m_PixelsPerUnitMultiplier": 1.0
}