{
  "m_GameObject": {
    "m_FileID": 0,
    "m_PathID": -752300024070166318
  },
  "m_Enabled": 1,
  "m_Script": {
    "m_FileID": 0,
    "m_PathID": -3050400728906160703
  },
  "m_Name": "",
  "rtBody": {
    "m_FileID": 0,
    "m_PathID": 4812975251990050419
  },
  "txtTitle": {
    "m_FileID": 0,
    "m_PathID": -5378148668378489112
  },
  "scrollRect": {
    "m_FileID": 0,
    "m_PathID": 8525171889211516467
  },
  "prefabSlot": {
    "m_FileID": 0,
    "m_PathID": -1554539155429995638
  },
  "rewardSfx": {
    "m_FileID": 0,
    "m_PathID": -5599797519441250985
  }
}