{
  "m_GameObject": {
    "m_FileID": 0,
    "m_PathID": 0
  },
  "m_Enabled": 1,
  "m_Script": {
    "m_FileID": 0,
    "m_PathID": 1008803689438726606
  },
  "m_Name": "10100_pet_Atlas",
  "atlasFile": {
    "m_FileID": 0,
    "m_PathID": -1579810465702186794
  },
  "materials": [
    {
      "m_FileID": 0,
      "m_PathID": -6321427634514095834
    }
  ]
}