{
  "m_GameObject": {
    "m_FileID": 0,
    "m_PathID": 8073260482366316990
  },
  "m_Enabled": 1,
  "m_Script": {
    "m_FileID": 0,
    "m_PathID": 1117752915966211304
  },
  "m_Name": "",
  "width": 1.27,
  "scaleSyncTarget": {
    "m_FileID": 0,
    "m_PathID": -5445146273391869784
  }
}