{
  "m_GameObject": {
    "m_FileID": 0,
    "m_PathID": 6933833591802964752
  },
  "m_Enabled": 1,
  "m_Script": {
    "m_FileID": 0,
    "m_PathID": 2394203861304995953
  },
  "m_Name": "",
  "scaler": {
    "m_FileID": 0,
    "m_PathID": 6922276854174929188
  },
  "rigidbody": {
    "m_FileID": 0,
    "m_PathID": 1671713957500627240
  },
  "modelDefaultDirection": 0,
  "modelType": 0,
  "skeletonAnimation": {
    "m_FileID": 0,
    "m_PathID": 1901165620590644047
  },
  "animator": {
    "m_FileID": 0,
    "m_PathID": 0
  },
  "height": 1.89,
  "width": 1.53,
  "idleAnim": "idle",
  "moveAnim": "walk",
  "deathAnim": "",
  "idleUnityAnim": "",
  "moveUnityAnim": "",
  "deathUnityAnim": "",
  "btOwner": {
    "m_FileID": 0,
    "m_PathID": -1725796605492424639
  },
  "bodyCollider": {
    "m_FileID": 0,
    "m_PathID": -2620951582450230724
  },
  "deathSfx": {
    "clip": {
      "m_FileID": 0,
      "m_PathID": -6723630911111122065
    },
    "volume": 0.4
  },
  "deathVfxPrefabList": [
    {
      "m_FileID": 0,
      "m_PathID": -976922403434648071
    },
    {
      "m_FileID": 0,
      "m_PathID": -7033381468259161423
    },
    {
      "m_FileID": 0,
      "m_PathID": 4355621886683685810
    }
  ],
  "spawnAnim": "",
  "hitAnim": "hit",
  "hitUnityAnim": "hit",
  "attackAnim": "attack",
  "attackAnimEventName": "KeyEventAttack",
  "panicAnim": "scare_panic",
  "attackBT": {
    "m_FileID": 0,
    "m_PathID": -6279218368843479495
  },
  "projectilePrefab": {
    "m_FileID": 0,
    "m_PathID": 0
  },
  "projectileSpeed": 0.0,
  "projectileType": 0,
  "projectileSpawnPivotType": 0,
  "projectileSpawnOffset": {
    "x": 0.0,
    "y": 0.0
  }
}