{
  "m_GameObject": {
    "m_FileID": 0,
    "m_PathID": 0
  },
  "m_Enabled": 1,
  "m_Script": {
    "m_FileID": 0,
    "m_PathID": 8302033850027404168
  },
  "m_Name": "20104_human_SkeletonData",
  "atlasAssets": [
    {
      "m_FileID": 0,
      "m_PathID": 7863175395715458951
    }
  ],
  "scale": 0.01,
  "skeletonJSON": {
    "m_FileID": 0,
    "m_PathID": -5444175876807113046
  },
  "isUpgradingBlendModeMaterials": 0,
  "blendModeMaterials": {
    "requiresBlendModeMaterials": 0,
    "applyAdditiveMaterial": 0,
    "additiveMaterials": [],
    "multiplyMaterials": [],
    "screenMaterials": []
  },
  "skeletonDataModifiers": [],
  "fromAnimation": [],
  "toAnimation": [],
  "duration": [],
  "defaultMix": 0.0,
  "controller": {
    "m_FileID": 0,
    "m_PathID": 0
  }
}