{
  "m_GameObject": {
    "m_FileID": 0,
    "m_PathID": -1779774716785721034
  },
  "m_Enabled": 1,
  "m_Script": {
    "m_FileID": 0,
    "m_PathID": 8962903080549542158
  },
  "m_Name": "",
  "localizeKey": "",
  "fontMaterial": {
    "m_FileID": 4,
    "m_PathID": 1373387614849308315
  },
  "overrideFonts": []
}