{
  "m_GameObject": {
    "m_FileID": 0,
    "m_PathID": -2520420461405515911
  },
  "m_Enabled": 1,
  "m_Script": {
    "m_FileID": 0,
    "m_PathID": 348253180598357110
  },
  "m_Name": "",
  "m_Padding": {
    "m_Left": 0,
    "m_Right": 0,
    "m_Top": 44,
    "m_Bottom": 76
  },
  "m_ChildAlignment": 1,
  "m_Spacing": 23.0,
  "m_ChildForceExpandWidth": 1,
  "m_ChildForceExpandHeight": 0,
  "m_ChildControlWidth": 1,
  "m_ChildControlHeight": 1,
  "m_ChildScaleWidth": 0,
  "m_ChildScaleHeight": 0,
  "m_ReverseArrangement": 0
}