{
  "m_GameObject": {
    "m_FileID": 0,
    "m_PathID": -5606100160769161683
  },
  "m_Enabled": 1,
  "m_Script": {
    "m_FileID": 0,
    "m_PathID": -8940529911906571770
  },
  "m_Name": "",
  "ignoreList": [],
  "bindables": [
    {
      "m_FileID": 0,
      "m_PathID": -5091639496771964793
    },
    {
      "m_FileID": 0,
      "m_PathID": -7538192298379194063
    },
    {
      "m_FileID": 0,
      "m_PathID": -9040330837972843794
    }
  ]
}