{
  "m_GameObject": {
    "m_FileID": 0,
    "m_PathID": -9029492276020376985
  },
  "m_Enabled": 1,
  "m_Script": {
    "m_FileID": 0,
    "m_PathID": -1913430421618162827
  },
  "m_Name": "",
  "rtBody": {
    "m_FileID": 0,
    "m_PathID": 7252553427895179964
  },
  "txtTitle": {
    "m_FileID": 0,
    "m_PathID": 9172799807718744269
  },
  "txtContent": {
    "m_FileID": 0,
    "m_PathID": 5358440777373471466
  },
  "remainTimeView": {
    "m_FileID": 0,
    "m_PathID": 4118647914669838318
  },
  "layerReward": {
    "m_FileID": 0,
    "m_PathID": -5003436207101613046
  },
  "bgReward": {
    "m_FileID": 0,
    "m_PathID": -7171871689417197078
  },
  "iconReward": {
    "m_FileID": 0,
    "m_PathID": 6569125070884841891
  },
  "txtRewardAmount": {
    "m_FileID": 0,
    "m_PathID": -384858633006095667
  },
  "goReceived": {
    "m_FileID": 0,
    "m_PathID": 74494111098243025
  },
  "btnClaim": {
    "m_FileID": 0,
    "m_PathID": -172970772772035536
  }
}