{
  "m_GameObject": {
    "m_FileID": 0,
    "m_PathID": 0
  },
  "m_Enabled": 1,
  "m_Script": {
    "m_FileID": 0,
    "m_PathID": 1008803689438726606
  },
  "m_Name": "10006_slime_Atlas",
  "atlasFile": {
    "m_FileID": 0,
    "m_PathID": 1132369818184578087
  },
  "materials": [
    {
      "m_FileID": 0,
      "m_PathID": -6627636358069739854
    }
  ]
}