{
  "m_GameObject": {
    "m_FileID": 0,
    "m_PathID": -7611832720977457849
  },
  "m_Enabled": 1,
  "m_Script": {
    "m_FileID": 4,
    "m_PathID": 2252140159486941644
  },
  "m_Name": "",
  "model": {
    "id": "Attack Speed Button",
    "textID": "",
    "transform": {
      "m_FileID": 0,
      "m_PathID": -6232186470115260526
    },
    "worldPosition": {
      "x": 228.605576,
      "y": -3.162201,
      "z": 0.0
    },
    "rectSize": {
      "x": 215.5279,
      "y": 88.6374
    },
    "offset": {
      "x": 0.0,
      "y": 0.0
    },
    "cursorAdditionalOffset": {
      "x": 0.0,
      "y": -25.0
    },
    "alignment": 4
  }
}