{
  "m_GameObject": {
    "m_FileID": 0,
    "m_PathID": -6250713754603767211
  },
  "m_Enabled": 1,
  "m_Script": {
    "m_FileID": 0,
    "m_PathID": -3718410699689806017
  },
  "m_Name": "",
  "rtBody": {
    "m_FileID": 0,
    "m_PathID": -2777736711375709299
  },
  "purchaseButtonObj": {
    "m_FileID": 0,
    "m_PathID": -6781101692861258541
  },
  "disableButtonObj": {
    "m_FileID": 0,
    "m_PathID": -7418204174012475441
  }
}