{
  "m_GameObject": {
    "m_FileID": 0,
    "m_PathID": 0
  },
  "m_Enabled": 1,
  "m_Script": {
    "m_FileID": 0,
    "m_PathID": 1008803689438726606
  },
  "m_Name": "30001_cat_Atlas",
  "atlasFile": {
    "m_FileID": 0,
    "m_PathID": -8792304260362534936
  },
  "materials": [
    {
      "m_FileID": 0,
      "m_PathID": -8800108253841786397
    }
  ]
}