{
  "m_GameObject": {
    "m_FileID": 0,
    "m_PathID": 4712588141377457278
  },
  "m_Enabled": 1,
  "m_Script": {
    "m_FileID": 1,
    "m_PathID": 8962903080549542158
  },
  "m_Name": "",
  "localizeKey": "STATIC_BONUS",
  "fontMaterial": {
    "m_FileID": 5,
    "m_PathID": 379438189239238212
  },
  "overrideFonts": []
}