{
  "m_GameObject": {
    "m_FileID": 0,
    "m_PathID": 4331066762778978962
  },
  "m_Enabled": 1,
  "m_Script": {
    "m_FileID": 0,
    "m_PathID": -2343602589678853284
  },
  "m_Name": "",
  "m_Material": {
    "m_FileID": 0,
    "m_PathID": 1911646924754736185
  },
  "m_Color": {
    "r": 1.0,
    "g": 1.0,
    "b": 1.0,
    "a": 1.0
  },
  "m_RaycastTarget": 0,
  "m_RaycastPadding": {
    "x": 0.0,
    "y": 0.0,
    "z": 0.0,
    "w": 0.0
  },
  "m_Maskable": 1,
  "m_OnCullStateChanged": {
    "m_PersistentCalls": {
      "m_Calls": []
    }
  },
  "fixedTime": 1,
  "use3dRotation": 1
}