{
  "m_GameObject": {
    "m_FileID": 0,
    "m_PathID": -6494714600316987401
  },
  "m_Enabled": 1,
  "m_Script": {
    "m_FileID": 0,
    "m_PathID": -5139525741745400634
  },
  "m_Name": "",
  "onClick": {
    "m_PersistentCalls": {
      "m_Calls": [
        {
          "m_Target": {
            "m_FileID": 0,
            "m_PathID": -1609512125424620311
          },
          "m_TargetAssemblyTypeName": "LoadComplete.UI.Shop.UIShopProductRewardSlot, Assembly-CSharp",
          "m_MethodName": "OnClickSlot",
          "m_Mode": 1,
          "m_Arguments": {
            "m_ObjectArgument": {
              "m_FileID": 0,
              "m_PathID": 0
            },
            "m_ObjectArgumentAssemblyTypeName": "UnityEngine.Object, UnityEngine",
            "m_IntArgument": 0,
            "m_FloatArgument": 0.0,
            "m_StringArgument": "",
            "m_BoolArgument": 0
          },
          "m_CallState": 2
        }
      ]
    }
  }
}