{
  "m_GameObject": {
    "m_FileID": 0,
    "m_PathID": 3932233788888535298
  },
  "m_Enabled": 1,
  "m_Script": {
    "m_FileID": 0,
    "m_PathID": -1855994157963538313
  },
  "m_Name": "",
  "synergyId": "ghost",
  "enableBgObject": {
    "m_FileID": 0,
    "m_PathID": -4222561960290667464
  },
  "synergyCountText": {
    "m_FileID": 0,
    "m_PathID": -9183346952284027571
  },
  "synergyDescArray": [
    {
      "m_FileID": 0,
      "m_PathID": -5828344377709991343
    },
    {
      "m_FileID": 0,
      "m_PathID": 4012731212212167683
    },
    {
      "m_FileID": 0,
      "m_PathID": 7100943792701054426
    }
  ],
  "enableOutline": {
    "m_FileID": 0,
    "m_PathID": -245594474216519019
  },
  "disableOutline": {
    "m_FileID": 0,
    "m_PathID": -1275919911617737738
  }
}