{
  "m_GameObject": {
    "m_FileID": 0,
    "m_PathID": -8834875838950596558
  },
  "m_Enabled": 1,
  "m_Script": {
    "m_FileID": 0,
    "m_PathID": -8287268331135866272
  },
  "m_Name": "",
  "saleRibbonObj": {
    "m_FileID": 0,
    "m_PathID": 1792085058373919085
  },
  "saleRibbonText": {
    "m_FileID": 0,
    "m_PathID": -687942855865973395
  },
  "purchaseButton": {
    "m_FileID": 0,
    "m_PathID": -2948934683529531933
  },
  "priceText": {
    "m_FileID": 0,
    "m_PathID": 8057981856661251212
  },
  "autoSetTitle": 1,
  "titleText": {
    "m_FileID": 0,
    "m_PathID": 2421329307851854859
  },
  "purchaseCountText": {
    "m_FileID": 0,
    "m_PathID": 0
  },
  "remainTimeObj": {
    "m_FileID": 0,
    "m_PathID": -3822358290680100304
  },
  "remainTimeText": {
    "m_FileID": 0,
    "m_PathID": 2201991797620652634
  },
  "rewardSlotArray": [
    {
      "m_FileID": 0,
      "m_PathID": 7676174425786134208
    }
  ],
  "rewardValueTextArray": [
    {
      "m_FileID": 0,
      "m_PathID": -1969301483245110286
    }
  ]
}