{
  "m_GameObject": {
    "m_FileID": 0,
    "m_PathID": -4563200508951286505
  },
  "m_Enabled": 1,
  "m_Script": {
    "m_FileID": 0,
    "m_PathID": 8806312759750168707
  },
  "m_Name": "",
  "bindKey": "item.OnClick"
}