<?xml version="1.0" encoding="ASCII"?>
<hwkernel:HwKernelProject xmi:version="2.0" xmlns:xmi="http://www.omg.org/XMI" xmlns:xsi="http://www.w3.org/2001/XMLSchema-instance" xmlns:hwkernel="http://www.xilinx.com/acceleration/hwkernel" name="dilithium2_mm_kernels" platform="/home/barracuda/research/Vitis_prj_2021_2/platforms/xilinx_zcu104_base_202120_1/xilinx_zcu104_base_202120_1.xpfm" platformUID="xilinx.com:xd:xilinx_zcu104_base_202120_1:202120.1(custom)" systemProject="dilithium2_mm_system" cpu="">
  <configuration name="Emulation-SW" id="com.xilinx.ide.accel.config.hwkernel.sw_emu.853402987" dirty="true">
    <configBuildOptions xsi:type="hwkernel:KernelOptions" kernelDebug="true">
      <kernels name="NTT_multiplyer" sourceFile="src/kernels/myNTT_multiplyer.cpp">
        <args name="a" master="true"/>
      </kernels>
    </configBuildOptions>
  </configuration>
  <configuration name="Emulation-HW" id="com.xilinx.ide.accel.config.hwkernel.hw_emu.1545447156" dirty="true">
    <configBuildOptions xsi:type="hwkernel:KernelOptions" kernelDebug="true" target="hw_emu">
      <kernels name="NTT_multiplyer" sourceFile="src/kernels/myNTT_multiplyer.cpp">
        <args name="a" master="true"/>
      </kernels>
    </configBuildOptions>
  </configuration>
  <configuration name="Hardware" id="com.xilinx.ide.accel.config.hwkernel.hw.1241806065">
    <configBuildOptions xsi:type="hwkernel:KernelOptions" target="hw">
      <kernels name="NTT_multiplyer" sourceFile="src/kernels/myNTT_multiplyer.cpp">
        <args name="a" master="true"/>
      </kernels>
    </configBuildOptions>
    <lastBuildOptions xsi:type="hwkernel:KernelOptions" target="hw">
      <kernels name="NTT_multiplyer" sourceFile="src/kernels/myNTT_multiplyer.cpp">
        <args name="a" master="true"/>
      </kernels>
    </lastBuildOptions>
  </configuration>
</hwkernel:HwKernelProject>
