<?xml version="1.0" encoding="ASCII"?>
<hwkernel:HwKernelProject xmi:version="2.0" xmlns:xmi="http://www.omg.org/XMI" xmlns:xsi="http://www.w3.org/2001/XMLSchema-instance" xmlns:hwkernel="http://www.xilinx.com/acceleration/hwkernel" name="multiplier_mode2_kernels" platform="/home/barracuda/research/Vitis_prj_2021_2/platforms/xilinx_zcu104_base_202120_1/xilinx_zcu104_base_202120_1.xpfm" platformUID="xilinx.com:xd:xilinx_zcu104_base_202120_1:202120.1(custom)" systemProject="multiplier_mode2_system" cpu="">
  <configuration name="Emulation-SW" id="com.xilinx.ide.accel.config.hwkernel.sw_emu.1055665237" dirty="true">
    <configBuildOptions xsi:type="hwkernel:KernelOptions" kernelDebug="true">
      <kernels name="dilithium2_mm" sourceFile="src/myNTT_multiplyer.cpp">
        <args name="in" master="true"/>
        <args name="mat" master="true"/>
        <args name="out" master="true"/>
      </kernels>
    </configBuildOptions>
    <lastBuildOptions xsi:type="hwkernel:KernelOptions" kernelDebug="true">
      <kernels name="dilithium2_mm" sourceFile="src/myNTT_multiplyer.cpp">
        <args name="in" master="true"/>
        <args name="mat" master="true"/>
        <args name="out" master="true"/>
      </kernels>
    </lastBuildOptions>
  </configuration>
  <configuration name="Emulation-HW" id="com.xilinx.ide.accel.config.hwkernel.hw_emu.340743451" dirty="true">
    <configBuildOptions xsi:type="hwkernel:KernelOptions" kernelDebug="true" target="hw_emu">
      <kernels name="dilithium2_mm" sourceFile="src/myNTT_multiplyer.cpp">
        <args name="in" master="true"/>
        <args name="mat" master="true"/>
        <args name="out" master="true"/>
      </kernels>
    </configBuildOptions>
  </configuration>
  <configuration name="Hardware" id="com.xilinx.ide.accel.config.hwkernel.hw.1463404625">
    <configBuildOptions xsi:type="hwkernel:KernelOptions" target="hw">
      <kernels name="dilithium2_mm" sourceFile="src/myNTT_multiplyer.cpp">
        <args name="in" master="true"/>
        <args name="mat" master="true"/>
        <args name="out" master="true"/>
      </kernels>
    </configBuildOptions>
    <lastBuildOptions xsi:type="hwkernel:KernelOptions" target="hw">
      <kernels name="dilithium2_mm" sourceFile="src/myNTT_multiplyer.cpp">
        <args name="in" master="true"/>
        <args name="mat" master="true"/>
        <args name="out" master="true"/>
      </kernels>
    </lastBuildOptions>
  </configuration>
</hwkernel:HwKernelProject>
