<?xml version="1.0" encoding="ASCII"?>
<hostApp:AcceleratedHostProject xmi:version="2.0" xmlns:xmi="http://www.omg.org/XMI" xmlns:xsi="http://www.w3.org/2001/XMLSchema-instance" xmlns:hostApp="http://www.xilinx.com/acceleration/hostApplication" name="multiplier_mode2" location="/home/barracuda/research/Vitis_prj_2021_2_2/multiplier_mode2" platform="/home/barracuda/research/Vitis_prj_2021_2/platforms/xilinx_zcu104_base_202120_1/xilinx_zcu104_base_202120_1.xpfm" platformUID="xilinx.com:xd:xilinx_zcu104_base_202120_1:202120.1(custom)" systemProject="multiplier_mode2_system" sysConfig="xilinx_zcu104_base_202120_1" cpu="xrt" cpuInstance="cortex-a53" os="linux" flow="EMBEDDED_ACCELERATION">
  <configuration name="Emulation-SW" id="com.xilinx.ide.accel.config.sw_emu.aarch64.754760489" dirty="true">
    <configBuildOptions xsi:type="hostApp:HostApplicationOptions"/>
    <lastBuildOptions xsi:type="hostApp:HostApplicationOptions"/>
  </configuration>
  <configuration name="Emulation-HW" id="com.xilinx.ide.accel.config.hw_emu.aarch64.1743522814" dirty="true">
    <configBuildOptions xsi:type="hostApp:HostApplicationOptions" target="hw_emu"/>
  </configuration>
  <configuration name="Hardware" id="com.xilinx.ide.accel.config.hw.aarch64.2134251912">
    <configBuildOptions xsi:type="hostApp:HostApplicationOptions" target="hw"/>
    <lastBuildOptions xsi:type="hostApp:HostApplicationOptions" target="hw"/>
  </configuration>
</hostApp:AcceleratedHostProject>
