1 10 20
100 200 125
201 210 89
900 1000 174
605293 606510 341
956739 956006 352
826611 825983 313
756134 756776 362
478642 479101 338
815892 815933 269
719220 719135 274
929349 929040 339
948351 948681 326
491808 491202 320
504516 507852 382
604712 604712 67
436809 436182 325
630804 630542 310
975948 975688 334
945718 945752 202
747700 747747 243
652581 653137 336
824003 823974 238
655077 655161 186
567537 567893 346
851101 851038 238
524621 524569 302
549210 549073 240
782205 782263 287
422252 422691 325
285142 285524 376
478472 479285 338
485461 484957 320
748121 748121 256
823874 824088 238
359661 358904 317
388654 388444 299
981428 981459 184
830977 832487 419
654572 654612 248
240125 241624 368
532347 536933 377
545105 545167 209
850670 851113 357
978562 976960 383
319662 322868 371
560495 559981 359
831101 831011 251
784445 782843 331
859271 859331 295
998394 998498 277
975465 975228 228
687538 680880 398
786313 786051 269
780568 780732 300
363174 361163 361
261481 261858 288
908012 909802 370
984442 984350 246
931890 931544 277
788836 791387 406
919454 919499 202
575642 575716 297
915504 916839 339
285788 285880 252
919365 918704 339
827554 827930 313
850429 850334 313
737959 737960 150
809210 810518 406
974713 974143 321
456486 455019 338
727712 727631 287
743706 745566 318
465147 463724 338
945152 944673 352
776248 775948 331
541191 542743 364
256518 255672 332
947523 950576 383
423648 421688 356
574485 575669 328
588113 587943 266
748123 748033 318
930036 929896 264
982165 982843 383
806280 806281 70
379341 379868 361
155281 158691 383
854261 855194 357
827665 827456 419
806029 805322 375
276791 280194 389
655238 655329 292
358577 358839 348
842747 844169 388
612687 612358 297
810273 809602 344
431700 431055 312
281758 283365 358
984263 984008 352
884741 885879 370
724852 724070 362
869222 869573 388
17 911 179
547 7349 262
2885 8208 262
9331 2464 262
6121 2010 238
1851 13 182
9948 2961 262
8260 7176 252
7894 6164 262
6445 4216 262
7380 6287 257
4165 4118 189
4856 2883 238
8353 103 262
3475 3310 181
2456 268 183
9704 9158 260
2373 7372 262
5040 7693 262
2826 2142 209
8158 1176 262
1529 9686 262
993 8374 262
808 7710 262
5431 874 238
1922 9275 262
2215 8081 262
5099 8387 262
3183 5344 238
2688 1401 209
1577 371 182
196 4061 238
2366 7168 262
2463 742 209
7092 6957 195
6263 5874 262
6641 2658 262
3997 9223 262
2171 7214 262
9342 6646 260
5382 3200 238
449 5366 238
1398 808 182
7626 9457 260
4928 4176 215
3368 779 217
4409 9751 262
1421 97 182
3159 5720 238
924 8852 262
6761 6323 244
5330 6193 262
2588 1143 209
3248 3034 199
8069 8091 190
8420 4103 262
7426 8992 252
8374 1038 262
2650 3218 217
1472 6677 262
5518 6182 262
2876 3724 238
625 9258 262
6002 4754 236
4323 4076 202
9706 2909 262
9365 8109 260
7374 5757 262
8908 9918 260
2016 1836 175
6964 3760 262
1070 9566 262
801 3760 238
7920 4476 262
8151 2144 262
7169 389 262
979 1952 182
7270 974 262
3143 2342 217
1104 350 179
7919 2221 262
7797 1068 262
5989 1161 238
1995 5466 238
6150 1273 238
1886 1543 180
212 8597 262
979 4314 238
6398 5483 262
4220 4145 171
9876 5888 262
7641 8279 252
2589 8373 262
5129 8103 262
180 9791 262
6840 2036 262
