1 10 20
100 200 125
201 210 89
900 1000 174
5000 10000 262
1 10000 262
250 251 110
100 1000 179
1000 999999 525
1 999999 525
5 99999 351
5 10 20
8000 9000 247
20000 30000 308
100000 200000 383
30 40 107
50 60 113
70 80 116
100 110 114
900 1100 174
5000 102942 351
12512 12513 126
123512 124125 318
55125 135315 354
89789 879875 525
12509 123566 354
65753 536532 470
12512 456357 449
687878 812515 504
900000 999999 507
1253 125125 354
125125 135135 344
64646 135636 354
1235 3515 217
4654 54656 340
5657 59756 340
1584 4589 238
54635 536333 470
111 1111 179
12512 125126 354
56426 345656 443
53265 235135 443
1500 3000 217
1600 3100 217
1700 3000 217
1800 20000 279
1800 2000 175
50 51 25
52 500 144
567 1255 182
1245 35135 311
125 135 122
145 155 117
15653 135135 354
13531 1351399 528
990 9900 262
9901 99001 351
315 135 131
5315 135135 354
31513 135135 354
12323 135135 354
13531 121111 354
1111 11111 268
2222 22222 279
3333 33333 308
4444 44444 324
5555 55555 340
6666 66666 340
7777 77777 351
8888 88888 351
9999 99999 351
100 1000 179
519 5199 238
5199 51999 324
50000 50002 128
50006 50009 115
500020 500050 258
500021 500052 258
500022 500052 258
888 88888 351
8 88 116
88 888 179
1234 56789 340
100 500 144
200 100000 351
5125 125125 354
618904 835094 509
1234 4321 238
1256 6521 262
1278 8721 262
1298 9821 262
1299 9921 262
1399 9931 262
1499 9941 262
5125 12522 268
9990 9998 180
9995 9997 180
9993 9994 180
1 3 8
4 8 17
125 125125 354
