1 10 20
100 200 125
300 400 144
500 600 137
800 900 179
1000 1200 182
969863 458006 525
720437 990954 525
556165 23459 470
861050 647613 525
109045 824386 509
482691 501235 426
664951 686203 442
934943 743459 525
246008 517816 470
495493 727944 509
14387 341718 443
588326 955771 525
983534 625382 525
895845 654379 525
260551 853938 525
481877 388680 449
124107 690685 509
463267 802731 509
816619 47004 509
85919 312363 443
419695 319637 449
731464 559732 509
127456 142422 344
355090 135922 443
949743 935512 507
237113 237113 169
472859 867341 525
291452 65666 443
610930 63143 470
858886 871465 388
903363 907707 445
9168 634464 509
662054 447070 509
378899 799094 509
782619 506256 509
568043 562413 421
671876 927561 525
266032 936982 525
286120 57636 443
517012 444951 470
612404 618297 447
155745 155745 109
187798 187798 86
909741 997650 507
571963 522468 452
327296 136354 443
375548 71466 443
985205 575527 525
638488 48657 509
55604 24405 340
720829 145307 509
128878 44213 354
883429 272351 525
277207 124141 443
992698 535387 525
599004 599004 90
303912 221329 443
635168 296993 509
425293 246653 449
545590 895457 525
513491 772024 509
903041 344561 525
568201 528243 452
476824 39062 449
933634 308453 525
795011 795011 101
291329 291329 190
774325 906258 525
317938 816226 509
391759 500816 449
557676 807552 509
670582 670582 93
896753 228998 525
591054 5492 470
263591 981104 525
27978 637293 509
165256 616710 470
305311 541939 470
624796 744930 509
20650 330155 443
810533 577033 509
451331 936413 525
230564 430089 449
141478 939822 525
704601 718774 504
953455 537451 525
936473 865338 476
658956 934382 525
192798 323591 443
831161 278909 509
1291 47597 324
113159 997495 525
462882 82881 449
634507 833655 504
920752 813329 525
965712 633886 525
426501 452 449
375932 861156 525
642819 235401 509
582651 58524 470
420018 31027 449
959972 566084 525
766964 593502 509
522209 845483 525
925089 625193 525
509599 854599 525
50905 507353 449
265626 588661 470
246222 90521 443
756325 19771 509
156158 861732 525
694392 477775 509
584878 972776 525
29501 918071 525
652568 761658 504
650348 915668 525
782111 439226 509
111467 813738 509
796091 578856 509
626177 632789 509
975893 619743 525
601967 728595 509
727954 534714 509
215533 413730 449
503146 691342 509
252891 422070 449
599651 384786 470
618350 62739 470
820841 439117 509
662811 726845 504
783613 783613 194
754412 228423 509
48737 205409 383
914888 310488 525
519486 791326 509
296689 430681 449
849917 406489 525
937326 478652 525
152612 933937 525
923709 333547 525
78963 889657 525
224804 521873 470
723981 557869 509
904335 821685 525
139496 800834 509
538149 259149 470
736925 159921 509
146182 670424 509
73864 88771 351
64011 996995 525
