.....................
----------------------------------------------------------------------
Ran 21 tests in 0.683s

OK
Name             Stmts   Miss Branch BrPart  Cover   Missing
------------------------------------------------------------
Collatz.py          42      0     16      0   100%
TestCollatz.py      92      0      0      0   100%
------------------------------------------------------------
TOTAL              134      0     16      0   100%
