subject,rvalue,r2,adjusted_r2,rmse,mse,mae
1,0.24267293736580953,0.05889015452975011,-0.2697513788090673,0.23896957538272412,0.05710645795859946,0.19432597771939308
2,0.18569263385467608,0.03448175426788679,-0.31954160250055463,0.24649622469059648,0.06076038878671702,0.18898303154173907
3,0.06411182019734157,0.004110325489016255,-0.34366067195926386,0.1620736483053324,0.02626786747500058,0.12713879177578366
4,0.16481754709072804,0.027164823829004356,-0.3161887677607589,0.16501316143365427,0.027229343446329244,0.13212880443650313
5,0.32651467956716157,0.1066118359728462,-0.20702443437711193,0.1864562290578702,0.03476592535448096,0.1495277223872889
6,0.5272557627541845,0.2779986393574969,0.02453007657874584,0.2567018151725046,0.06589582191285871,0.19234261392752497
7,0.4909224155541107,0.24100481809348295,-0.024041118445300658,0.119874049373797,0.014369787713271522,0.09658819492080187
8,0.1959476498228315,0.038395481471090995,-0.2974029218247185,0.14491134721746204,0.020999298552379846,0.11296095505608097
9,0.3289654830327399,0.1082182890269639,-0.20485401376144252,0.1279016931934356,0.016358843121747735,0.09906588671385028
10,0.42821431859199355,0.18336750264720536,-0.10180575039662765,0.08649615810054263,0.007481585366154068,0.06956089125031495
11,0.1700081468624541,0.028902769999605765,-0.31021054841323026,0.10077738905254624,0.010156082144248266,0.07885037098524167
12,0.40684534196530975,0.16552313227886983,-0.12588148819517575,0.1770368896787805,0.031342060307136696,0.13845637437679706
13,0.3826021329513079,0.1463843921388903,-0.18501931444248165,0.20160824835160188,0.040645885803401186,0.15957940046288008
14,0.14285727439424167,0.02040820084735166,-0.3290677923638634,0.14140457258630032,0.01999525314831428,0.11382215047045643
15,0.4096989002589924,0.16785318887342782,-0.12428345758590065,0.230644147905265,0.05319672296294576,0.18177864833926285
16,0.3298496511592048,0.10880079236984909,-0.21797225042787294,0.18595277266839377,0.03457843366306334,0.15045212026280733
17,0.2754680342934045,0.07588263791747228,-0.24682501233356913,0.15681161828634957,0.024589883629583805,0.12545887992284888
18,0.5161228642113294,0.2663828109617063,0.010199030662619624,0.17428419747234342,0.030374981488578798,0.13682488929045833
19,0.12074635473656599,0.014579682182168633,-0.3332157241064777,0.23716974461400198,0.056249487760270916,0.18896575121276002
20,0.39510985055130143,0.15611179400267175,-0.14014683150702867,0.13042505936792043,0.017010696111125566,0.10353736840855031
21,0.21777399667252384,0.047425513626724425,-0.3223975222593709,0.1372794524337686,0.01884564806051534,0.10680659975401252
22,0.23934989167934656,0.05728837064691493,-0.28837256011588286,0.2609900779606814,0.06811582079392257,0.20966122379450855
23,0.3523105082255089,0.12412269420611638,-0.18501047254466596,0.12247827530141278,0.01500092792080866,0.0951385444857817
24,0.08433343780382406,0.007112128731811461,-0.34145488990489303,0.21531666997198423,0.04636126836782437,0.1694146962215499
25,0.2964636388174645,0.08789068914089206,-0.23231789871390118,0.19503920875981004,0.03804029295365276,0.14765831792301748
26,0.07872950118165908,0.006198334356312859,-0.34834712473819174,0.08870882223921088,0.007869255143067916,0.06695577405512175
27,0.06905989010826336,0.004769268421765411,-0.34277162197063404,0.31170368594052283,0.0971591878289081,0.24929616728869725
28,0.16218654675842917,0.02630447594942413,-0.31371618324284056,0.07781838847340095,0.006055701584597142,0.06137067562712152
29,0.4482890865244112,0.20096310509689103,-0.0795498473690941,0.17431757824841343,0.030386618086391738,0.1407252545778387
30,0.14653084905984093,0.021471289726197884,-0.32023714878211385,0.2666520463054334,0.071103313798875,0.21487506628928257
31,0.40005846802192424,0.16004677783604898,-0.13327022037993386,0.22312507326233455,0.049784798318322165,0.17712852342843965
32,0.40494221561645183,0.16397819798836097,-0.13267469949963995,0.1572929486998589,0.024741071710696446,0.12546926127945146
33,0.10513408530641122,0.011053175893215752,-0.33986343911241734,0.29840803628792917,0.08904735612121806,0.2324400492083647
34,0.33982679729712334,0.11548225216122016,-0.19670048237011373,0.11128476590308686,0.012384299122104843,0.08909185008401209
35,-0.06387289191024542,0.004079746320977895,-0.34555183209825335,0.13649481851391257,0.018630835481145927,0.10702126558377263
36,0.3726014291283152,0.1388318249884629,-0.1651098838391385,0.14608690285270717,0.021341383185096305,0.11191851450757609
37,0.13166880590739438,0.017336674449079093,-0.3854942540376338,0.16345931361625737,0.026718947207897987,0.12841161546391974
38,0.396538392874803,0.15724269702373164,-0.1434166651191533,0.13406289158261173,0.017972858899491104,0.10336784418304354
39,0.16470598262107583,0.027128060711174132,-0.3126049974531777,0.1734420183870952,0.03008213374218947,0.1353846083468449
40,0.044185771528613985,0.0019523824055788742,-0.34842603653714344,0.2950493876005465,0.08705414112345754,0.24567627215366925
