subject,rvalue,r2,adjusted_r2,rmse,mse,mae
1,0.4932365718877126,0.24328231584754267,-0.020968304015220207,0.22887641432033715,0.05238441303213463,0.1864407771039566
2,0.19128432148700888,0.036589691646745366,-0.316660754749448,0.20195446558381389,0.04078560616924387,0.1506430856935886
3,0.3054885724262282,0.09332326788301486,-0.2232940036499007,0.1832157669490702,0.03356801725873601,0.15024066682823972
4,0.20728212983453928,0.042965881348742796,-0.29481086641052445,0.22552236777242476,0.05086033836568081,0.17145990446132175
5,0.12560662536054765,0.01577702433446497,-0.32974806286726555,0.22269661082793013,0.04959378047424656,0.17909161392986359
6,0.10181483017350464,0.01036625964325959,-0.33705835133304296,0.2698482065405688,0.07281805457316148,0.21665965840758758
7,0.38706271522499136,0.14981754551734275,-0.1470715655718393,0.11971130977341451,0.01433079768766641,0.0935470957745643
8,0.5263892592332964,0.2770856522361785,0.02463937206468525,0.18009294338772214,0.032433468258053294,0.14333424708210407
9,0.2788787093025848,0.0777733345022756,-0.24598709061926605,0.16051882333314096,0.02576629264425612,0.11818535422302175
10,0.4423507480489673,0.19567418429948094,-0.0852014973737163,0.12913576199857393,0.01667604502695233,0.10007076272292001
11,0.3055930126920519,0.0933870894062046,-0.22320789524559714,0.19387343738123508,0.03758690972201568,0.15607147142314523
12,0.4492536653871533,0.2018288558637923,-0.07689757542186748,0.19792750459097627,0.039175297073610935,0.1596805559669395
13,0.25995711178885267,0.06757769996960204,-0.2944215459245525,0.24490764005549104,0.05997975215754996,0.19932854985183573
14,0.346178955250223,0.11983986905813591,-0.19416320468328596,0.21814918746300593,0.0475890679907697,0.17793584527801667
15,0.17638715563803614,0.031112428674076785,-0.30902895274885367,0.2710758819301757,0.07348213376422255,0.21670477420555181
16,0.18127400795583967,0.03286026596037382,-0.32175763652082257,0.35094620476755145,0.12316323864074816,0.29089276278126996
17,0.0889411763428737,0.007910532849254156,-0.3385334080605302,0.29510258632035336,0.08708553645296159,0.23691901791187667
18,0.5434232139998989,0.29530878951397993,0.04922614458235386,0.17976674893446623,0.03231608402246741,0.14161201708796578
19,0.24783808314582378,0.061423715457396263,-0.269838502616464,0.26471786056848823,0.07007554570395758,0.2162782177439278
20,0.5339586213772741,0.2851118093431192,0.03414042326144828,0.18804448760972003,0.03536072932040215,0.14865869900525486
21,0.37782487707140394,0.1427516377340215,-0.190062432322182,0.18735036759049079,0.03510016023629202,0.14510811862140935
22,0.20673555221309417,0.042739588548852986,-0.30825589564990086,0.3531679992381065,0.1247276356858472,0.29533782101755074
23,0.35668330072514154,0.12722297701618177,-0.18081597227222468,0.1778762992018477,0.031639977817745246,0.14075973650528287
24,0.37607104131206365,0.1414294281135399,-0.15998364499553652,0.15241585706997715,0.0232305934863757,0.1192151027885931
25,0.40744568519406726,0.16601198638326298,-0.12677103967367676,0.2273382737980483,0.05168269073347637,0.1848725038646235
26,0.28967396415889995,0.08391100551153166,-0.2429099330627329,0.13450221247123878,0.01809084515965826,0.10683596602218894
27,0.25754701473887476,0.06633046480090617,-0.2597128649511582,0.2809740178023652,0.07894639868000383,0.23005778163572554
28,0.4100162575932741,0.1681133314907941,-0.12238677497273809,0.1796351449807901,0.03226878531226948,0.13805375808419038
29,0.3765688718602378,0.1418041152540922,-0.15947741875244992,0.18886951958588524,0.03567169542860309,0.1515203965953227
30,-0.01791285521844567,0.00032087038207699624,-0.34877342884957874,0.40571471924689023,0.16460443341358297,0.3426425301526378
31,0.41345768681635353,0.1709472587875299,-0.11856322227079286,0.24215072229831872,0.05863697230959747,0.19059381592639854
32,0.575489115348922,0.33118772188508483,0.09386723610237291,0.16371972142030605,0.026804147181942618,0.1269541887117815
33,0.3438425517804649,0.11822770041490169,-0.19465924459916528,0.3281541958026321,0.10768517622287221,0.2507862997686496
34,0.4079603544797217,0.16643165082722017,-0.12776894299846675,0.17952226944985294,0.0322282452284256,0.1459510182003559
35,0.37405971645471753,0.1399206714741837,-0.16202207151892223,0.12178415850154714,0.014831381261929956,0.09728000748826036
36,0.248756681144498,0.06187988641402545,-0.26922133014573024,0.1887066707670939,0.03561020759200037,0.14612712078418413
37,0.30679715877882857,0.09412449663476175,-0.2772281941857708,0.2935621125263475,0.0861787139109319,0.23957441091196294
38,0.4364463767872862,0.1904854398107498,-0.09831434922973936,0.1780657273609551,0.03170740326058599,0.14473788083017142
39,0.4186578437963825,0.1752743901722362,-0.11272502913269711,0.21281345815135205,0.04528956797033727,0.17416014936584492
40,0.4087231380107208,0.16705460354533072,-0.1253623973376914,0.29103985332515103,0.08470419622352543,0.23323805165866238
