<svg viewBox="0 0 76 76">
  <path d="M73.5 0C61.7 0 54 2 46.4 7.2 44.9 5.3 42.6 4 40 4c-4.4 0-8 3.6-8 8s3.6 8 8 8 8-3.6 8-8c0-1.1-.2-2.1-.6-3C54.6 4 62 2 73.5 2c.2 0 .5.2.5.5 0 8.1-1.2 14.7-4.1 20.7L65 19c.6-.8 1-1.9 1-3 0-2.8-2.2-5-5-5s-5 2.2-5 5 2.2 5 5 5c.9 0 1.7-.3 2.5-.7L69 25c-2.3 4.3-5.4 8.4-9.6 12.6-2.5 2.4-5.3 5-8.8 7.9-.2.2-.3.4-.4.7l-.9 17.1c0 .2-.1.3-.2.4L31.7 74h-.2c-.2 0-.3-.1-.3-.1L28.3 71c-.1-.2-.2-.3-.2-.5L32 58c.1-.4 0-.7-.2-1L19 44.3c-.3-.3-.6-.4-1-.2L5.5 47.9h-.1c-.2 0-.3-.1-.4-.1l-2.9-2.9c-.1-.2-.1-.4 0-.6l10.1-17.4c.1-.2.3-.3.4-.3l17.2-.9c.6 0 1-.5.9-1.1 0-.6-.5-1-1.1-.9l-17.2.9c-.8.1-1.5.5-1.9 1.2L.3 43.3c-.5.9-.4 2.1.4 3l2.9 2.9c.4.4 1.1.7 1.8.7.2 0 .4 0 .7-.1L18 46.1 29.9 58l-3.7 12c-.2.8 0 1.7.6 2.4l3 3c.5.4 1.1.6 1.7.6.5 0 .9-.1 1.2-.3l17.5-10.2c.7-.4 1.1-1.1 1.2-2l.9-16.8c3.3-2.8 6.1-5.4 8.6-7.8C71.7 28 76 17.8 76 2.5 76 1.1 74.9 0 73.5 0zM40 18c-3.3 0-6-2.7-6-6s2.7-6 6-6 6 2.7 6 6-2.7 6-6 6zm21 1c-1.7 0-3-1.3-3-3s1.3-3 3-3 3 1.3 3 3-1.3 3-3 3z"/>
</svg>
