[{
  "address": {
    "street": "Sterrebos",
    "housenumber": "2",
    "postalcode": "5344 AM",
    "city": "Oss",
    "geoLocation": {
      "lat": "51.753525",
      "lng": "5.511859"
    }
  },
  "distance": 0,
  "type": "ING"
}, {
  "address": {
    "street": "Van Nesstraat",
    "housenumber": "71",
    "postalcode": "2024 DM",
    "city": "Haarlem",
    "geoLocation": {
      "lat": "52.4061",
      "lng": "4.645465"
    }
  },
  "distance": 0,
  "type": "ING"
}, {
  "address": {
    "street": "Dillenburgplein",
    "housenumber": "5-17",
    "postalcode": "2983 CB",
    "city": "Ridderkerk",
    "geoLocation": {
      "lat": "51.883958",
      "lng": "4.605482"
    }
  },
  "distance": 0,
  "type": "ING"
}, {
  "address": {
    "street": "Kaaikhof",
    "housenumber": "28A",
    "postalcode": "1567 JP",
    "city": "Assendelft",
    "geoLocation": {
      "lat": "52.488311",
      "lng": "4.752565"
    }
  },
  "distance": 0,
  "type": "ING"
}, {
  "address": {
    "street": "Rijksweg",
    "housenumber": "20",
    "postalcode": "5953 AE",
    "city": "Reuver",
    "geoLocation": {
      "lat": "51.284037",
      "lng": "6.078733"
    }
  },
  "distance": 0,
  "type": "ING"
}, {
  "address": {
    "street": "De Hovel",
    "housenumber": "19",
    "postalcode": "5051 NP",
    "city": "Goirle",
    "geoLocation": {
      "lat": "51.521256",
      "lng": "5.069537"
    }
  },
  "distance": 0,
  "type": "ING"
}, {
  "address": {
    "street": "Santpoorterstraat",
    "housenumber": "62",
    "postalcode": "2023 DD",
    "city": "Haarlem",
    "geoLocation": {
      "lat": "52.393703",
      "lng": "4.629583"
    }
  },
  "distance": 0,
  "type": "ING"
}, {
  "address": {
    "street": "Reghthuysplein",
    "housenumber": "3",
    "postalcode": "2421 BE",
    "city": "Nieuwkoop",
    "geoLocation": {
      "lat": "52.150532",
      "lng": "4.77908"
    }
  },
  "distance": 0,
  "type": "ING"
}, {
  "address": {
    "street": "Argonautenweg",
    "housenumber": "1",
    "postalcode": "3054 RP",
    "city": "Rotterdam",
    "geoLocation": {
      "lat": "51.95958",
      "lng": "4.494144"
    }
  },
  "distance": 0,
  "type": "ING"
}, {
  "address": {
    "street": "Stadsbrink",
    "housenumber": "445",
    "postalcode": "6707 AE",
    "city": "Wageningen",
    "geoLocation": {
      "lat": "51.969571",
      "lng": "5.668417"
    }
  },
  "distance": 0,
  "type": "ING"
}, {
  "address": {
    "street": "Weigelia",
    "housenumber": "48",
    "postalcode": "2262 AB",
    "city": "Leidschendam",
    "geoLocation": {
      "lat": "52.087229",
      "lng": "4.382823"
    }
  },
  "distance": 0,
  "type": "ING"
}, {
  "address": {
    "street": "Burgemeester Magneestraat",
    "housenumber": "37",
    "postalcode": "5571 HB",
    "city": "Bergeijk",
    "geoLocation": {
      "lat": "51.318355",
      "lng": "5.357439"
    }
  },
  "distance": 0,
  "type": "ING"
}, {
  "address": {
    "street": "Stadhuisplein",
    "housenumber": "6",
    "postalcode": "3012 AS",
    "city": "Rotterdam",
    "geoLocation": {
      "lat": "51.922275",
      "lng": "4.478076"
    }
  },
  "distance": 0,
  "type": "ING"
}, {
  "address": {
    "street": "Kop van het Ruim",
    "housenumber": "15",
    "postalcode": "8251 KD",
    "city": "Dronten",
    "geoLocation": {
      "lat": "52.525622",
      "lng": "5.719508"
    }
  },
  "distance": 0,
  "type": "ING"
}, {
  "address": {
    "street": "Genderenplein",
    "housenumber": "13",
    "postalcode": "2134 DP",
    "city": "Hoofddorp",
    "geoLocation": {
      "lat": "52.306973",
      "lng": "4.638627"
    }
  },
  "distance": 0,
  "type": "ING"
}, {
  "address": {
    "street": "Olympiaplein",
    "housenumber": "127",
    "postalcode": "1077 CX",
    "city": "Amsterdam",
    "geoLocation": {
      "lat": "52.346257",
      "lng": "4.867654"
    }
  },
  "distance": 0,
  "type": "ING"
}, {
  "address": {
    "street": "Streekweg",
    "housenumber": "210",
    "postalcode": "1616 AN",
    "city": "Hoogkarspel",
    "geoLocation": {
      "lat": "52.6943598",
      "lng": "5.1770607"
    }
  },
  "distance": 0,
  "type": "ING"
}, {
  "address": {
    "street": "Wagnerplein",
    "housenumber": "52",
    "postalcode": "5011 LR",
    "city": "Tilburg",
    "geoLocation": {
      "lat": "51.584471",
      "lng": "5.085618"
    }
  },
  "distance": 0,
  "type": "ING"
}, {
  "address": {
    "street": "Groenestraat",
    "housenumber": "78",
    "postalcode": "6991 GH",
    "city": "Rheden",
    "geoLocation": {
      "lat": "52.004702",
      "lng": "6.035865"
    }
  },
  "distance": 0,
  "type": "ING"
}, {
  "address": {
    "street": "Stationsplein",
    "housenumber": "27",
    "postalcode": "6221 BT",
    "city": "Maastricht",
    "geoLocation": {
      "lat": "50.849236",
      "lng": "5.705731"
    }
  },
  "distance": 0,
  "type": "ING"
}, {
  "address": {
    "street": "August Allebeplein",
    "housenumber": "12",
    "postalcode": "1062 AC",
    "city": "Amsterdam",
    "geoLocation": {
      "lat": "52.363676",
      "lng": "4.837585"
    }
  },
  "distance": 0,
  "type": "ING"
}, {
  "address": {
    "street": "Molenstraat",
    "housenumber": "142",
    "postalcode": "6711 AX",
    "city": "Ede",
    "geoLocation": {
      "lat": "52.047112",
      "lng": "5.668858"
    }
  },
  "distance": 0,
  "type": "ING"
}, {
  "address": {
    "street": "Zuidplein",
    "housenumber": "622",
    "postalcode": "3083 CX",
    "city": "Rotterdam",
    "geoLocation": {
      "lat": "51.887839",
      "lng": "4.491599"
    }
  },
  "distance": 0,
  "type": "ING"
}, {
  "address": {
    "street": "Noorderkade",
    "housenumber": "122",
    "postalcode": "1823 CJ",
    "city": "Alkmaar",
    "geoLocation": {
      "lat": "52.633697",
      "lng": "4.751138"
    }
  },
  "distance": 0,
  "type": "ING"
}, {
  "address": {
    "street": "Monseigneur van Roosmalenplein",
    "housenumber": "19",
    "postalcode": "5213 GC",
    "city": "Den Bosch",
    "geoLocation": {
      "lat": "51.695808",
      "lng": "5.329109"
    }
  },
  "distance": 0,
  "type": "ING"
}, {
  "address": {
    "street": "Maagdenbergplein",
    "housenumber": "15",
    "postalcode": "5915 CW",
    "city": "Venlo",
    "geoLocation": {
      "lat": "51.358677",
      "lng": "6.181815"
    }
  },
  "distance": 0,
  "type": "ING"
}, {
  "address": {
    "street": "Burchtstraat",
    "housenumber": "21",
    "postalcode": "6602 AP",
    "city": "Wijchen",
    "geoLocation": {
      "lat": "51.807804",
      "lng": "5.723374"
    }
  },
  "distance": 0,
  "type": "ING"
}, {
  "address": {
    "street": "Amstelveenseweg",
    "housenumber": "186",
    "postalcode": "1075 XR",
    "city": "Amsterdam",
    "geoLocation": {
      "lat": "52.352389",
      "lng": "4.855839"
    }
  },
  "distance": 0,
  "type": "ING"
}, {
  "address": {
    "street": "Toldam",
    "housenumber": "5",
    "postalcode": "3218 AW",
    "city": "Heenvliet",
    "geoLocation": {
      "lat": "51.863259",
      "lng": "4.246251"
    }
  },
  "distance": 0,
  "type": "ING"
}, {
  "address": {
    "street": "Westwaarts",
    "housenumber": "41",
    "postalcode": "2711 AD",
    "city": "Zoetermeer",
    "geoLocation": {
      "lat": "52.060944",
      "lng": "4.486481"
    }
  },
  "distance": 0,
  "type": "ING"
}, {
  "address": {
    "street": "Weversplein",
    "housenumber": "5",
    "postalcode": "7471 VS",
    "city": "Goor",
    "geoLocation": {
      "lat": "52.231636",
      "lng": "6.585007"
    }
  },
  "distance": 0,
  "type": "ING"
}, {
  "address": {
    "street": "Bevrijdingsplein",
    "housenumber": "50",
    "postalcode": "2321 BX",
    "city": "Leiden",
    "geoLocation": {
      "lat": "52.146421",
      "lng": "4.476475"
    }
  },
  "distance": 0,
  "type": "ING"
}, {
  "address": {
    "street": "Klaas Fuitestraat",
    "housenumber": "42",
    "postalcode": "8281 BZ",
    "city": "Genemuiden",
    "geoLocation": {
      "lat": "52.6239057",
      "lng": "6.0458621"
    }
  },
  "distance": 0,
  "type": "ING"
}, {
  "address": {
    "street": "Stationsplein",
    "housenumber": "166",
    "postalcode": "6811 KL",
    "city": "Arnhem",
    "geoLocation": {
      "lat": "51.984249",
      "lng": "5.90103"
    }
  },
  "distance": 0,
  "type": "ING"
}, {
  "address": {
    "street": "Admiraalsplein",
    "housenumber": "162-165",
    "postalcode": "3317 BC",
    "city": "Dordrecht",
    "geoLocation": {
      "lat": "51.8146697",
      "lng": "4.602411"
    }
  },
  "distance": 0,
  "type": "ING"
}, {
  "address": {
    "street": "Eerste Oosterparkstraat",
    "housenumber": "152",
    "postalcode": "1091 HH",
    "city": "Amsterdam",
    "geoLocation": {
      "lat": "52.357049",
      "lng": "4.91392"
    }
  },
  "distance": 0,
  "type": "ING"
}, {
  "address": {
    "street": "Tournooiveld",
    "housenumber": "6",
    "postalcode": "2511 CX",
    "city": "Den Haag",
    "geoLocation": {
      "lat": "52.08174",
      "lng": "4.314804"
    }
  },
  "distance": 0,
  "type": "ING"
}, {
  "address": {
    "street": "De Hems",
    "housenumber": "16-090",
    "postalcode": "7522 NL",
    "city": "Enschede",
    "geoLocation": {
      "lat": "52.243577",
      "lng": "6.85112"
    }
  },
  "distance": 0,
  "type": "ING"
}, {
  "address": {
    "street": "Weissenbruchstraat",
    "housenumber": "116",
    "postalcode": "2596 GK",
    "city": "Den Haag",
    "geoLocation": {
      "lat": "52.0903126",
      "lng": "4.318274"
    }
  },
  "distance": 0,
  "type": "ING"
}, {
  "address": {
    "street": "Hammarskjoldhof",
    "housenumber": "2",
    "postalcode": "3527 HE",
    "city": "Utrecht",
    "geoLocation": {
      "lat": "52.074983",
      "lng": "5.093524"
    }
  },
  "distance": 0,
  "type": "ING"
}, {
  "address": {
    "street": "Streksingel",
    "housenumber": "163",
    "postalcode": "3054 HG",
    "city": "Rotterdam",
    "geoLocation": {
      "lat": "51.957562",
      "lng": "4.496061"
    }
  },
  "distance": 0,
  "type": "ING"
}, {
  "address": {
    "street": "Schoolstraat",
    "housenumber": "13",
    "postalcode": "9301 KB",
    "city": "Roden",
    "geoLocation": {
      "lat": "53.1373018",
      "lng": "6.4331007"
    }
  },
  "distance": 0,
  "type": "ING"
}, {
  "address": {
    "street": "Koningsschild",
    "housenumber": "11",
    "postalcode": "5051 TT",
    "city": "Goirle",
    "geoLocation": {
      "lat": "51.519197",
      "lng": "5.055886"
    }
  },
  "distance": 0,
  "type": "ING"
}, {
  "address": {
    "street": "Hoornesplein",
    "housenumber": "137",
    "postalcode": "2221 BE",
    "city": "Katwijk",
    "geoLocation": {
      "lat": "52.206194",
      "lng": "4.41904"
    }
  },
  "distance": 0,
  "type": "ING"
}, {
  "address": {
    "street": "Rozenplein",
    "housenumber": "6",
    "postalcode": "6713 EN",
    "city": "Ede",
    "geoLocation": {
      "lat": "52.038528",
      "lng": "5.656924"
    }
  },
  "distance": 0,
  "type": "ING"
}, {
  "address": {
    "street": "Raadhuisstraat",
    "housenumber": "22",
    "postalcode": "1016 DE",
    "city": "Amsterdam",
    "geoLocation": {
      "lat": "52.373472",
      "lng": "4.887838"
    }
  },
  "distance": 0,
  "type": "ING"
}, {
  "address": {
    "street": "Kerkplein",
    "housenumber": "10",
    "postalcode": "2042 JH",
    "city": "Zandvoort",
    "geoLocation": {
      "lat": "52.371878",
      "lng": "4.529311"
    }
  },
  "distance": 0,
  "type": "ING"
}, {
  "address": {
    "street": "Zuiderhout",
    "housenumber": "103",
    "postalcode": "4904 AW",
    "city": "Oosterhout",
    "geoLocation": {
      "lat": "51.627618",
      "lng": "4.858277"
    }
  },
  "distance": 0,
  "type": "ING"
}, {
  "address": {
    "street": "Anthon van der Horstlaan",
    "housenumber": "2",
    "postalcode": "3752 VN",
    "city": "Bunschoten-Spakenburg",
    "geoLocation": {
      "lat": "52.247845",
      "lng": "5.367239"
    }
  },
  "distance": 0,
  "type": "ING"
}, {
  "address": {
    "street": "Mari\u00EBnburg",
    "housenumber": "90",
    "postalcode": "6511 PS",
    "city": "Nijmegen",
    "geoLocation": {
      "lat": "51.844832",
      "lng": "5.866496"
    }
  },
  "distance": 0,
  "type": "ING"
}, {
  "address": {
    "street": "De Biezen",
    "housenumber": "4",
    "postalcode": "3401 GD",
    "city": "IJsselstein",
    "geoLocation": {
      "lat": "52.022258",
      "lng": "5.027716"
    }
  },
  "distance": 0,
  "type": "ING"
}, {
  "address": {
    "street": "Brabantplein",
    "housenumber": "24",
    "postalcode": "4817 LR",
    "city": "Breda",
    "geoLocation": {
      "lat": "51.590493",
      "lng": "4.800675"
    }
  },
  "distance": 0,
  "type": "ING"
}, {
  "address": {
    "street": "Heuneind",
    "housenumber": "21",
    "postalcode": "5056 GE",
    "city": "Berkel-Enschot",
    "geoLocation": {
      "lat": "51.584371",
      "lng": "5.142563"
    }
  },
  "distance": 0,
  "type": "ING"
}, {
  "address": {
    "street": "Dorpsstraat",
    "housenumber": "99",
    "postalcode": "2712 AE",
    "city": "Zoetermeer",
    "geoLocation": {
      "lat": "52.0556",
      "lng": "4.497861"
    }
  },
  "distance": 0,
  "type": "ING"
}, {
  "address": {
    "street": "Lambertus Zijlplein",
    "housenumber": "8",
    "postalcode": "1067 JS",
    "city": "Amsterdam",
    "geoLocation": {
      "lat": "52.377724",
      "lng": "4.801573"
    }
  },
  "distance": 0,
  "type": "ING"
}, {
  "address": {
    "street": "Botplein",
    "housenumber": "15",
    "postalcode": "1317 SK",
    "city": "Almere",
    "geoLocation": {
      "lat": "52.38928",
      "lng": "5.231558"
    }
  },
  "distance": 0,
  "type": "ING"
}, {
  "address": {
    "street": "Zwart Janstraat",
    "housenumber": "109-111",
    "postalcode": "3035 AN",
    "city": "Rotterdam",
    "geoLocation": {
      "lat": "51.933934",
      "lng": "4.476852"
    }
  },
  "distance": 0,
  "type": "ING"
}, {
  "address": {
    "street": "Kruidenhof",
    "housenumber": "26",
    "postalcode": "1112 PS",
    "city": "Diemen",
    "geoLocation": {
      "lat": "52.333645",
      "lng": "4.957176"
    }
  },
  "distance": 0,
  "type": "ING"
}, {
  "address": {
    "street": "Paduaweg",
    "housenumber": "3",
    "postalcode": "3734 GG",
    "city": "Den Dolder",
    "geoLocation": {
      "lat": "52.13926",
      "lng": "5.240685"
    }
  },
  "distance": 0,
  "type": "ING"
}, {
  "address": {
    "street": "Kerkstraat",
    "housenumber": "8",
    "postalcode": "5111 CJ",
    "city": "Baarle-Nassau",
    "geoLocation": {
      "lat": "51.442342",
      "lng": "4.929018"
    }
  },
  "distance": 0,
  "type": "ING"
}, {
  "address": {
    "street": "Godebaldkwartier",
    "housenumber": "149",
    "postalcode": "3511 DP",
    "city": "Utrecht",
    "geoLocation": {
      "lat": "52.089224",
      "lng": "5.113306"
    }
  },
  "distance": 0,
  "type": "ING"
}, {
  "address": {
    "street": "Constantijn Huygensstraat",
    "housenumber": "110",
    "postalcode": "2802 LZ",
    "city": "Gouda",
    "geoLocation": {
      "lat": "52.005549",
      "lng": "4.701688"
    }
  },
  "distance": 0,
  "type": "ING"
}, {
  "address": {
    "street": "Burgemeester van Stamplein",
    "housenumber": "270",
    "postalcode": "2132 BH",
    "city": "Hoofddorp",
    "geoLocation": {
      "lat": "52.3017",
      "lng": "4.69398"
    }
  },
  "distance": 0,
  "type": "ING"
}, {
  "address": {
    "street": "Rapportstraat",
    "housenumber": "2",
    "postalcode": "5504 BP",
    "city": "Veldhoven",
    "geoLocation": {
      "lat": "51.404232",
      "lng": "5.397126"
    }
  },
  "distance": 0,
  "type": "ING"
}, {
  "address": {
    "street": "Rio de Janeiroplein",
    "housenumber": "1",
    "postalcode": "1334 HE",
    "city": "Almere",
    "geoLocation": {
      "lat": "52.394916",
      "lng": "5.281245"
    }
  },
  "distance": 0,
  "type": "ING"
}, {
  "address": {
    "street": "Hildo Kroplaan",
    "housenumber": "20",
    "postalcode": "2552 XS",
    "city": "Den Haag",
    "geoLocation": {
      "lat": "52.054802",
      "lng": "4.25089"
    }
  },
  "distance": 0,
  "type": "ING"
}, {
  "address": {
    "street": "Beijerlandselaan",
    "housenumber": "16-18",
    "postalcode": "3074 EJ",
    "city": "Rotterdam",
    "geoLocation": {
      "lat": "51.898797",
      "lng": "4.510636"
    }
  },
  "distance": 0,
  "type": "ING"
}, {
  "address": {
    "street": "Haarlemmerstraat",
    "housenumber": "18",
    "postalcode": "1013 ER",
    "city": "Amsterdam",
    "geoLocation": {
      "lat": "52.379617",
      "lng": "4.893688"
    }
  },
  "distance": 0,
  "type": "ING"
}, {
  "address": {
    "street": "Willemstraat",
    "housenumber": "26",
    "postalcode": "9934 BC",
    "city": "Delfzijl",
    "geoLocation": {
      "lat": "53.332646",
      "lng": "6.928629"
    }
  },
  "distance": 0,
  "type": "ING"
}, {
  "address": {
    "street": "Van Beethovenlaan",
    "housenumber": "4",
    "postalcode": "4702 JS",
    "city": "Roosendaal",
    "geoLocation": {
      "lat": "51.536066",
      "lng": "4.467864"
    }
  },
  "distance": 0,
  "type": "ING"
}, {
  "address": {
    "street": "Bogaardplein",
    "housenumber": "22",
    "postalcode": "2284 DM",
    "city": "Rijswijk",
    "geoLocation": {
      "lat": "52.03563",
      "lng": "4.315615"
    }
  },
  "distance": 0,
  "type": "ING"
}, {
  "address": {
    "street": "Imkerstraat",
    "housenumber": "16",
    "postalcode": "3068 GX",
    "city": "Rotterdam",
    "geoLocation": {
      "lat": "51.964246",
      "lng": "4.571037"
    }
  },
  "distance": 0,
  "type": "ING"
}, {
  "address": {
    "street": "Piusplein",
    "housenumber": "34",
    "postalcode": "5038 WN",
    "city": "Tilburg",
    "geoLocation": {
      "lat": "51.55435",
      "lng": "5.090764"
    }
  },
  "distance": 0,
  "type": "ING"
}, {
  "address": {
    "street": "Haarlemmerdijk",
    "housenumber": "1",
    "postalcode": "1013 JZ",
    "city": "Amsterdam",
    "geoLocation": {
      "lat": "52.381556",
      "lng": "4.888761"
    }
  },
  "distance": 0,
  "type": "ING"
}, {
  "address": {
    "street": "Europaplein",
    "housenumber": "1",
    "postalcode": "6336 BE",
    "city": "Hulsberg",
    "geoLocation": {
      "lat": "50.889528",
      "lng": "5.857602"
    }
  },
  "distance": 0,
  "type": "ING"
}, {
  "address": {
    "street": "Wesseler-Nering",
    "housenumber": "27",
    "postalcode": "7544 JB",
    "city": "Enschede",
    "geoLocation": {
      "lat": "52.1916057",
      "lng": "6.8772282"
    }
  },
  "distance": 0,
  "type": "ING"
}, {
  "address": {
    "street": "Mosveld",
    "housenumber": "129",
    "postalcode": "1031 AD",
    "city": "Amsterdam",
    "geoLocation": {
      "lat": "52.3910889",
      "lng": "4.911433"
    }
  },
  "distance": 0,
  "type": "ING"
}, {
  "address": {
    "street": "Europaplein",
    "housenumber": "85",
    "postalcode": "6602 GV",
    "city": "Wijchen",
    "geoLocation": {
      "lat": "51.806892",
      "lng": "5.727994"
    }
  },
  "distance": 0,
  "type": "ING"
}, {
  "address": {
    "street": "Stadionweg",
    "housenumber": "159",
    "postalcode": "1076 NN",
    "city": "Amsterdam",
    "geoLocation": {
      "lat": "52.345835",
      "lng": "4.863726"
    }
  },
  "distance": 0,
  "type": "ING"
}, {
  "address": {
    "street": "Sint Teunislaan",
    "housenumber": "66",
    "postalcode": "5231 BR",
    "city": "Den Bosch",
    "geoLocation": {
      "lat": "51.71145",
      "lng": "5.313257"
    }
  },
  "distance": 0,
  "type": "ING"
}, {
  "address": {
    "street": "Stationsplein",
    "housenumber": "10A",
    "postalcode": "7201 ML",
    "city": "Zutphen",
    "geoLocation": {
      "lat": "52.144862",
      "lng": "6.195436"
    }
  },
  "distance": 0,
  "type": "ING"
}, {
  "address": {
    "street": "Verzetstraat",
    "housenumber": "10",
    "postalcode": "1541 HB",
    "city": "Koog aan de Zaan",
    "geoLocation": {
      "lat": "52.463253",
      "lng": "4.809302"
    }
  },
  "distance": 0,
  "type": "ING"
}, {
  "address": {
    "street": "Ophelialaan",
    "housenumber": "97",
    "postalcode": "1431 HC",
    "city": "Aalsmeer",
    "geoLocation": {
      "lat": "52.264084",
      "lng": "4.760625"
    }
  },
  "distance": 0,
  "type": "ING"
}, {
  "address": {
    "street": "Dalsteindreef",
    "housenumber": "1009",
    "postalcode": "1112 XC",
    "city": "Diemen",
    "geoLocation": {
      "lat": "52.328561",
      "lng": "4.955743"
    }
  },
  "distance": 0,
  "type": "ING"
}, {
  "address": {
    "street": "Salom\u00E9straat",
    "housenumber": "27",
    "postalcode": "7323 TL",
    "city": "Apeldoorn",
    "geoLocation": {
      "lat": "52.2312344",
      "lng": "5.9807436"
    }
  },
  "distance": 0,
  "type": "ING"
}, {
  "address": {
    "street": "Westermarkt",
    "housenumber": "21",
    "postalcode": "1016 DJ",
    "city": "Amsterdam",
    "geoLocation": {
      "lat": "52.373878",
      "lng": "4.883927"
    }
  },
  "distance": 0,
  "type": "ING"
}, {
  "address": {
    "street": "Heerenweg",
    "housenumber": "46",
    "postalcode": "1851 KS",
    "city": "Heiloo",
    "geoLocation": {
      "lat": "52.604437",
      "lng": "4.711285"
    }
  },
  "distance": 0,
  "type": "ING"
}, {
  "address": {
    "street": "Dokter van Doornplein",
    "housenumber": "2",
    "postalcode": "1391 LT",
    "city": "Abcoude",
    "geoLocation": {
      "lat": "52.272804",
      "lng": "4.973311"
    }
  },
  "distance": 0,
  "type": "ING"
}, {
  "address": {
    "street": "Stationsstraat",
    "housenumber": "178",
    "postalcode": "7311 MJ",
    "city": "Apeldoorn",
    "geoLocation": {
      "lat": "52.21584",
      "lng": "5.965257"
    }
  },
  "distance": 0,
  "type": "ING"
}, {
  "address": {
    "street": "Ouverture",
    "housenumber": "214",
    "postalcode": "5629 PX",
    "city": "Eindhoven",
    "geoLocation": {
      "lat": "51.488564",
      "lng": "5.473681"
    }
  },
  "distance": 0,
  "type": "ING"
}, {
  "address": {
    "street": "Leusderweg",
    "housenumber": "79",
    "postalcode": "3818 AA",
    "city": "Amersfoort",
    "geoLocation": {
      "lat": "52.144043",
      "lng": "5.380567"
    }
  },
  "distance": 0,
  "type": "ING"
}, {
  "address": {
    "street": "Pieter Calandlaan",
    "housenumber": "212A",
    "postalcode": "1069 LA",
    "city": "Amsterdam",
    "geoLocation": {
      "lat": "52.352123",
      "lng": "4.799517"
    }
  },
  "distance": 0,
  "type": "ING"
}, {
  "address": {
    "street": "Dorpsstraat",
    "housenumber": "5",
    "postalcode": "3171 ED",
    "city": "Poortugaal",
    "geoLocation": {
      "lat": "51.856872",
      "lng": "4.390323"
    }
  },
  "distance": 0,
  "type": "ING"
}, {
  "address": {
    "street": "Prins Hendrikkade",
    "housenumber": "20",
    "postalcode": "1012 TL",
    "city": "Amsterdam",
    "geoLocation": {
      "lat": "52.378549",
      "lng": "4.896168"
    }
  },
  "distance": 0,
  "type": "ING"
}, {
  "address": {
    "street": "Nieuwe Binnenweg",
    "housenumber": "34A",
    "postalcode": "3015 BA",
    "city": "Rotterdam",
    "geoLocation": {
      "lat": "51.916215",
      "lng": "4.469912"
    }
  },
  "distance": 0,
  "type": "ING"
}, {
  "address": {
    "street": "Rembrandthof",
    "housenumber": "49",
    "postalcode": "1181 ZL",
    "city": "Amstelveen",
    "geoLocation": {
      "lat": "52.303329",
      "lng": "4.860135"
    }
  },
  "distance": 0,
  "type": "ING"
}, {
  "address": {
    "street": "P.C. Hooftplein",
    "housenumber": "73A",
    "postalcode": "3842 HE",
    "city": "Harderwijk",
    "geoLocation": {
      "lat": "52.343361",
      "lng": "5.636489"
    }
  },
  "distance": 0,
  "type": "ING"
}, {
  "address": {
    "street": "Burgemeester Kuntzelaan",
    "housenumber": "35",
    "postalcode": "3771 EP",
    "city": "Barneveld",
    "geoLocation": {
      "lat": "52.137649",
      "lng": "5.590247"
    }
  },
  "distance": 0,
  "type": "ING"
}, {
  "address": {
    "street": "Mira",
    "housenumber": "25",
    "postalcode": "5505 AR",
    "city": "Veldhoven",
    "geoLocation": {
      "lat": "51.413052",
      "lng": "5.397113"
    }
  },
  "distance": 0,
  "type": "ING"
}, {
  "address": {
    "street": "Brouwerijstraat",
    "housenumber": "72",
    "postalcode": "7523 XE",
    "city": "Enschede",
    "geoLocation": {
      "lat": "52.231618",
      "lng": "6.890787"
    }
  },
  "distance": 0,
  "type": "ING"
}, {
  "address": {
    "street": "Van Harenstraat",
    "housenumber": "66",
    "postalcode": "8471 JG",
    "city": "Wolvega",
    "geoLocation": {
      "lat": "52.874863",
      "lng": "5.997191"
    }
  },
  "distance": 0,
  "type": "ING"
}, {
  "address": {
    "street": "Nachtegaalstraat",
    "housenumber": "22-24",
    "postalcode": "3581 AH",
    "city": "Utrecht",
    "geoLocation": {
      "lat": "52.092309",
      "lng": "5.130041"
    }
  },
  "distance": 0,
  "type": "ING"
}, {
  "address": {
    "street": "Sternpassage",
    "housenumber": "18",
    "postalcode": "8161 HP",
    "city": "Epe",
    "geoLocation": {
      "lat": "52.34715",
      "lng": "5.985147"
    }
  },
  "distance": 0,
  "type": "ING"
}, {
  "address": {
    "street": "Kajuit",
    "housenumber": "269",
    "postalcode": "9733 CT",
    "city": "Groningen",
    "geoLocation": {
      "lat": "53.237739",
      "lng": "6.624254"
    }
  },
  "distance": 0,
  "type": "ING"
}, {
  "address": {
    "street": "Dorpsstraat",
    "housenumber": "84",
    "postalcode": "2665 BK",
    "city": "Bleiswijk",
    "geoLocation": {
      "lat": "52.011752",
      "lng": "4.529964"
    }
  },
  "distance": 0,
  "type": "ING"
}, {
  "address": {
    "street": "Van Beuningenhaven",
    "housenumber": "10",
    "postalcode": "2993 EH",
    "city": "Barendrecht",
    "geoLocation": {
      "lat": "51.846738",
      "lng": "4.498904"
    }
  },
  "distance": 0,
  "type": "ING"
}, {
  "address": {
    "street": "Groeninx van Zoelenlaan",
    "housenumber": "125",
    "postalcode": "3078 AW",
    "city": "Rotterdam",
    "geoLocation": {
      "lat": "51.885961",
      "lng": "4.54783"
    }
  },
  "distance": 0,
  "type": "ING"
}, {
  "address": {
    "street": "Bloemendaalseweg",
    "housenumber": "70",
    "postalcode": "2061 CM",
    "city": "Bloemendaal",
    "geoLocation": {
      "lat": "52.40413",
      "lng": "4.619735"
    }
  },
  "distance": 0,
  "type": "ING"
}, {
  "address": {
    "street": "Lange Poten",
    "housenumber": "1",
    "postalcode": "2511 CL",
    "city": "Den Haag",
    "geoLocation": {
      "lat": "52.078452",
      "lng": "4.314066"
    }
  },
  "distance": 0,
  "type": "ING"
}, {
  "address": {
    "street": "Parijsplein",
    "housenumber": "19",
    "postalcode": "2548 VL",
    "city": "Den Haag",
    "geoLocation": {
      "lat": "52.019721",
      "lng": "4.297285"
    }
  },
  "distance": 0,
  "type": "ING"
}, {
  "address": {
    "street": "Wythusterwei",
    "housenumber": "12",
    "postalcode": "9051 EJ",
    "city": "Stiens",
    "geoLocation": {
      "lat": "53.25689",
      "lng": "5.765049"
    }
  },
  "distance": 0,
  "type": "ING"
}, {
  "address": {
    "street": "Benschopperweg",
    "housenumber": "2",
    "postalcode": "3401 BV",
    "city": "IJsselstein",
    "geoLocation": {
      "lat": "52.018124",
      "lng": "5.040017"
    }
  },
  "distance": 0,
  "type": "ING"
}, {
  "address": {
    "street": "Samu\u00EBl Leviestraat",
    "housenumber": "21",
    "postalcode": "9351 BM",
    "city": "Leek",
    "geoLocation": {
      "lat": "53.162393",
      "lng": "6.390717"
    }
  },
  "distance": 0,
  "type": "ING"
}, {
  "address": {
    "street": "Achterste Wei",
    "housenumber": "9",
    "postalcode": "3844 HR",
    "city": "Harderwijk",
    "geoLocation": {
      "lat": "52.336882",
      "lng": "5.60819"
    }
  },
  "distance": 0,
  "type": "ING"
}, {
  "address": {
    "street": "Nyenburgh",
    "housenumber": "99",
    "postalcode": "1829 GC",
    "city": "Oudorp",
    "geoLocation": {
      "lat": "52.636035",
      "lng": "4.775362"
    }
  },
  "distance": 0,
  "type": "ING"
}, {
  "address": {
    "street": "Remigiusplein",
    "housenumber": "6A",
    "postalcode": "6921 BL",
    "city": "Duiven",
    "geoLocation": {
      "lat": "51.949771",
      "lng": "6.02345"
    }
  },
  "distance": 0,
  "type": "ING"
}, {
  "address": {
    "street": "Westerstraat",
    "housenumber": "79",
    "postalcode": "1015 LW",
    "city": "Amsterdam",
    "geoLocation": {
      "lat": "52.378446",
      "lng": "4.884448"
    }
  },
  "distance": 0,
  "type": "ING"
}, {
  "address": {
    "street": "Triade",
    "housenumber": "14",
    "postalcode": "9401 ZH",
    "city": "Assen",
    "geoLocation": {
      "lat": "52.997915",
      "lng": "6.560543"
    }
  },
  "distance": 0,
  "type": "ING"
}, {
  "address": {
    "street": "Prinsen Hoven",
    "housenumber": "1",
    "postalcode": "8331 JV",
    "city": "Steenwijk",
    "geoLocation": {
      "lat": "52.78745",
      "lng": "6.114398"
    }
  },
  "distance": 0,
  "type": "ING"
}, {
  "address": {
    "street": "Houtsmastraat",
    "housenumber": "150",
    "postalcode": "7002 KK",
    "city": "Doetinchem",
    "geoLocation": {
      "lat": "51.973452",
      "lng": "6.315908"
    }
  },
  "distance": 0,
  "type": "ING"
}, {
  "address": {
    "street": "Klarendalseweg",
    "housenumber": "139",
    "postalcode": "6822 GG",
    "city": "Arnhem",
    "geoLocation": {
      "lat": "51.989154",
      "lng": "5.922053"
    }
  },
  "distance": 0,
  "type": "ING"
}, {
  "address": {
    "street": "Passage",
    "housenumber": "50",
    "postalcode": "3901 AZ",
    "city": "Veenendaal",
    "geoLocation": {
      "lat": "52.025275",
      "lng": "5.556778"
    }
  },
  "distance": 0,
  "type": "ING"
}, {
  "address": {
    "street": "Binnenweg",
    "housenumber": "81",
    "postalcode": "2101 JD",
    "city": "Heemstede",
    "geoLocation": {
      "lat": "52.353226",
      "lng": "4.621084"
    }
  },
  "distance": 0,
  "type": "ING"
}, {
  "address": {
    "street": "Vuldersbrink",
    "housenumber": "75",
    "postalcode": "3841 AS",
    "city": "Harderwijk",
    "geoLocation": {
      "lat": "52.350189",
      "lng": "5.620395"
    }
  },
  "distance": 0,
  "type": "ING"
}, {
  "address": {
    "street": "Cornelis Troostplein",
    "housenumber": "11",
    "postalcode": "1072 JJ",
    "city": "Amsterdam",
    "geoLocation": {
      "lat": "52.351009",
      "lng": "4.892024"
    }
  },
  "distance": 0,
  "type": "ING"
}, {
  "address": {
    "street": "Gruttostraat",
    "housenumber": "23",
    "postalcode": "5212 VM",
    "city": "Den Bosch",
    "geoLocation": {
      "lat": "51.700924",
      "lng": "5.30238"
    }
  },
  "distance": 0,
  "type": "ING"
}, {
  "address": {
    "street": "Schiedamseweg",
    "housenumber": "39",
    "postalcode": "3026 AC",
    "city": "Rotterdam",
    "geoLocation": {
      "lat": "51.910027",
      "lng": "4.446766"
    }
  },
  "distance": 0,
  "type": "ING"
}, {
  "address": {
    "street": "De Reede",
    "housenumber": "9",
    "postalcode": "9642 MA",
    "city": "Veendam",
    "geoLocation": {
      "lat": "53.095879",
      "lng": "6.85991"
    }
  },
  "distance": 0,
  "type": "ING"
}, {
  "address": {
    "street": "Krugerplein",
    "housenumber": "3",
    "postalcode": "1092 JZ",
    "city": "Amsterdam",
    "geoLocation": {
      "lat": "52.354718",
      "lng": "4.920184"
    }
  },
  "distance": 0,
  "type": "ING"
}, {
  "address": {
    "street": "Lambertushof",
    "housenumber": "30-31",
    "postalcode": "6031 EP",
    "city": "Nederweert",
    "geoLocation": {
      "lat": "51.285496",
      "lng": "5.749352"
    }
  },
  "distance": 0,
  "type": "ING"
}, {
  "address": {
    "street": "Laan op Zuid",
    "housenumber": "1190",
    "postalcode": "3071 AC",
    "city": "Rotterdam",
    "geoLocation": {
      "lat": "51.904485",
      "lng": "4.503596"
    }
  },
  "distance": 0,
  "type": "ING"
}, {
  "address": {
    "street": "Zijdelwaardplein",
    "housenumber": "84",
    "postalcode": "1422 DN",
    "city": "Uithoorn",
    "geoLocation": {
      "lat": "52.246218",
      "lng": "4.827787"
    }
  },
  "distance": 0,
  "type": "ING"
}, {
  "address": {
    "street": "Neringpassage",
    "housenumber": "127",
    "postalcode": "8224 JB",
    "city": "Lelystad",
    "geoLocation": {
      "lat": "52.508857",
      "lng": "5.477955"
    }
  },
  "distance": 0,
  "type": "ING"
}
]

