{
  "newAccountNumbers": {
    "userAccount": 11000011,
    "adminAccount": 99000005
  },
  "users": {
    "11000008": {
      "pin": "98765",
      "totalBalance": 1.0E9,
      "admin": false,
      "accountNumber": "11000008",
      "accountNumberAsInt": 11000008,
      "username": "Elon"
    },
    "11000009": {
      "pin": "12345",
      "totalBalance": 1000015,
      "admin": false,
      "accountNumber": "11000009",
      "accountNumberAsInt": 11000009,
      "username": "Nele"
    },
    "99000001": {
      "pin": "00000",
      "totalBalance": 0,
      "admin": true,
      "accountNumber": "99000001",
      "accountNumberAsInt": 99000001,
      "username": "admin0"
    },
    "11000006": {
      "pin": "12345",
      "totalBalance": 999,
      "admin": false,
      "accountNumber": "11000006",
      "accountNumberAsInt": 11000006,
      "username": "Mike"
    },
    "11000007": {
      "pin": "12345",
      "totalBalance": 2000,
      "admin": false,
      "accountNumber": "11000007",
      "accountNumberAsInt": 11000007,
      "username": "Paula"
    },
    "99000003": {
      "pin": "67890",
      "totalBalance": 0,
      "admin": true,
      "accountNumber": "99000003",
      "accountNumberAsInt": 99000003,
      "username": "Marco"
    },
    "11000004": {
      "pin": "55555",
      "totalBalance": 1000,
      "admin": false,
      "accountNumber": "11000004",
      "accountNumberAsInt": 11000004,
      "username": "Gertrude"
    },
    "99000002": {
      "pin": "67890",
      "totalBalance": 0,
      "admin": true,
      "accountNumber": "99000002",
      "accountNumberAsInt": 99000002,
      "username": "Elijah"
    },
    "11000005": {
      "pin": "22222",
      "totalBalance": 1000,
      "admin": false,
      "accountNumber": "11000005",
      "accountNumberAsInt": 11000005,
      "username": "Hildegard"
    },
    "11000002": {
      "pin": "11111",
      "totalBalance": 1000,
      "admin": false,
      "accountNumber": "11000002",
      "accountNumberAsInt": 11000002,
      "username": "Robert"
    },
    "99000004": {
      "pin": "67890",
      "totalBalance": 0,
      "admin": true,
      "accountNumber": "99000004",
      "accountNumberAsInt": 99000004,
      "username": "Simon"
    },
    "11000003": {
      "pin": "12345",
      "totalBalance": 10000,
      "admin": false,
      "accountNumber": "11000003",
      "accountNumberAsInt": 11000003,
      "username": "Olaf"
    },
    "11000001": {
      "pin": "12345",
      "totalBalance": 1211.0299999999997,
      "admin": false,
      "accountNumber": "11000001",
      "accountNumberAsInt": 11000001,
      "username": "Ferdinand"
    }
  }
}